<svg width="45" height="46" viewBox="0 0 45 46" fill="none" xmlns="http://www.w3.org/2000/svg">
<path d="M15 41.2512C14.0138 41.2512 13.0481 40.85 12.3488 40.1525L1.09875 28.9025C0.40125 28.2031 0 27.2375 0 26.2512C0 25.265 0.40125 24.2993 1.09875 23.6L17.9738 6.72497C18.6731 6.02747 19.6388 5.62622 20.625 5.62622H31.875C32.1169 5.62622 32.3456 5.65435 32.5706 5.7106C34.2769 5.97122 35.625 7.55372 35.625 9.37622V20.6262C35.625 21.6125 35.2237 22.5781 34.5262 23.2775L17.6512 40.1525C16.9519 40.85 15.9862 41.2512 15 41.2512ZM20.625 7.50122C20.1319 7.50122 19.65 7.70185 19.2994 8.0506L2.42438 24.9256C2.07562 25.2762 1.875 25.7581 1.875 26.2512C1.875 26.7443 2.07562 27.2262 2.42438 27.5768L13.6744 38.8268C14.3738 39.5262 15.6244 39.5262 16.3238 38.8268L33.1987 21.9518C33.5494 21.6012 33.75 21.1193 33.75 20.6262V9.37622C33.75 8.4706 33.0844 7.6831 32.1994 7.54622C32.0381 7.50872 31.965 7.50122 31.875 7.50122H20.625Z" fill="#900B7B"/>
<path d="M41.1188 45.0012H24.5063C23.4844 45.0012 22.4888 44.6056 21.7725 43.9118C21.0431 43.2068 20.625 42.2356 20.625 41.2512V34.9137C20.625 34.6643 20.7244 34.4262 20.8988 34.25L33.1987 21.95C33.5494 21.6012 33.75 21.1193 33.75 20.6262V9.37622C33.75 8.4706 33.0844 7.6831 32.1994 7.54622C31.7475 7.47497 31.4138 7.0906 31.4063 6.63497C31.3988 6.17935 31.7213 5.78185 32.1713 5.69747C33.39 5.47247 34.6575 5.85122 35.5463 6.7156L43.8488 14.6806C44.5819 15.3893 45 16.3606 45 17.345V41.2512C45 42.2356 44.5819 43.2068 43.8525 43.9118C43.1363 44.6056 42.1406 45.0012 41.1188 45.0012ZM22.5 35.3018V41.2512C22.5 41.7312 22.71 42.2112 23.0775 42.5656C23.445 42.9219 23.9662 43.1262 24.5063 43.1262H41.1188C41.6588 43.1262 42.1781 42.9219 42.5475 42.5656C42.915 42.2112 43.125 41.7312 43.125 41.2512V17.345C43.125 16.865 42.915 16.385 42.5475 16.0306L35.625 9.38935V20.6262C35.625 21.6125 35.2237 22.5781 34.5262 23.2775L22.5 35.3018Z" fill="#900B7B"/>
<path d="M29.0625 15.0012C27.5119 15.0012 26.25 13.7393 26.25 12.1887C26.25 10.6381 27.5119 9.37622 29.0625 9.37622C30.6131 9.37622 31.875 10.6381 31.875 12.1887C31.875 13.7393 30.6131 15.0012 29.0625 15.0012ZM29.0625 11.2512C28.545 11.2512 28.125 11.6712 28.125 12.1887C28.125 12.7062 28.545 13.1262 29.0625 13.1262C29.58 13.1262 30 12.7062 30 12.1887C30 11.6712 29.58 11.2512 29.0625 11.2512Z" fill="#900B7B"/>
<path d="M40.3125 13.1262C39.795 13.1262 39.375 12.7062 39.375 12.1887V6.56372C39.375 3.97997 37.2713 1.87622 34.6875 1.87622C32.1037 1.87622 30 3.97997 30 6.56372V10.3137C30 10.8312 29.58 11.2512 29.0625 11.2512C28.545 11.2512 28.125 10.8312 28.125 10.3137V6.56372C28.125 2.94497 31.0688 0.0012207 34.6875 0.0012207C38.3063 0.0012207 41.25 2.94497 41.25 6.56372V12.1887C41.25 12.7062 40.83 13.1262 40.3125 13.1262Z" fill="#900B7B"/>
</svg>
