<svg width="16" height="19" viewBox="0 0 16 19" fill="none" xmlns="http://www.w3.org/2000/svg">
<path d="M4 4.95307C4 7.1363 5.79086 8.90615 8 8.90615C10.2091 8.90615 12 7.1363 12 4.95307C12 2.76985 10.2091 1 8 1C5.79086 1 4 2.76985 4 4.95307Z" stroke="#900B7B" stroke-width="1.5"/>
<path d="M1 14.7712C1 13.9209 1.54085 13.1625 2.35109 12.8765C6.00404 11.5872 9.99596 11.5872 13.6489 12.8765C14.4591 13.1625 15 13.9209 15 14.7712V16.0713C15 17.2448 13.9483 18.1462 12.7728 17.9803L11.8184 17.8455C9.28565 17.4879 6.71435 17.4879 4.18162 17.8455L3.22721 17.9803C2.0517 18.1462 1 17.2448 1 16.0713V14.7712Z" stroke="#900B7B" stroke-width="1.5"/>
</svg>
