<svg width="21" height="18" viewBox="0 0 21 18" fill="none" xmlns="http://www.w3.org/2000/svg">
<path d="M20.9705 10.1853C20.9705 10.1852 20.9705 10.1852 20.9704 10.1851L17.0056 0.259175C16.9214 0.0482759 16.6816 -0.054682 16.4701 0.0292154C16.47 0.0292667 16.4698 0.0293181 16.4697 0.0294209L0.384616 6.41528C0.319019 6.44354 0.262131 6.48864 0.219722 6.54598C0.0859512 6.61529 0.00144283 6.75246 0 6.90274V17.589C0 17.816 0.184579 18 0.412236 18H17.7261C17.9538 18 18.1384 17.816 18.1384 17.589V11.7527L20.7404 10.7194C20.9519 10.6353 21.0549 10.3962 20.9705 10.1853ZM17.3139 17.178H0.824472V7.31375H17.3139V17.178ZM6.87816 6.49378L13.7806 3.75153C14.3967 4.39712 15.2503 4.76405 16.144 4.76754L16.8324 6.49378H6.87816ZM18.1384 10.8698V6.90274C18.1384 6.67576 17.9538 6.49173 17.7261 6.49173H17.7196L16.846 4.30433C16.8363 4.28609 16.8251 4.26873 16.8122 4.25255C16.768 4.05459 16.5841 3.91953 16.3814 3.93607C15.5498 4.01164 14.7364 3.66239 14.2201 3.00801C14.0916 2.84992 13.8658 2.81062 13.6912 2.91594C13.6716 2.91825 13.6522 2.92185 13.6331 2.92663L5.20613 6.27225C5.10415 6.31212 5.02258 6.39118 4.97981 6.49173H2.42065L16.3922 0.945151L20.0524 10.1086L18.1384 10.8698Z" fill="#C59900"/>
<path d="M1.94328 14.4033C2.74364 14.6391 3.36993 15.2628 3.60748 16.0604C3.65957 16.2346 3.82019 16.3539 4.0024 16.3539C4.02378 16.3526 4.04501 16.3494 4.06588 16.3445C4.08438 16.3497 4.10329 16.3535 4.12236 16.356H14.016C14.033 16.3538 14.0498 16.3503 14.0663 16.3457C14.2723 16.3956 14.4798 16.2697 14.53 16.0644C14.5301 16.0636 14.5303 16.0629 14.5305 16.0621C14.7674 15.2636 15.3938 14.6391 16.1947 14.4028C16.3889 14.3437 16.5096 14.1507 16.4775 13.9507C16.483 13.9308 16.487 13.9105 16.4894 13.8899V10.6018C16.487 10.5812 16.4829 10.5609 16.4771 10.541C16.5094 10.341 16.3886 10.1479 16.1943 10.0889C15.3934 9.85271 14.7672 9.22792 14.5309 8.42923C14.4712 8.23425 14.2758 8.11362 14.0741 8.14727C14.0551 8.14198 14.0357 8.13813 14.016 8.13577H4.12236C4.10159 8.13823 4.08103 8.14234 4.06094 8.1481C3.86044 8.11624 3.66699 8.23651 3.60748 8.43005C3.37039 9.22838 2.74405 9.85271 1.94328 10.0889C1.74907 10.1481 1.62838 10.341 1.66049 10.541C1.65513 10.561 1.65126 10.5813 1.64894 10.6018V13.8899C1.65131 13.9092 1.65518 13.9283 1.66049 13.947C1.62668 14.1483 1.74762 14.3434 1.94328 14.4033ZM2.47342 10.7687C3.30119 10.4372 3.95726 9.78309 4.28973 8.95779H13.8482C14.1809 9.78309 14.8371 10.4372 15.665 10.7687V13.723C14.8375 14.0549 14.1815 14.7089 13.8487 15.5339H4.28973C3.9569 14.7089 3.30093 14.0549 2.47342 13.723V10.7687Z" fill="#C59900"/>
<path d="M9.06919 14.7119C10.4352 14.7119 11.5426 13.6078 11.5426 12.2459C11.5426 10.8839 10.4352 9.77981 9.06919 9.77981C7.70314 9.77981 6.59578 10.8839 6.59578 12.2459C6.59712 13.6073 7.70371 14.7106 9.06919 14.7119ZM9.06919 10.6018C9.97987 10.6018 10.7181 11.3379 10.7181 12.2459C10.7181 13.1538 9.97987 13.8899 9.06919 13.8899C8.15851 13.8899 7.42025 13.1538 7.42025 12.2459C7.42025 11.3379 8.15851 10.6018 9.06919 10.6018Z" fill="#C59900"/>
<path d="M4.5346 12.8624C4.87608 12.8624 5.15295 12.5863 5.15295 12.2459C5.15295 11.9054 4.87608 11.6293 4.5346 11.6293C4.19311 11.6293 3.91624 11.9054 3.91624 12.2459C3.91624 12.5864 4.19311 12.8624 4.5346 12.8624ZM4.5346 12.0404C4.64842 12.0404 4.74071 12.1324 4.74071 12.2459C4.74071 12.3594 4.64842 12.4514 4.5346 12.4514C4.42077 12.4514 4.32848 12.3594 4.32848 12.2459C4.32848 12.1324 4.42077 12.0404 4.5346 12.0404Z" fill="#C59900"/>
<path d="M13.6038 12.8624C13.9453 12.8624 14.2221 12.5863 14.2221 12.2459C14.2221 11.9054 13.9453 11.6293 13.6038 11.6293C13.2623 11.6293 12.9854 11.9054 12.9854 12.2459C12.9854 12.5864 13.2623 12.8624 13.6038 12.8624ZM13.6038 12.0404C13.7176 12.0404 13.8099 12.1324 13.8099 12.2459C13.8099 12.3594 13.7176 12.4514 13.6038 12.4514C13.49 12.4514 13.3977 12.3594 13.3977 12.2459C13.3977 12.1324 13.49 12.0404 13.6038 12.0404Z" fill="#C59900"/>
</svg>
