<svg viewBox="0 0 65 65" xmlns="http://www.w3.org/2000/svg">
<path d="M63.604 44.4336H28.7583L38.4849 11.7952C38.5135 11.6994 38.5229 11.5988 38.5126 11.4993C38.5023 11.3998 38.4725 11.3033 38.4249 11.2153C38.3774 11.1273 38.3129 11.0496 38.2353 10.9865C38.1577 10.9234 38.0684 10.8762 37.9725 10.8477L23.3983 6.5046C23.3024 6.47603 23.2019 6.46661 23.1024 6.4769C23.0029 6.48718 22.9064 6.51696 22.8184 6.56454C22.7304 6.61212 22.6526 6.67657 22.5896 6.7542C22.5265 6.83183 22.4793 6.92112 22.4507 7.01699L19.4659 17.0336L17.0899 4.41165C17.0714 4.31335 17.0337 4.21965 16.9789 4.13591C16.9242 4.05218 16.8535 3.98004 16.7709 3.92361C16.6883 3.86719 16.5954 3.8276 16.4975 3.80708C16.3996 3.78657 16.2986 3.78554 16.2003 3.80406L1.25602 6.6181C1.15767 6.63655 1.06391 6.6742 0.980118 6.7289C0.896323 6.7836 0.824127 6.85428 0.767654 6.93689C0.711182 7.0195 0.67154 7.11242 0.650994 7.21036C0.630448 7.3083 0.629401 7.40932 0.647912 7.50766L9.08902 52.3357L9.15339 52.323C9.09374 53.5932 9.39188 54.8547 10.0139 55.9638C10.6359 57.0729 11.5567 57.9851 12.6716 58.5966C13.3062 59.4036 14.1153 60.0564 15.0383 60.5058C15.9612 60.9552 16.9741 61.1896 18.0006 61.1914H63.604C63.703 61.1934 63.8015 61.1757 63.8937 61.1392C63.9858 61.1028 64.0698 61.0483 64.1407 60.9791C64.2116 60.9098 64.268 60.8272 64.3066 60.7359C64.3453 60.6446 64.3653 60.5466 64.3657 60.4475V45.2404C64.3673 45.0337 64.2889 44.8343 64.147 44.6839C64.005 44.5336 63.8105 44.4439 63.604 44.4336ZM25.8284 48.9312L12.7142 45.0231L16.3232 32.9129L29.4375 36.8209L25.8284 48.9312ZM23.6938 8.18216L36.8075 12.0902L33.9166 21.7906L20.8024 17.8827L23.6938 8.18216ZM20.3677 19.3426L33.4819 23.2506L29.8725 35.3609L16.7583 31.4529L20.3677 19.3426ZM2.2865 7.97421L15.7338 5.44213L17.6068 15.3895L4.15956 17.9216L2.2865 7.97421ZM4.4414 19.4188L17.8888 16.8867L18.5166 20.2206L15.5466 30.1864L6.77987 31.8368L4.4414 19.4188ZM7.06184 33.3342L15.0571 31.8287L10.9974 45.4518L9.40019 45.7525L7.06184 33.3342ZM9.98392 48.8525L9.68202 47.2497L10.5079 47.0942L9.98392 48.8525ZM22.852 59.668H21.8945C22.2283 59.508 22.5485 59.3212 22.852 59.1094V59.668ZM24.0007 55.064C23.8042 55.7244 23.4794 56.3395 23.0451 56.8743C22.6107 57.4091 22.0753 57.853 21.4693 58.1808C20.8633 58.5085 20.1986 58.7137 19.5133 58.7845C18.828 58.8552 18.1355 58.7903 17.4753 58.5933L14.4169 57.6818C13.0845 57.2831 11.9647 56.3721 11.303 55.1488C10.6414 53.9255 10.492 52.4897 10.8876 51.1564L12.2801 46.4834L25.3944 50.3915L24.0018 55.0644L24.0007 55.064ZM37.0708 59.668H24.3755V57.6437C24.8629 56.9997 25.2305 56.2733 25.4606 55.4991L28.3043 45.9571H37.0708V59.668ZM51.1626 59.668H38.5942V45.9571H51.1626V59.668ZM62.8422 59.668H52.686V45.9571H62.8422V59.668Z" />
<path d="M18.1689 50.6752C17.5344 50.4938 16.8541 50.5699 16.2754 50.887C15.6967 51.2041 15.2665 51.7366 15.078 52.369C14.8896 53.0014 14.9581 53.6825 15.2688 54.2647C15.5794 54.8468 16.1071 55.283 16.7373 55.4785C17.0526 55.5733 17.3836 55.6046 17.7111 55.5707C18.0386 55.5369 18.3561 55.4384 18.6453 55.2811C19.0813 55.0453 19.4376 54.6855 19.6691 54.2472C19.9007 53.809 19.997 53.3119 19.946 52.8188C19.895 52.3258 19.699 51.8589 19.3826 51.4773C19.0663 51.0957 18.6439 50.8165 18.1689 50.6749V50.6752ZM18.395 53.3575C18.3428 53.5319 18.2432 53.6884 18.1072 53.8095C17.9713 53.9306 17.8044 54.0116 17.6251 54.0433C17.4458 54.0751 17.2613 54.0564 17.092 53.9893C16.9227 53.9223 16.7754 53.8095 16.6665 53.6636C16.5576 53.5177 16.4914 53.3444 16.4753 53.163C16.4592 52.9817 16.4937 52.7994 16.5752 52.6366C16.6566 52.4738 16.7817 52.3368 16.9365 52.2409C17.0913 52.145 17.2696 52.094 17.4517 52.0936C17.5472 52.0938 17.6423 52.1078 17.7338 52.1352C17.9835 52.2096 18.1935 52.3802 18.3175 52.6094C18.4415 52.8386 18.4693 53.1077 18.395 53.3575Z"/>
</svg>
