<svg width="56" height="56" viewBox="0 0 56 56" fill="none" xmlns="http://www.w3.org/2000/svg">
<path d="M50.656 6.23584H46.1248V4.42334C46.1248 3.46193 45.7428 2.5399 45.063 1.86008C44.3832 1.18026 43.4612 0.79834 42.4998 0.79834C41.5383 0.79834 40.6163 1.18026 39.9365 1.86008C39.2567 2.5399 38.8748 3.46193 38.8748 4.42334V6.23584H31.6248V4.42334C31.6248 3.46193 31.2428 2.5399 30.563 1.86008C29.8832 1.18026 28.9612 0.79834 27.9998 0.79834C27.0383 0.79834 26.1163 1.18026 25.4365 1.86008C24.7567 2.5399 24.3748 3.46193 24.3748 4.42334V6.23584H17.1248V4.42334C17.1248 3.46193 16.7428 2.5399 16.063 1.86008C15.3832 1.18026 14.4612 0.79834 13.4998 0.79834C12.5383 0.79834 11.6163 1.18026 10.9365 1.86008C10.2567 2.5399 9.87476 3.46193 9.87476 4.42334V6.23584H5.34351C4.14174 6.23584 2.9892 6.71324 2.13943 7.56301C1.28965 8.41279 0.812256 9.56533 0.812256 10.7671V47.0171C0.812256 48.2189 1.28965 49.3714 2.13943 50.2212C2.9892 51.0709 4.14174 51.5483 5.34351 51.5483H30.7185C30.9589 51.5483 31.1894 51.4529 31.3593 51.2829C31.5293 51.1129 31.6248 50.8824 31.6248 50.6421C31.6248 50.4017 31.5293 50.1712 31.3593 50.0013C31.1894 49.8313 30.9589 49.7358 30.7185 49.7358H5.34351C4.62311 49.7337 3.93284 49.4466 3.42344 48.9372C2.91404 48.4278 2.62691 47.7375 2.62476 47.0171V18.9233H53.3748V34.3296C53.3748 34.5699 53.4702 34.8004 53.6402 34.9704C53.8101 35.1404 54.0407 35.2358 54.281 35.2358C54.5214 35.2358 54.7519 35.1404 54.9218 34.9704C55.0918 34.8004 55.1873 34.5699 55.1873 34.3296V10.7671C55.1873 9.56533 54.7099 8.41279 53.8601 7.56301C53.0103 6.71324 51.8578 6.23584 50.656 6.23584ZM40.6873 4.42334C40.6873 3.94264 40.8782 3.48162 41.2181 3.14171C41.558 2.8018 42.0191 2.61084 42.4998 2.61084C42.9805 2.61084 43.4415 2.8018 43.7814 3.14171C44.1213 3.48162 44.3123 3.94264 44.3123 4.42334V9.86084C44.3123 10.3415 44.1213 10.8026 43.7814 11.1425C43.4415 11.4824 42.9805 11.6733 42.4998 11.6733C42.0191 11.6733 41.558 11.4824 41.2181 11.1425C40.8782 10.8026 40.6873 10.3415 40.6873 9.86084V4.42334ZM26.1873 4.42334C26.1873 3.94264 26.3782 3.48162 26.7181 3.14171C27.058 2.8018 27.5191 2.61084 27.9998 2.61084C28.4805 2.61084 28.9415 2.8018 29.2814 3.14171C29.6213 3.48162 29.8123 3.94264 29.8123 4.42334V9.86084C29.8123 10.3415 29.6213 10.8026 29.2814 11.1425C28.9415 11.4824 28.4805 11.6733 27.9998 11.6733C27.5191 11.6733 27.058 11.4824 26.7181 11.1425C26.3782 10.8026 26.1873 10.3415 26.1873 9.86084V4.42334ZM11.6873 4.42334C11.6873 3.94264 11.8782 3.48162 12.2181 3.14171C12.558 2.8018 13.0191 2.61084 13.4998 2.61084C13.9805 2.61084 14.4415 2.8018 14.7814 3.14171C15.1213 3.48162 15.3123 3.94264 15.3123 4.42334V9.86084C15.3123 10.3415 15.1213 10.8026 14.7814 11.1425C14.4415 11.4824 13.9805 11.6733 13.4998 11.6733C13.0191 11.6733 12.558 11.4824 12.2181 11.1425C11.8782 10.8026 11.6873 10.3415 11.6873 9.86084V4.42334ZM53.3748 17.1108H2.62476V10.7671C2.62691 10.0467 2.91404 9.35642 3.42344 8.84702C3.93284 8.33762 4.62311 8.05049 5.34351 8.04834H9.87476V9.86084C9.87476 10.8222 10.2567 11.7443 10.9365 12.4241C11.6163 13.1039 12.5383 13.4858 13.4998 13.4858C14.4612 13.4858 15.3832 13.1039 16.063 12.4241C16.7428 11.7443 17.1248 10.8222 17.1248 9.86084V8.04834H24.3748V9.86084C24.3748 10.8222 24.7567 11.7443 25.4365 12.4241C26.1163 13.1039 27.0383 13.4858 27.9998 13.4858C28.9612 13.4858 29.8832 13.1039 30.563 12.4241C31.2428 11.7443 31.6248 10.8222 31.6248 9.86084V8.04834H38.8748V9.86084C38.8748 10.8222 39.2567 11.7443 39.9365 12.4241C40.6163 13.1039 41.5383 13.4858 42.4998 13.4858C43.4612 13.4858 44.3832 13.1039 45.063 12.4241C45.7428 11.7443 46.1248 10.8222 46.1248 9.86084V8.04834H50.656C51.3764 8.05049 52.0667 8.33762 52.5761 8.84702C53.0855 9.35642 53.3726 10.0467 53.3748 10.7671V17.1108Z" fill="#900B7B"/>
<path d="M26.1873 25.2671C26.1873 24.7864 25.9963 24.3254 25.6564 23.9855C25.3165 23.6455 24.8555 23.4546 24.3748 23.4546H20.7498C20.2691 23.4546 19.808 23.6455 19.4681 23.9855C19.1282 24.3254 18.9373 24.7864 18.9373 25.2671V27.9858C18.9373 28.4665 19.1282 28.9276 19.4681 29.2675C19.808 29.6074 20.2691 29.7983 20.7498 29.7983H24.3748C24.8555 29.7983 25.3165 29.6074 25.6564 29.2675C25.9963 28.9276 26.1873 28.4665 26.1873 27.9858V25.2671ZM20.7498 27.9858V25.2671H24.3748V27.9858H20.7498Z" fill="#900B7B"/>
<path d="M15.3123 25.2671C15.3123 24.7864 15.1213 24.3254 14.7814 23.9855C14.4415 23.6455 13.9805 23.4546 13.4998 23.4546H9.87476C9.39405 23.4546 8.93303 23.6455 8.59313 23.9855C8.25322 24.3254 8.06226 24.7864 8.06226 25.2671V27.9858C8.06226 28.4665 8.25322 28.9276 8.59313 29.2675C8.93303 29.6074 9.39405 29.7983 9.87476 29.7983H13.4998C13.9805 29.7983 14.4415 29.6074 14.7814 29.2675C15.1213 28.9276 15.3123 28.4665 15.3123 27.9858V25.2671ZM9.87476 27.9858V25.2671H13.4998V27.9858H9.87476Z" fill="#900B7B"/>
<path d="M46.1248 29.7983C46.6055 29.7983 47.0665 29.6074 47.4064 29.2675C47.7463 28.9276 47.9373 28.4665 47.9373 27.9858V25.2671C47.9373 24.7864 47.7463 24.3254 47.4064 23.9855C47.0665 23.6455 46.6055 23.4546 46.1248 23.4546H42.4998C42.0191 23.4546 41.558 23.6455 41.2181 23.9855C40.8782 24.3254 40.6873 24.7864 40.6873 25.2671V27.9858C40.6873 28.4665 40.8782 28.9276 41.2181 29.2675C41.558 29.6074 42.0191 29.7983 42.4998 29.7983H46.1248ZM42.4998 25.2671H46.1248V27.9858H42.4998V25.2671Z" fill="#900B7B"/>
<path d="M26.1873 33.4233C26.1873 32.9426 25.9963 32.4816 25.6564 32.1417C25.3165 31.8018 24.8555 31.6108 24.3748 31.6108H20.7498C20.2691 31.6108 19.808 31.8018 19.4681 32.1417C19.1282 32.4816 18.9373 32.9426 18.9373 33.4233V36.1421C18.9373 36.6228 19.1282 37.0838 19.4681 37.4237C19.808 37.7636 20.2691 37.9546 20.7498 37.9546H24.3748C24.8555 37.9546 25.3165 37.7636 25.6564 37.4237C25.9963 37.0838 26.1873 36.6228 26.1873 36.1421V33.4233ZM20.7498 36.1421V33.4233H24.3748V36.1421H20.7498Z" fill="#900B7B"/>
<path d="M15.3123 33.4233C15.3123 32.9426 15.1213 32.4816 14.7814 32.1417C14.4415 31.8018 13.9805 31.6108 13.4998 31.6108H9.87476C9.39405 31.6108 8.93303 31.8018 8.59313 32.1417C8.25322 32.4816 8.06226 32.9426 8.06226 33.4233V36.1421C8.06226 36.6228 8.25322 37.0838 8.59313 37.4237C8.93303 37.7636 9.39405 37.9546 9.87476 37.9546H13.4998C13.9805 37.9546 14.4415 37.7636 14.7814 37.4237C15.1213 37.0838 15.3123 36.6228 15.3123 36.1421V33.4233ZM9.87476 36.1421V33.4233H13.4998V36.1421H9.87476Z" fill="#900B7B"/>
<path d="M24.3748 39.7671H20.7498C20.2691 39.7671 19.808 39.958 19.4681 40.298C19.1282 40.6379 18.9373 41.0989 18.9373 41.5796V44.2983C18.9373 44.779 19.1282 45.2401 19.4681 45.58C19.808 45.9199 20.2691 46.1108 20.7498 46.1108H24.3748C24.8555 46.1108 25.3165 45.9199 25.6564 45.58C25.9963 45.2401 26.1873 44.779 26.1873 44.2983V41.5796C26.1873 41.0989 25.9963 40.6379 25.6564 40.298C25.3165 39.958 24.8555 39.7671 24.3748 39.7671ZM20.7498 44.2983V41.5796H24.3748V44.2983H20.7498Z" fill="#900B7B"/>
<path d="M31.6248 29.7983H35.2498C35.7305 29.7983 36.1915 29.6074 36.5314 29.2675C36.8713 28.9276 37.0623 28.4665 37.0623 27.9858V25.2671C37.0623 24.7864 36.8713 24.3254 36.5314 23.9855C36.1915 23.6455 35.7305 23.4546 35.2498 23.4546H31.6248C31.1441 23.4546 30.683 23.6455 30.3431 23.9855C30.0032 24.3254 29.8123 24.7864 29.8123 25.2671V27.9858C29.8123 28.4665 30.0032 28.9276 30.3431 29.2675C30.683 29.6074 31.1441 29.7983 31.6248 29.7983ZM31.6248 25.2671H35.2498V27.9858H31.6248V25.2671Z" fill="#900B7B"/>
<path d="M29.8123 36.1421C29.8123 36.6228 30.0032 37.0838 30.3431 37.4237C30.683 37.7636 31.1441 37.9546 31.6248 37.9546C31.8651 37.9546 32.0956 37.8591 32.2656 37.6892C32.4355 37.5192 32.531 37.2887 32.531 37.0483C32.531 36.808 32.4355 36.5775 32.2656 36.4075C32.0956 36.2376 31.8651 36.1421 31.6248 36.1421V33.4233H35.2498C35.4901 33.4233 35.7206 33.3279 35.8906 33.1579C36.0605 32.9879 36.156 32.7574 36.156 32.5171C36.156 32.2767 36.0605 32.0462 35.8906 31.8763C35.7206 31.7063 35.4901 31.6108 35.2498 31.6108H31.6248C31.1441 31.6108 30.683 31.8018 30.3431 32.1417C30.0032 32.4816 29.8123 32.9426 29.8123 33.4233V36.1421Z" fill="#900B7B"/>
<path d="M13.4998 39.7671H9.87476C9.39405 39.7671 8.93303 39.958 8.59313 40.298C8.25322 40.6379 8.06226 41.0989 8.06226 41.5796V44.2983C8.06226 44.779 8.25322 45.2401 8.59313 45.58C8.93303 45.9199 9.39405 46.1108 9.87476 46.1108H13.4998C13.9805 46.1108 14.4415 45.9199 14.7814 45.58C15.1213 45.2401 15.3123 44.779 15.3123 44.2983V41.5796C15.3123 41.0989 15.1213 40.6379 14.7814 40.298C14.4415 39.958 13.9805 39.7671 13.4998 39.7671ZM9.87476 44.2983V41.5796H13.4998V44.2983H9.87476Z" fill="#900B7B"/>
<path d="M43.406 31.6108C41.0759 31.6108 38.7981 32.3018 36.8607 33.5963C34.9233 34.8909 33.4132 36.7309 32.5215 38.8836C31.6299 41.0363 31.3965 43.4052 31.8511 45.6905C32.3057 47.9758 33.4278 50.0751 35.0754 51.7227C36.723 53.3703 38.8223 54.4924 41.1076 54.947C43.3929 55.4016 45.7618 55.1682 47.9145 54.2765C50.0672 53.3849 51.9072 51.8748 53.2018 49.9374C54.4963 48 55.1873 45.7222 55.1873 43.3921C55.1837 40.2686 53.9413 37.2741 51.7326 35.0655C49.524 32.8568 46.5295 31.6144 43.406 31.6108ZM43.406 53.3608C41.4344 53.3608 39.507 52.7762 37.8677 51.6808C36.2283 50.5854 34.9506 49.0285 34.1961 47.207C33.4416 45.3854 33.2442 43.381 33.6288 41.4473C34.0134 39.5135 34.9629 37.7373 36.357 36.3431C37.7512 34.949 39.5275 33.9995 41.4612 33.6149C43.3949 33.2302 45.3993 33.4277 47.2209 34.1822C49.0424 34.9367 50.5993 36.2144 51.6947 37.8538C52.7901 39.4931 53.3748 41.4205 53.3748 43.3921C53.3716 46.035 52.3204 48.5688 50.4515 50.4376C48.5827 52.3064 46.0489 53.3577 43.406 53.3608Z" fill="#900B7B"/>
<path d="M48.6423 39.5931L41.5935 46.6419L38.3899 43.4374C38.219 43.2723 37.9901 43.181 37.7525 43.183C37.5148 43.1851 37.2875 43.2804 37.1195 43.4484C36.9515 43.6165 36.8562 43.8438 36.8541 44.0814C36.852 44.319 36.9434 44.5479 37.1085 44.7188L40.9528 48.5641C41.1227 48.734 41.3532 48.8294 41.5935 48.8294C41.8338 48.8294 42.0643 48.734 42.2342 48.5641L49.9238 40.8745C50.0888 40.7036 50.1802 40.4747 50.1781 40.2371C50.1761 39.9995 50.0807 39.7722 49.9127 39.6041C49.7447 39.4361 49.5174 39.3408 49.2798 39.3387C49.0422 39.3367 48.8132 39.428 48.6423 39.5931Z" fill="#900B7B"/>
</svg>
