<svg width="55" height="55" viewBox="0 0 55 55" fill="none" xmlns="http://www.w3.org/2000/svg">
<path d="M50.8449 48.2528L42.4413 33.7004L44.6596 32.8797C45.7499 32.479 46.359 31.365 46.1098 30.2296L45.2988 26.5643C45.2569 26.3763 45.2945 26.2195 45.4158 26.0723L48.1905 22.738C48.9318 21.8453 48.9006 20.5766 48.1175 19.7194L45.5823 16.9501C45.4534 16.8094 45.4083 16.6536 45.4405 16.4624L46.1742 12.187C46.3676 11.0601 45.6908 9.95261 44.6016 9.60994L41.0266 8.48093C40.8397 8.42078 40.7258 8.31336 40.6581 8.12752L39.1542 4.06052C38.7578 2.98416 37.6181 2.36218 36.5041 2.61355L32.8453 3.42244C32.653 3.46326 32.4951 3.42566 32.3469 3.3032L29.0157 0.531715L29.0136 0.529567C28.1209 -0.206273 26.8523 -0.176195 25.994 0.604762L23.2311 3.1367C23.085 3.2699 22.9346 3.31502 22.7412 3.28064L18.4658 2.54695C17.3207 2.35144 16.2368 3.01316 15.8899 4.11853L14.7566 7.69998C14.6996 7.88152 14.5879 7.99861 14.4085 8.06629L10.3394 9.5659C9.24904 9.96658 8.63889 11.0816 8.88918 12.2181L9.70022 15.8844C9.74211 16.0703 9.70451 16.2261 9.58313 16.3732L6.81057 19.7087C6.07902 20.5852 6.1091 21.884 6.88146 22.7283L9.41662 25.4976C9.54553 25.6384 9.59064 25.792 9.55842 25.9821L8.82473 30.2575C8.62922 31.3994 9.28986 32.4843 10.3974 32.8367L12.6457 33.5468L4.1551 48.2528C3.98107 48.5547 4.00578 48.9306 4.2174 49.2067C4.42902 49.4828 4.78674 49.6042 5.12297 49.5139L11.7488 47.7361L13.5234 54.3619C13.6136 54.6981 13.8972 54.9463 14.242 54.9925C14.2796 54.9978 14.3172 55 14.3548 55C14.6588 55 14.9446 54.8388 15.0992 54.5703L23.5662 39.9051L25.9843 41.9149C26.4172 42.2748 26.9371 42.4531 27.456 42.4531C28.0113 42.4531 28.5646 42.249 29.0061 41.8419L31.3264 39.7181L39.9008 54.5703C40.0555 54.8388 40.3412 55 40.6452 55C40.6828 55 40.7204 54.9978 40.758 54.9925C41.1029 54.9473 41.3864 54.6981 41.4767 54.3619L43.2513 47.7361L49.8771 49.5139C50.2133 49.6042 50.571 49.4828 50.7826 49.2067C50.9943 48.9306 51.019 48.5547 50.8449 48.2528ZM14.6481 51.9105L13.1882 46.4599C13.1291 46.2397 12.9852 46.0517 12.7875 45.9379C12.5899 45.824 12.3546 45.7928 12.1344 45.8519L6.68381 47.3139L14.2678 34.1762C14.2957 34.2171 14.3194 34.2633 14.3398 34.3159L15.8437 38.3872C16.239 39.4582 17.3777 40.0791 18.4927 39.8331L22.0784 39.0414L14.6481 51.9105ZM27.8438 40.5743C27.63 40.7709 27.311 40.7784 27.0854 40.5915L23.7531 37.8221C23.331 37.4687 22.8282 37.2861 22.3029 37.2861C22.1332 37.2861 21.9603 37.3054 21.7884 37.3441L18.1221 38.1541C17.8385 38.2164 17.5592 38.0649 17.4582 37.791L15.9543 33.7197C15.7029 33.0365 15.183 32.5424 14.4923 32.3264L14.2023 32.2351C14.1969 32.233 14.1926 32.2319 14.1872 32.2308L10.9162 31.1985C10.6369 31.1094 10.4704 30.8365 10.5198 30.5497L11.2535 26.2721C11.3749 25.5556 11.1719 24.8671 10.6831 24.3364L8.15012 21.5692C7.95246 21.3533 7.94387 21.0353 8.13078 20.8119L10.9055 17.4732C11.3685 16.9136 11.5361 16.2164 11.3781 15.5117L10.5682 11.8497C10.5048 11.5639 10.6584 11.2825 10.9334 11.1815L15.0069 9.67869C15.6879 9.42302 16.181 8.9031 16.3947 8.21668L17.528 4.63738C17.6151 4.36023 17.8868 4.19373 18.1726 4.24422L22.4458 4.97791C23.1602 5.10252 23.8488 4.90056 24.3902 4.40857L27.153 1.87771C27.3733 1.67683 27.6869 1.66931 27.9168 1.85838L31.2512 4.63201C31.8076 5.09285 32.5037 5.2615 33.2159 5.10789L36.8822 4.29685C37.1637 4.23347 37.4419 4.38601 37.5429 4.65994L39.0457 8.72586C39.2949 9.40584 39.8127 9.90213 40.5077 10.1245L44.087 11.2546C44.3642 11.3416 44.5296 11.6123 44.4802 11.8991L43.7454 16.1777C43.6251 16.8964 43.8281 17.5849 44.3158 18.1156L46.8488 20.8828C47.0454 21.0976 47.054 21.4167 46.8682 21.6401L44.0924 24.9756C43.6294 25.5352 43.4608 26.2345 43.6197 26.9403L44.4297 30.6023C44.492 30.887 44.3395 31.1663 44.0645 31.2673L39.9975 32.7712C39.3164 33.0225 38.8212 33.5414 38.6042 34.2332L37.4752 37.8103C37.385 38.0928 37.1186 38.2561 36.8264 38.2056L32.5478 37.4709C32.0912 37.3946 31.6454 37.4505 31.2426 37.6288C31.2243 37.6363 31.2071 37.6449 31.1889 37.6535C30.9837 37.7512 30.7893 37.8801 30.6131 38.0413L27.8438 40.5743ZM42.8656 45.8519C42.6454 45.7928 42.4102 45.824 42.2125 45.9379C42.0149 46.0517 41.8709 46.2397 41.8118 46.4599L40.352 51.9105L33.0752 39.3056L36.5363 39.8997C37.6793 40.0952 38.7643 39.4345 39.1155 38.327L40.2456 34.7488C40.3026 34.5662 40.4132 34.4502 40.5947 34.3836L40.8064 34.3052L48.3173 47.3139L42.8656 45.8519ZM39.7182 21.2233C39.7182 14.4858 34.2375 9.00515 27.5 9.00515C20.7625 9.00515 15.2819 14.4858 15.2819 21.2233C15.2819 27.9619 20.7625 33.4447 27.5 33.4447C34.2375 33.4447 39.7182 27.9619 39.7182 21.2233ZM27.5 31.7238C21.7111 31.7238 17.0028 27.0134 17.0028 21.2233C17.0028 15.4344 21.7121 10.7261 27.5 10.7261C33.2879 10.7261 37.9973 15.4354 37.9973 21.2233C37.9973 27.0134 33.289 31.7238 27.5 31.7238ZM33.3094 17.484C33.6456 17.8202 33.6456 18.3648 33.3094 18.7L27.0456 24.9637C26.878 25.1313 26.6578 25.2162 26.4376 25.2162C26.2174 25.2162 25.9972 25.1324 25.8296 24.9637L21.6917 20.8259C21.3555 20.4896 21.3555 19.945 21.6917 19.6098C22.0279 19.2736 22.5726 19.2736 22.9088 19.6098L26.4387 23.1397L32.0945 17.484C32.4285 17.1488 32.9732 17.1488 33.3094 17.484Z" fill="white"/>
</svg>
