<svg width="65" height="65" viewBox="0 0 65 65" xmlns="http://www.w3.org/2000/svg">
<path d="M40.9333 36.8237C39.7033 36.8237 38.4955 36.6314 37.351 36.2531C36.7902 36.0619 36.1008 36.2373 35.7585 36.5889L33.4995 38.2942C30.8797 36.8957 29.2659 35.2825 27.8865 32.6823L29.5417 30.4822C29.9717 30.0527 30.1259 29.4254 29.9411 28.8368C29.5613 27.6863 29.3683 26.4791 29.3683 25.2486C29.3684 24.3596 28.6452 23.6364 27.7563 23.6364H24.0667C23.1777 23.6364 22.4545 24.3596 22.4545 25.2485C22.4545 35.4378 30.744 43.7273 40.9333 43.7273C41.8222 43.7273 42.5454 43.0041 42.5454 42.1151V38.4358C42.5454 37.547 41.8222 36.8237 40.9333 36.8237Z"/>
</svg>
