<svg width="65" height="65" viewBox="0 0 65 65" fill="none" xmlns="http://www.w3.org/2000/svg">
<g clip-path="url(#clip0_3024_2024)">
<path d="M24.6123 35.42C24.3598 35.42 24.1176 35.3197 23.939 35.1411C23.7605 34.9626 23.6602 34.7204 23.6602 34.4679V26.5181C23.6608 25.7607 23.962 25.0345 24.4975 24.499C25.0331 23.9635 25.7592 23.6623 26.5166 23.6616H56.0967C56.3492 23.6616 56.5914 23.7619 56.7699 23.9405C56.9485 24.1191 57.0488 24.3612 57.0488 24.6138C57.0488 24.8663 56.9485 25.1085 56.7699 25.287C56.5914 25.4656 56.3492 25.5659 56.0967 25.5659H26.5166C26.2641 25.5659 26.0219 25.6662 25.8433 25.8448C25.6648 26.0234 25.5645 26.2655 25.5645 26.5181V34.4717C25.5634 34.7235 25.4627 34.9647 25.2842 35.1425C25.1058 35.3202 24.8642 35.42 24.6123 35.42Z" fill="#1B1B20"/>
<path d="M16.7256 45.283C16.4731 45.283 16.2309 45.1827 16.0523 45.0041C15.8738 44.8256 15.7734 44.5834 15.7734 44.3309V36.376C15.7741 35.6186 16.0753 34.8924 16.6108 34.3569C17.1464 33.8214 17.8725 33.5202 18.6299 33.5195H48.21C48.4625 33.5195 48.7047 33.6198 48.8832 33.7984C49.0618 33.977 49.1621 34.2192 49.1621 34.4717C49.1621 34.7242 49.0618 34.9664 48.8832 35.145C48.7047 35.3235 48.4625 35.4238 48.21 35.4238H18.6299C18.3775 35.4242 18.1355 35.5246 17.957 35.7031C17.7785 35.8816 17.6781 36.1236 17.6777 36.376V44.3309C17.6777 44.4559 17.6531 44.5797 17.6053 44.6952C17.5574 44.8108 17.4873 44.9157 17.3989 45.0041C17.3104 45.0925 17.2055 45.1627 17.09 45.2105C16.9744 45.2584 16.8506 45.283 16.7256 45.283Z" fill="#1B1B20"/>
<path d="M8.83887 55.1406C8.58634 55.1406 8.34416 55.0403 8.1656 54.8617C7.98703 54.6832 7.88672 54.441 7.88672 54.1885V46.2349C7.88773 45.4776 8.189 44.7516 8.72447 44.2162C9.25993 43.6807 9.9859 43.3794 10.7432 43.3784H40.3232C40.5758 43.3784 40.818 43.4787 40.9965 43.6573C41.1751 43.8359 41.2754 44.078 41.2754 44.3306C41.2754 44.5831 41.1751 44.8253 40.9965 45.0038C40.818 45.1824 40.5758 45.2827 40.3232 45.2827H10.7432C10.4907 45.2831 10.2488 45.3835 10.0703 45.562C9.89177 45.7405 9.79135 45.9824 9.79102 46.2349V54.1885C9.79118 54.3136 9.76667 54.4374 9.71888 54.553C9.67109 54.6686 9.60096 54.7737 9.51251 54.8621C9.42406 54.9506 9.31903 55.0207 9.20344 55.0685C9.08784 55.1163 8.96395 55.1408 8.83887 55.1406Z" fill="#1B1B20"/>
<path d="M30.5284 65H0.952148C0.699623 65 0.45744 64.8997 0.278878 64.7211C0.100315 64.5425 0 64.3004 0 64.0478L0 56.093C0.00100768 55.3357 0.302277 54.6097 0.837746 54.0743C1.37322 53.5388 2.09918 53.2375 2.85645 53.2365H19.7914C20.5391 53.2366 20.0439 53.2365 19.7914 53.2365C19.9699 53.4151 19 53.7477 19 54.0002C19 54.2527 28.0433 54.4999 22 54.4999C21.8214 54.6785 20.7525 55.1408 20.5 55.1408H2.85645C2.60402 55.1411 2.36204 55.2416 2.18355 55.4201C2.00506 55.5985 1.90463 55.8405 1.9043 56.093V63.0957H30.5284C30.7809 63.0957 31.0231 63.196 31.2017 63.3746C31.3803 63.5531 31.4806 63.7953 31.4806 64.0478C31.4806 64.3004 31.3803 64.5425 31.2017 64.7211C31.0231 64.8997 30.7809 65 30.5284 65Z" fill="#1B1B20"/>
<path d="M32.4317 55.1406H18.1279C17.8754 55.1406 17.6332 55.0403 17.4547 54.8617C17.2761 54.6832 17.1758 54.441 17.1758 54.1885C17.1758 53.936 17.2761 53.6938 17.4547 53.5152C17.6332 53.3366 17.8754 53.2363 18.1279 53.2363H32.4317C32.6843 53.2363 32.9264 53.3366 33.105 53.5152C33.2836 53.6938 33.3839 53.936 33.3839 54.1885C33.3839 54.441 33.2836 54.6832 33.105 54.8617C32.9264 55.0403 32.6843 55.1406 32.4317 55.1406Z" fill="#1B1B20"/>
<path d="M64.0459 65.0001H30.5303C30.2777 65.0001 30.0356 64.8998 29.857 64.7212C29.6784 64.5427 29.5781 64.3005 29.5781 64.0479V56.0931C29.5791 55.3358 29.8804 54.6098 30.4159 54.0744C30.9513 53.5389 31.6773 53.2376 32.4346 53.2366H37.4645V46.2352C37.4655 45.4779 37.7667 44.7519 38.3022 44.2165C38.8377 43.681 39.5636 43.3797 40.3209 43.3787H45.3521V36.376C45.3531 35.6187 45.6543 34.8927 46.1898 34.3573C46.7253 33.8218 47.4512 33.5205 48.2085 33.5195H53.2384V32.462C53.2384 32.2095 53.3387 31.9673 53.5173 31.7887C53.6958 31.6102 53.938 31.5099 54.1905 31.5099C54.4431 31.5099 54.6852 31.6102 54.8638 31.7887C55.0424 31.9673 55.1427 32.2095 55.1427 32.462V34.4717C55.1427 34.7242 55.0424 34.9664 54.8638 35.145C54.6852 35.3235 54.4431 35.4238 54.1905 35.4238H48.2047C47.9523 35.4242 47.7103 35.5246 47.5318 35.7031C47.3533 35.8816 47.2529 36.1236 47.2525 36.376V44.3309C47.2525 44.5834 47.1522 44.8256 46.9737 45.0041C46.7951 45.1827 46.5529 45.283 46.3004 45.283H40.3171C40.0647 45.2833 39.8227 45.3838 39.6442 45.5623C39.4657 45.7407 39.3653 45.9827 39.3649 46.2352V54.1888C39.3651 54.3139 39.3406 54.4377 39.2928 54.5533C39.245 54.6689 39.1749 54.774 39.0864 54.8624C38.998 54.9509 38.893 55.021 38.7774 55.0688C38.6618 55.1166 38.5379 55.1411 38.4128 55.1409H32.4308C32.1783 55.1413 31.9364 55.2417 31.7579 55.4202C31.5794 55.5987 31.4789 55.8406 31.4786 56.0931V63.0958H63.0938V25.5659H56.091C55.8386 25.5663 55.5966 25.6667 55.4181 25.8452C55.2396 26.0237 55.1392 26.2656 55.1389 26.5181V28.0187C55.1389 28.2712 55.1766 32.8219 54.998 33.0005C54.8195 33.1791 54.4431 32.0005 54.1905 32.0005C53.938 32.0005 53.3061 36.8951 53.2384 33.8566C53.0598 33.6781 53.2346 28.2712 53.2346 28.0187V26.5181C53.2356 25.7608 53.5368 25.0348 54.0723 24.4994C54.6078 23.9639 55.3337 23.6626 56.091 23.6616H64.0459C64.2984 23.6616 64.5406 23.7619 64.7192 23.9405C64.8977 24.1191 64.998 24.3612 64.998 24.6138V64.0479C64.998 64.3005 64.8977 64.5427 64.7192 64.7212C64.5406 64.8998 64.2984 65.0001 64.0459 65.0001Z" fill="#1B1B20"/>
<path d="M46.9938 16.2769C46.6401 16.2769 46.2898 16.2072 45.963 16.0717C45.6363 15.9362 45.3394 15.7376 45.0895 15.4872L42.0211 12.4289C41.6248 12.0313 41.4023 11.4928 41.4023 10.9315C41.4023 10.3702 41.6248 9.83171 42.0211 9.43409L42.9326 8.52257C43.3299 8.12572 43.8684 7.90281 44.43 7.90281C44.9915 7.90281 45.5301 8.12572 45.9274 8.52257L46.9887 9.58516L50.6145 5.967C50.8111 5.7702 51.0445 5.61407 51.3014 5.50754C51.5584 5.40102 51.8338 5.34619 52.1119 5.34619C52.3901 5.34619 52.6655 5.40102 52.9224 5.50754C53.1794 5.61407 53.4128 5.7702 53.6093 5.967L54.5209 6.87852C54.9173 7.27576 55.14 7.81407 55.14 8.3753C55.14 8.93653 54.9173 9.47484 54.5209 9.87208L48.9032 15.4885C48.6526 15.7392 48.3549 15.938 48.0272 16.0733C47.6995 16.2085 47.3483 16.2777 46.9938 16.2769ZM44.4332 9.80733C44.4053 9.80708 44.3777 9.81246 44.3519 9.82315C44.3262 9.83384 44.3029 9.84962 44.2834 9.86954L43.3718 10.7811C43.352 10.8008 43.3362 10.8242 43.3255 10.85C43.3147 10.8758 43.3092 10.9035 43.3092 10.9315C43.3092 10.9595 43.3147 10.9872 43.3255 11.013C43.3362 11.0388 43.352 11.0622 43.3718 11.0819L46.4301 14.1402C46.504 14.2142 46.5916 14.2728 46.6881 14.3128C46.7846 14.3529 46.8881 14.3735 46.9925 14.3735C47.097 14.3735 47.2005 14.3529 47.297 14.3128C47.3935 14.2728 47.4811 14.2142 47.5549 14.1402L53.1726 8.52257C53.1925 8.50286 53.2082 8.47942 53.219 8.4536C53.2297 8.42778 53.2352 8.40009 53.2352 8.37213C53.2352 8.34416 53.2297 8.31647 53.219 8.29065C53.2082 8.26483 53.1925 8.24139 53.1726 8.22169L52.2611 7.31016C52.2415 7.29041 52.2181 7.27475 52.1924 7.26407C52.1667 7.25339 52.1391 7.24792 52.1113 7.24796C52.0833 7.24789 52.0555 7.25335 52.0296 7.26402C52.0036 7.2747 51.9801 7.29038 51.9602 7.31016L47.6667 11.605C47.5783 11.6934 47.4735 11.7636 47.358 11.8115C47.2426 11.8593 47.1188 11.884 46.9938 11.884C46.8688 11.884 46.7451 11.8593 46.6296 11.8115C46.5142 11.7636 46.4093 11.6934 46.321 11.605L44.5855 9.86954C44.5655 9.84954 44.5418 9.83374 44.5156 9.82305C44.4895 9.81237 44.4614 9.80702 44.4332 9.80733Z" fill="#900B7B"/>
<path d="M55.5948 21.6214H40.9546C40.029 21.6204 39.1416 21.2522 38.4871 20.5977C37.8325 19.9432 37.4644 19.0558 37.4634 18.1302V10.8113C37.4634 10.5588 37.5637 10.3166 37.7423 10.1381C37.9208 9.9595 38.163 9.85918 38.4155 9.85918C38.6681 9.85918 38.9103 9.9595 39.0888 10.1381C39.2674 10.3166 39.3677 10.5588 39.3677 10.8113V18.1302C39.3684 18.5508 39.5358 18.9541 39.8332 19.2516C40.1307 19.549 40.5339 19.7164 40.9546 19.7171H55.5948C56.0155 19.7164 56.4188 19.549 56.7162 19.2516C57.0137 18.9541 57.1811 18.5508 57.1818 18.1302V3.49121C57.1811 3.07054 57.0137 2.66729 56.7162 2.36983C56.4188 2.07238 56.0155 1.90497 55.5948 1.9043H40.9546C40.5339 1.90497 40.1307 2.07238 39.8332 2.36983C39.5358 2.66729 39.3684 3.07054 39.3677 3.49121V13C39.3677 13.2525 38.9131 14.4588 39.001 10.5C38.8224 10.6786 38.7535 11 38.501 11C38.2485 11 37.679 12.1786 37.5004 12C37.3218 11.8214 37.4634 6.62049 37.4634 6.36797V3.49121C37.4647 2.5657 37.833 1.67847 38.4874 1.02404C39.1419 0.369597 40.0291 0.00134327 40.9546 0L55.5948 0C56.5204 0.00134327 57.4076 0.369597 58.062 1.02404C58.7165 1.67847 59.0847 2.5657 59.0861 3.49121V18.1302C59.085 19.0558 58.7169 19.9432 58.0624 20.5977C57.4079 21.2522 56.5205 21.6204 55.5948 21.6214Z" fill="#1B1B20"/>
</g>
<defs>
<clipPath id="clip0_3024_2024">
<rect width="65" height="65" fill="white"/>
</clipPath>
</defs>
</svg>
