<svg width="19" height="13" viewBox="0 0 19 13" fill="none" xmlns="http://www.w3.org/2000/svg">
<path d="M16.9219 0H2.07812C0.932262 0 0 0.927801 0 2.06818V10.9318C0 12.0722 0.932262 13 2.07812 13H16.9219C18.0677 13 19 12.0722 19 10.9318V2.06818C19 0.927801 18.0677 0 16.9219 0ZM2.07812 1.18182H16.9219C17.4129 1.18182 17.8125 1.57946 17.8125 2.06818V3.25H1.1875V2.06818C1.1875 1.57946 1.58706 1.18182 2.07812 1.18182ZM16.9219 11.8182H2.07812C1.58706 11.8182 1.1875 11.4205 1.1875 10.9318V4.43182H17.8125V10.9318C17.8125 11.4205 17.4129 11.8182 16.9219 11.8182Z" fill="#008F57"/>
<path d="M4.15625 10.0455H3.5625C3.2346 10.0455 2.96875 9.78087 2.96875 9.45455V8.86364C2.96875 8.53731 3.2346 8.27273 3.5625 8.27273H4.15625C4.48415 8.27273 4.75 8.53731 4.75 8.86364V9.45455C4.75 9.78087 4.48415 10.0455 4.15625 10.0455Z" fill="#008F57"/>
</svg>
