<svg width="55" height="55" viewBox="0 0 55 55" fill="none" xmlns="http://www.w3.org/2000/svg">
<path d="M10.7459 45.9788H15.9423C16.3075 45.9788 16.6271 45.7331 16.7209 45.3802C16.8147 45.0272 16.6593 44.6552 16.3423 44.4738C13.922 43.0893 11.9108 41.0781 10.5263 38.6578C10.3451 38.3411 9.97304 38.185 9.61995 38.2793C9.26696 38.373 9.02128 38.6926 9.02128 39.0578V44.2541C9.02118 45.2051 9.79494 45.9788 10.7459 45.9788ZM10.6325 41.6705C11.4293 42.666 12.334 43.5707 13.3294 44.3674H10.7458C10.6844 44.3674 10.6324 44.3155 10.6324 44.2539V41.6705H10.6325Z" fill="#900B7B"/>
<path d="M5.53663 55L52.6108 55C53.9178 55 55 53.9414 55 52.6108C55 47.7693 51.0612 43.8304 46.2196 43.8304H24.0411C16.9438 43.8304 11.1697 38.0562 11.1697 30.959L11.1697 23.9043C11.1697 23.4592 10.809 23.0986 10.3641 23.0986C9.91912 23.0986 9.5584 23.4592 9.5584 23.9043L9.5584 30.959C9.5584 38.9448 16.0553 45.4417 24.0411 45.4417H46.2196C48.5821 45.4417 50.6814 46.5905 51.9883 48.3587C50.8176 47.5317 49.3896 47.053 47.8587 47.053H43.2304C42.7855 47.053 42.4248 47.4137 42.4248 47.8587C42.4248 48.3038 42.7855 48.6644 43.2304 48.6644H47.8586C50.4876 48.6644 52.7244 50.4863 53.2662 53.0305C53.1254 53.25 52.8797 53.3887 52.6108 53.3887L5.53663 53.3887C3.37218 53.3887 1.61133 51.6277 1.61133 49.4634V47.8758C1.61133 47.4307 1.25061 47.0701 0.805664 47.0701C0.360722 47.0701 0 47.4307 0 47.8758V49.4634C0 52.5163 2.4837 55 5.53663 55Z" fill="#900B7B"/>
<path d="M0.805687 44.9217C1.25063 44.9217 1.61135 44.5611 1.61135 44.116L1.61135 2.38928C1.61135 2.1203 1.75003 1.87473 1.9696 1.7338C4.51367 2.27563 6.33566 4.51237 6.33566 7.14141L6.33566 44.2541C6.33566 46.6859 8.31405 48.6644 10.746 48.6644L39.4706 48.6644C39.9155 48.6644 40.2762 48.3038 40.2762 47.8587C40.2762 47.4137 39.9155 47.053 39.4706 47.053H10.746C9.20264 47.053 7.94699 45.7975 7.94699 44.2541L7.94699 7.14141C7.94699 5.61054 7.46832 4.18258 6.64138 3.0119C8.40965 4.31879 9.55831 6.41803 9.55831 8.78056V20.1444C9.55831 20.5894 9.91904 20.9501 10.364 20.9501C10.8089 20.9501 11.1696 20.5894 11.1696 20.1444V8.78045C11.1696 3.93895 7.2308 3.8147e-06 2.38919 3.8147e-06C1.0462 3.8147e-06 2.28882e-05 1.09367 2.28882e-05 2.38917L2.28882e-05 44.116C2.28882e-05 44.561 0.360744 44.9217 0.805687 44.9217Z" fill="#900B7B"/>
</svg>
