<svg width="43" height="56" viewBox="0 0 43 56" fill="none" xmlns="http://www.w3.org/2000/svg">
    <path d="M40.0304 55.8352H2.12979C1.60033 55.8346 1.09272 55.622 0.71834 55.2441C0.343959 54.8661 0.133381 54.3537 0.132812 53.8191V52.0395C0.133381 51.505 0.343959 50.9925 0.71834 50.6146C1.09272 50.2366 1.60033 50.024 2.12979 50.0234H40.0304C40.56 50.0237 41.0679 50.2362 41.4425 50.6142C41.8171 50.9922 42.0278 51.5048 42.0284 52.0395V53.8181C42.0281 54.353 41.8175 54.8659 41.4429 55.2441C41.0682 55.6223 40.5602 55.8349 40.0304 55.8352ZM2.12979 51.6513C2.02778 51.6515 1.93001 51.6925 1.85778 51.7652C1.78555 51.8379 1.74471 51.9365 1.74414 52.0395V53.8181C1.744 53.8693 1.75387 53.92 1.77319 53.9674C1.7925 54.0147 1.82089 54.0578 1.85671 54.0941C1.89254 54.1303 1.9351 54.1591 1.98196 54.1787C2.02882 54.1984 2.07905 54.2085 2.12979 54.2085H40.0304C40.1327 54.2085 40.231 54.1675 40.3034 54.0945C40.3759 54.0215 40.4168 53.9225 40.4171 53.8191V52.0395C40.4168 51.9361 40.3759 51.8371 40.3034 51.7641C40.231 51.6912 40.1327 51.6502 40.0304 51.6502L2.12979 51.6513Z" fill="#900B7B"/>
    <path d="M3.16504 51.2545C2.95136 51.2545 2.74644 51.1688 2.59535 51.0163C2.44426 50.8638 2.35938 50.6569 2.35938 50.4412V23.2606C2.35938 23.0449 2.44426 22.838 2.59535 22.6855C2.74644 22.533 2.95136 22.4473 3.16504 22.4473C3.37871 22.4473 3.58364 22.533 3.73473 22.6855C3.88582 22.838 3.9707 23.0449 3.9707 23.2606V50.4412C3.9707 50.6569 3.88582 50.8638 3.73473 51.0163C3.58364 51.1688 3.37871 51.2545 3.16504 51.2545Z" fill="#900B7B"/>
    <path d="M41.3564 24.074H35.7705C35.5568 24.074 35.3519 23.9883 35.2008 23.8358C35.0497 23.6832 34.9648 23.4764 34.9648 23.2606C34.9648 23.0449 35.0497 22.838 35.2008 22.6855C35.3519 22.533 35.5568 22.4473 35.7705 22.4473H41.3564V24.074Z" fill="#900B7B"/>
    <path d="M6.39375 24.074H0.805664C0.591989 24.074 0.387065 23.9883 0.235974 23.8358C0.0848822 23.6832 0 23.4764 0 23.2606C0 23.0449 0.0848822 22.838 0.235974 22.6855C0.387065 22.533 0.591989 22.4473 0.805664 22.4473H6.3916L6.39375 24.074Z" fill="#900B7B"/>
    <path d="M38.9932 51.4172C38.7795 51.4172 38.5746 51.3315 38.4235 51.179C38.2724 51.0264 38.1875 50.8196 38.1875 50.6038V23.2606C38.1875 23.0449 38.2724 22.838 38.4235 22.6855C38.5746 22.533 38.7795 22.4473 38.9932 22.4473C39.2068 22.4473 39.4118 22.533 39.5629 22.6855C39.7139 22.838 39.7988 23.0449 39.7988 23.2606V50.6038C39.7988 50.8196 39.7139 51.0264 39.5629 51.179C39.4118 51.3315 39.2068 51.4172 38.9932 51.4172Z" fill="#900B7B"/>
    <path d="M28.0013 15.7829C27.8954 15.7831 27.7906 15.7622 27.6929 15.7212C27.5951 15.6803 27.5064 15.6201 27.4319 15.5443L23.6217 11.6965C23.5425 11.6221 23.479 11.5323 23.435 11.4325C23.3909 11.3327 23.3673 11.225 23.3654 11.1158C23.3635 11.0066 23.3834 10.8981 23.4239 10.7968C23.4644 10.6956 23.5247 10.6036 23.6012 10.5263C23.6777 10.4491 23.7688 10.3882 23.8692 10.3473C23.9695 10.3064 24.0769 10.2863 24.1851 10.2882C24.2933 10.2901 24.4 10.314 24.4988 10.3585C24.5976 10.403 24.6866 10.4671 24.7603 10.547L28.5738 14.3947C28.6864 14.5085 28.763 14.6535 28.794 14.8113C28.825 14.9691 28.809 15.1326 28.7479 15.2812C28.6869 15.4298 28.5836 15.5567 28.451 15.646C28.3185 15.7353 28.1627 15.7829 28.0034 15.7829H28.0013Z" fill="#900B7B"/>
    <path d="M27.2297 20.7621C27.1237 20.7622 27.0187 20.7412 26.9208 20.7003C26.8229 20.6593 26.734 20.5993 26.6592 20.5235L16.9118 10.6817C16.7688 10.5281 16.6906 10.3245 16.6934 10.1137C16.6963 9.90293 16.7801 9.70153 16.9272 9.55193C17.0743 9.40232 17.2731 9.3162 17.4819 9.31171C17.6906 9.30722 17.8929 9.3847 18.0462 9.52785L27.7947 19.3685C27.9071 19.4824 27.9835 19.6273 28.0145 19.785C28.0454 19.9427 28.0295 20.1061 27.9686 20.2547C27.9077 20.4032 27.8046 20.5302 27.6724 20.6198C27.5401 20.7093 27.3846 20.7573 27.2254 20.7577L27.2297 20.7621Z" fill="#900B7B"/>
    <path d="M31.3425 42.5722H22.9636C22.7499 42.5722 22.545 42.4865 22.3939 42.334C22.2428 42.1814 22.1579 41.9745 22.1579 41.7588C22.1579 41.5431 22.2428 41.3362 22.3939 41.1837C22.545 41.0312 22.7499 40.9455 22.9636 40.9455H31.1459V5.57595H11.0193V40.9455H19.2006C19.4143 40.9455 19.6192 41.0312 19.7703 41.1837C19.9214 41.3362 20.0063 41.5431 20.0063 41.7588C20.0063 41.9745 19.9214 42.1814 19.7703 42.334C19.6192 42.4865 19.4143 42.5722 19.2006 42.5722H10.8217C10.4475 42.5716 10.0888 42.4213 9.82421 42.1542C9.55962 41.8871 9.41072 41.5249 9.41016 41.1472V5.37424C9.41044 4.99639 9.55925 4.6341 9.8239 4.36692C10.0885 4.09974 10.4474 3.94951 10.8217 3.94922H31.3393C31.5249 3.94894 31.7087 3.98558 31.8802 4.05705C32.0518 4.12852 32.2077 4.23343 32.3391 4.36576C32.4705 4.4981 32.5748 4.65529 32.646 4.82832C32.7171 5.00136 32.7539 5.18687 32.754 5.37424V41.1472C32.7534 41.5249 32.6045 41.8871 32.34 42.1542C32.0754 42.4213 31.7167 42.5716 31.3425 42.5722Z" fill="#900B7B"/>
    <path d="M31.3425 46.2116H10.8249C9.49355 46.2122 8.21645 45.6791 7.27434 44.7294C6.33223 43.7797 5.80221 42.4912 5.80078 41.1471V5.37413C5.8022 4.03099 6.33149 2.74331 7.27244 1.79377C8.21339 0.844225 9.48911 0.310431 10.8195 0.30957L31.3371 0.30957C32.6672 0.311006 33.9423 0.845053 34.8828 1.79453C35.8233 2.74401 36.3523 4.03137 36.3537 5.37413V12.1424C36.3537 12.3581 36.2688 12.565 36.1177 12.7176C35.9666 12.8701 35.7617 12.9558 35.548 12.9558C35.3344 12.9558 35.1294 12.8701 34.9784 12.7176C34.8273 12.565 34.7424 12.3581 34.7424 12.1424V5.37413C34.7413 4.46365 34.3829 3.59071 33.7456 2.9464C33.1084 2.30208 32.2443 1.93888 31.3425 1.9363H10.8249C9.92081 1.93544 9.0534 2.29712 8.41341 2.94181C7.77342 3.58649 7.41325 4.4614 7.41211 5.37413V41.1471C7.41325 42.0585 7.77238 42.9322 8.41075 43.5767C9.04911 44.2212 9.9146 44.5838 10.8174 44.5849H31.335C32.2377 44.5838 33.1032 44.2212 33.7416 43.5767C34.38 42.9322 34.7391 42.0585 34.7402 41.1471V15.9392C34.7402 15.7235 34.8251 15.5166 34.9762 15.3641C35.1273 15.2115 35.3322 15.1259 35.5459 15.1259C35.7596 15.1259 35.9645 15.2115 36.1156 15.3641C36.2667 15.5166 36.3516 15.7235 36.3516 15.9392V41.1471C36.3501 42.4885 35.8222 43.7747 34.8833 44.724C33.9445 45.6733 32.6712 46.2082 31.3425 46.2116Z" fill="#900B7B"/>
</svg>
