<svg viewBox="0 0 36 36" xmlns="http://www.w3.org/2000/svg">
<path d="M23.8443 36H11.1881C10.6278 36.0016 10.0726 35.8942 9.55334 35.6836C9.05537 35.4822 8.60054 35.1874 8.21336 34.8151C7.82739 34.4468 7.51821 34.0057 7.3037 33.5173C7.08097 33.0141 6.96653 32.4697 6.96778 31.9195V4.08164C6.96653 3.5312 7.08098 2.98664 7.3037 2.48327C7.51847 1.99498 7.82761 1.55394 8.21336 1.18549C8.60092 0.813012 9.0561 0.518035 9.55439 0.316429C10.0735 0.105636 10.6288 -0.00184 11.1891 2.38322e-05H23.8453C24.4056 -0.00182648 24.9609 0.105649 25.4801 0.316429C25.9778 0.517713 26.4325 0.81234 26.8195 1.18443C27.2055 1.55286 27.5148 1.9939 27.7297 2.48222C27.9519 2.98576 28.0663 3.53021 28.0656 4.08059V9.21057C28.0606 9.39373 27.9843 9.56772 27.853 9.6955C27.7217 9.82328 27.5457 9.89478 27.3624 9.89478C27.1792 9.89478 27.0032 9.82328 26.8719 9.6955C26.7405 9.56772 26.6642 9.39373 26.6592 9.21057V4.08164C26.6581 3.72919 26.5854 3.38063 26.4455 3.05711C26.3056 2.73359 26.1015 2.44184 25.8455 2.19956C25.307 1.68684 24.5905 1.40324 23.8469 1.40855H11.1907C10.4471 1.40302 9.73051 1.68665 9.19211 2.19956C8.93535 2.44145 8.73049 2.73304 8.58997 3.05659C8.44945 3.38014 8.37622 3.7289 8.37473 4.08164V31.9184C8.37556 32.2713 8.44817 32.6203 8.58814 32.9442C8.72812 33.2681 8.93253 33.5602 9.18894 33.8026C9.72749 34.3153 10.444 34.5989 11.1876 34.5936H23.8438C24.5873 34.5987 25.3037 34.3151 25.8424 33.8026C26.0984 33.5603 26.3025 33.2686 26.4424 32.945C26.5822 32.6215 26.6549 32.273 26.6561 31.9205V15.5397C26.6535 15.4457 26.6698 15.3522 26.704 15.2646C26.7381 15.1771 26.7895 15.0973 26.8551 15.0299C26.9206 14.9625 26.999 14.909 27.0856 14.8724C27.1722 14.8358 27.2653 14.817 27.3593 14.817C27.4533 14.817 27.5463 14.8358 27.6329 14.8724C27.7195 14.909 27.7979 14.9625 27.8635 15.0299C27.929 15.0973 27.9804 15.1771 28.0146 15.2646C28.0488 15.3522 28.0651 15.4457 28.0625 15.5397V31.9184C28.0632 32.4686 27.9488 33.0129 27.7266 33.5162C27.5116 34.0046 27.2023 34.4456 26.8164 34.814C26.4295 35.1865 25.9748 35.4813 25.4769 35.6826C24.9584 35.8932 24.4039 36.001 23.8443 36ZM27.359 13.0781C27.2199 13.0781 27.0838 13.0368 26.9681 12.9595C26.8524 12.8822 26.7623 12.7723 26.709 12.6437C26.6558 12.5151 26.6419 12.3737 26.6691 12.2372C26.6963 12.1007 26.7633 11.9754 26.8618 11.877C26.9602 11.7786 27.0856 11.7117 27.2221 11.6846C27.3586 11.6575 27.5001 11.6715 27.6286 11.7248C27.7571 11.7782 27.8669 11.8684 27.9442 11.9842C28.0214 12.0999 28.0626 12.236 28.0625 12.3751C28.0622 12.5616 27.988 12.7403 27.8561 12.8721C27.7242 13.0039 27.5455 13.0779 27.359 13.0781Z"/>
<path d="M20.3286 29.6721H17.8675C17.6844 29.6671 17.5104 29.5908 17.3826 29.4594C17.2548 29.3281 17.1833 29.1521 17.1833 28.9689C17.1833 28.7856 17.2548 28.6096 17.3826 28.4783C17.5104 28.347 17.6844 28.2707 17.8675 28.2657H20.3286C20.5118 28.2707 20.6858 28.347 20.8136 28.4783C20.9413 28.6096 21.0128 28.7856 21.0128 28.9689C21.0128 29.1521 20.9413 29.3281 20.8136 29.4594C20.6858 29.5908 20.5118 29.6671 20.3286 29.6721ZM14.7035 29.6721C14.5643 29.6721 14.4283 29.6308 14.3126 29.5535C14.197 29.4762 14.1068 29.3664 14.0535 29.2378C14.0003 29.1093 13.9864 28.9678 14.0135 28.8314C14.0407 28.6949 14.1077 28.5696 14.206 28.4712C14.3044 28.3728 14.4298 28.3058 14.5662 28.2787C14.7027 28.2515 14.8441 28.2654 14.9727 28.3187C15.1012 28.3719 15.2111 28.4621 15.2884 28.5778C15.3657 28.6935 15.4069 28.8295 15.4069 28.9686C15.4068 29.1551 15.3326 29.334 15.2007 29.4659C15.0689 29.5978 14.89 29.6719 14.7035 29.6721Z"/>
<path d="M20.3286 32.8361H17.8675C17.6844 32.8311 17.5104 32.7548 17.3826 32.6235C17.2548 32.4922 17.1833 32.3162 17.1833 32.1329C17.1833 31.9497 17.2548 31.7737 17.3826 31.6424C17.5104 31.511 17.6844 31.4347 17.8675 31.4297H20.3286C20.5118 31.4347 20.6858 31.511 20.8136 31.6424C20.9413 31.7737 21.0128 31.9497 21.0128 32.1329C21.0128 32.3162 20.9413 32.4922 20.8136 32.6235C20.6858 32.7548 20.5118 32.8311 20.3286 32.8361ZM14.7035 32.8361C14.5643 32.8361 14.4283 32.7949 14.3126 32.7176C14.197 32.6403 14.1068 32.5304 14.0535 32.4019C14.0003 32.2733 13.9864 32.1319 14.0135 31.9954C14.0407 31.859 14.1077 31.7336 14.206 31.6352C14.3044 31.5369 14.4298 31.4699 14.5662 31.4427C14.7027 31.4156 14.8441 31.4295 14.9727 31.4827C15.1012 31.536 15.2111 31.6262 15.2884 31.7418C15.3657 31.8575 15.4069 31.9935 15.4069 32.1327C15.4068 32.3192 15.3326 32.4981 15.2007 32.6299C15.0689 32.7618 14.89 32.836 14.7035 32.8361Z"/>
<path d="M21.0635 5.12259H13.9681C12.4188 5.12259 11.0678 4.15914 10.6106 2.72583L10.0416 0.949214C10.01 0.851048 10.0004 0.747141 10.0135 0.644859C10.0266 0.542578 10.062 0.444427 10.1173 0.357367C10.1725 0.270306 10.2462 0.196468 10.3332 0.141089C10.4202 0.0857087 10.5183 0.0501432 10.6206 0.0369139C10.8087 0.0125774 10.9983 0.00024783 11.188 0L23.8442 0C24.0337 0.000248802 24.2231 0.0125784 24.4111 0.0369139C24.5133 0.0501089 24.6114 0.0856188 24.6984 0.14093C24.7854 0.196242 24.8592 0.270002 24.9146 0.356991C24.9699 0.44398 25.0055 0.542071 25.0187 0.644319C25.0319 0.746568 25.0225 0.850476 24.9911 0.948687L24.4216 2.72583C23.9623 4.15914 22.6128 5.12259 21.0635 5.12259ZM11.6647 1.40642L11.95 2.2971C12.2216 3.14559 13.0326 3.71617 13.9681 3.71617H21.0635C21.999 3.71617 22.8106 3.14559 23.0822 2.2971L23.3675 1.40642H11.6647Z"/>
<path d="M17.5156 13.9918C17.3724 13.992 17.2325 13.9482 17.1149 13.8663L13.6692 11.4759C13.5725 11.4087 13.4942 11.3182 13.4415 11.2128C13.3888 11.1075 13.3634 10.9906 13.3676 10.8728C13.3719 10.7551 13.4056 10.6403 13.4658 10.539C13.526 10.4377 13.6106 10.3531 13.7119 10.2931L17.1576 8.25437C17.266 8.19014 17.3897 8.15625 17.5156 8.15625C17.6416 8.15625 17.7653 8.19014 17.8737 8.25437L21.3188 10.2931C21.4202 10.3531 21.5048 10.4377 21.565 10.539C21.6251 10.6403 21.6589 10.7551 21.6631 10.8728C21.6674 10.9906 21.642 11.1075 21.5893 11.2128C21.5366 11.3182 21.4583 11.4087 21.3615 11.4759L17.9164 13.869C17.7985 13.9499 17.6586 13.9927 17.5156 13.9918ZM15.3715 10.9454L17.5156 12.433L19.6598 10.9454L17.5156 9.67608L15.3715 10.9454Z"/>
<path d="M17.516 18.5626C17.4236 18.5626 17.3322 18.5445 17.2468 18.5092C17.1615 18.4739 17.0839 18.4222 17.0186 18.3569C16.9532 18.2916 16.9014 18.2141 16.8661 18.1288C16.8307 18.0434 16.8125 17.952 16.8125 17.8596V13.2892C16.8126 13.1756 16.8401 13.0638 16.8929 12.9632C16.9456 12.8627 17.0219 12.7764 17.1152 12.7117L20.5603 10.3208C20.6659 10.2475 20.7896 10.2045 20.918 10.1966C21.0463 10.1887 21.1743 10.2162 21.2881 10.276C21.4019 10.3358 21.4972 10.4257 21.5634 10.5359C21.6297 10.646 21.6645 10.7723 21.664 10.9008V15.8204C21.6641 15.9425 21.6323 16.0625 21.5718 16.1686C21.5113 16.2746 21.4243 16.3631 21.3192 16.4253L17.874 18.4645C17.7657 18.5288 17.642 18.5626 17.516 18.5626ZM18.2189 13.6583V16.6272L20.2581 15.4207V12.2424L18.2189 13.6583Z"/>
<path d="M17.5158 18.5626C17.3898 18.5627 17.2661 18.5288 17.1577 18.4645L13.711 16.4253C13.6062 16.3629 13.5194 16.2744 13.4591 16.1684C13.3988 16.0623 13.3671 15.9424 13.3672 15.8204V10.8988C13.3668 10.7702 13.4017 10.644 13.4681 10.5338C13.5344 10.4237 13.6297 10.3339 13.7435 10.2741C13.8573 10.2143 13.9854 10.1868 14.1137 10.1947C14.242 10.2025 14.3658 10.2454 14.4714 10.3187L17.9166 12.7097C18.0101 12.7745 18.0865 12.8612 18.1392 12.9621C18.1918 13.0631 18.2191 13.1753 18.2187 13.2892V17.8597C18.2187 17.952 18.2005 18.0434 18.1652 18.1287C18.1299 18.214 18.0781 18.2915 18.0128 18.3567C17.9476 18.422 17.8701 18.4738 17.7848 18.5091C17.6995 18.5444 17.6081 18.5626 17.5158 18.5626ZM14.7736 15.4197L16.8123 16.6262V13.6583L14.7736 12.2435V15.4197Z"/>
<path d="M17.5174 25.2068C13.7801 25.2068 10.1953 24.5139 7.42462 23.2556L7.40933 23.2488C5.8484 22.5379 4.61442 21.6868 3.73587 20.7176C2.77347 19.6544 2.28516 18.5027 2.28516 17.2962C2.28516 16.0896 2.76873 14.9395 3.72269 13.8816C4.59491 12.914 5.82572 12.0644 7.38033 11.3567C7.54954 11.2831 7.74089 11.279 7.91314 11.3451C8.0854 11.4113 8.22476 11.5425 8.30119 11.7104C8.37763 11.8784 8.38501 12.0696 8.32176 12.243C8.25851 12.4163 8.12968 12.5579 7.96304 12.6371C5.24829 13.8732 3.69157 15.5718 3.69157 17.2967C3.69157 19.0216 5.25725 20.7244 7.9873 21.9674L8.00206 21.9737C10.5997 23.1502 13.9747 23.8004 17.5174 23.8004C21.0601 23.8004 24.4324 23.1533 27.0238 21.9784L27.0407 21.9705L27.0465 21.9679C29.7776 20.7255 31.3443 19.0227 31.3443 17.2967C31.3443 16.0089 30.4794 14.9685 29.7538 14.3225C29.6145 14.1982 29.5303 14.0236 29.5197 13.8372C29.5092 13.6507 29.5731 13.4677 29.6974 13.3284C29.8217 13.1891 29.9963 13.1049 30.1827 13.0944C30.3692 13.0838 30.5521 13.1477 30.6914 13.272C32.0377 14.4733 32.7481 15.865 32.7481 17.2967C32.7481 18.5043 32.2598 19.6555 31.2968 20.7191C30.4193 21.6873 29.1875 22.5374 27.6323 23.2456L27.6165 23.253L27.6091 23.2562C24.838 24.5139 21.2557 25.2068 17.5174 25.2068Z"/>
<path d="M29.9784 17.302C29.9577 17.3021 29.9369 17.3013 29.9162 17.2993C29.8243 17.2913 29.7348 17.2652 29.6529 17.2226C29.571 17.18 29.4983 17.1217 29.4389 17.051C29.3796 16.9803 29.3347 16.8986 29.307 16.8105C29.2792 16.7225 29.269 16.6298 29.2771 16.5379L29.5212 13.7361C29.5293 13.6441 29.5554 13.5545 29.598 13.4726C29.6406 13.3907 29.699 13.318 29.7698 13.2586C29.8406 13.1992 29.9223 13.1544 30.0104 13.1267C30.0985 13.0989 30.1912 13.0888 30.2833 13.097L33.0734 13.3416C33.2591 13.358 33.4308 13.4475 33.5505 13.5904C33.6703 13.7333 33.7284 13.9179 33.712 14.1036C33.6957 14.2894 33.6062 14.461 33.4633 14.5808C33.3204 14.7005 33.1357 14.7586 32.95 14.7423L30.8607 14.5587L30.6777 16.6597C30.6627 16.8348 30.5825 16.9979 30.453 17.1169C30.3236 17.2358 30.1542 17.3018 29.9784 17.302Z"/>
</svg>
