<svg width="55" height="56" viewBox="0 0 55 56" fill="none" xmlns="http://www.w3.org/2000/svg">

<path d="M27.5006 32.7183C27.3635 32.718 27.2287 32.6825 27.1091 32.615L12.3494 24.3187C11.9465 24.0942 11.7137 23.729 11.7129 23.3183C11.7121 22.9075 11.9441 22.5407 12.3494 22.3129L18.2637 18.9643C18.356 18.9117 18.4576 18.878 18.5628 18.8652C18.668 18.8523 18.7747 18.8605 18.8767 18.8893C18.9788 18.9181 19.0742 18.967 19.1575 19.0331C19.2409 19.0992 19.3104 19.1812 19.3623 19.2745C19.4142 19.3678 19.4473 19.4705 19.4598 19.5767C19.4723 19.6829 19.4639 19.7906 19.4351 19.8935C19.4064 19.9965 19.3577 20.0927 19.2921 20.1767C19.2264 20.2606 19.145 20.3307 19.0525 20.3828L13.8753 23.3109L27.5006 30.9712L41.1267 23.3109L27.5006 15.6523L21.894 18.8033C21.8015 18.8575 21.6992 18.8926 21.593 18.9065C21.4869 18.9203 21.3791 18.9127 21.2759 18.8841C21.1728 18.8554 21.0763 18.8063 20.9921 18.7396C20.9079 18.6729 20.8378 18.59 20.7857 18.4956C20.7336 18.4012 20.7007 18.2973 20.6889 18.19C20.677 18.0826 20.6865 17.9739 20.7167 17.8703C20.7469 17.7666 20.7972 17.6701 20.8648 17.5863C20.9323 17.5026 21.0157 17.4332 21.1101 17.3823L27.1091 14.0109C27.2289 13.9436 27.3638 13.9082 27.501 13.9082C27.6382 13.9082 27.7731 13.9436 27.893 14.0109L42.6551 22.3072C43.0579 22.5342 43.2899 22.8994 43.2899 23.3093C43.2899 23.7192 43.0587 24.0853 42.6551 24.313L27.893 32.6093C27.7735 32.6787 27.6384 32.7162 27.5006 32.7183Z" fill="#900B7B"/>
<path d="M27.5005 55.6164C21.7626 55.6164 17.0938 50.8989 17.0938 45.1045C17.0938 39.3101 21.7666 34.5918 27.5005 34.5918C33.2343 34.5918 37.9072 39.3093 37.9072 45.1045C37.9072 50.8997 33.2392 55.6164 27.5005 55.6164ZM27.5005 36.2185C25.7594 36.2172 24.057 36.7373 22.6087 37.7129C21.1604 38.6885 20.0312 40.0759 19.364 41.6995C18.6969 43.3231 18.5216 45.1099 18.8605 46.8341C19.1994 48.5582 20.0372 50.1422 21.2679 51.3855C22.4986 52.6289 24.0669 53.4759 25.7745 53.8193C27.4821 54.1627 29.2521 53.9871 30.8608 53.3147C32.4695 52.6423 33.8446 51.5034 34.812 50.042C35.7795 48.5805 36.2959 46.8623 36.2959 45.1045C36.2939 42.7495 35.3669 40.4914 33.718 38.8256C32.0692 37.1598 29.8331 36.2222 27.5005 36.2185Z" fill="#900B7B"/>
<path d="M27.499 36.2182C27.2853 36.2182 27.0804 36.1325 26.9293 35.9799C26.7782 35.8274 26.6934 35.6205 26.6934 35.4048V31.7382C26.6934 31.5225 26.7782 31.3156 26.9293 31.163C27.0804 31.0105 27.2853 30.9248 27.499 30.9248C27.7127 30.9248 27.9176 31.0105 28.0687 31.163C28.2198 31.3156 28.3047 31.5225 28.3047 31.7382V35.4048C28.3047 35.6205 28.2198 35.8274 28.0687 35.9799C27.9176 36.1325 27.7127 36.2182 27.499 36.2182Z" fill="#900B7B"/>
<path d="M17.9404 44.9976C17.8035 44.9975 17.669 44.9619 17.5496 44.8943L12.7624 42.2029C12.4216 42.0109 12.0437 41.7686 11.8512 41.3082C11.707 40.9641 11.7086 40.6111 11.7118 40.1223C11.7118 40.041 11.7118 39.9596 11.7118 39.8694V23.3134C11.7118 23.0976 11.7967 22.8908 11.9478 22.7382C12.0989 22.5857 12.3038 22.5 12.5175 22.5C12.7311 22.5 12.9361 22.5857 13.0871 22.7382C13.2382 22.8908 13.3231 23.0976 13.3231 23.3134V39.8718C13.3231 39.9653 13.3231 40.0532 13.3231 40.1345C13.3231 40.3289 13.3231 40.5469 13.3328 40.6486C13.4018 40.6975 13.4736 40.7424 13.5479 40.7828L18.3335 43.4734C18.4896 43.561 18.6125 43.6985 18.6827 43.8643C18.753 44.0301 18.7667 44.2147 18.7217 44.3892C18.6767 44.5637 18.5755 44.7182 18.4341 44.8283C18.2926 44.9384 18.119 44.998 17.9404 44.9976ZM37.0587 44.9976C36.8801 44.9978 36.7066 44.9381 36.5653 44.8279C36.424 44.7177 36.323 44.5633 36.2781 44.3888C36.2331 44.2144 36.2469 44.0298 36.3172 43.8641C36.3875 43.6984 36.5103 43.561 36.6663 43.4734L41.456 40.7819C41.5296 40.7422 41.6008 40.6982 41.6695 40.6502C41.6816 40.5477 41.6807 40.3248 41.6791 40.1264C41.6791 40.045 41.6791 39.9637 41.6791 39.8734V34.2734C41.6791 34.0577 41.764 33.8508 41.9151 33.6983C42.0662 33.5458 42.2711 33.4601 42.4848 33.4601C42.6985 33.4601 42.9034 33.5458 43.0545 33.6983C43.2056 33.8508 43.2905 34.0577 43.2905 34.2734V39.8718C43.2905 39.9588 43.2905 40.0402 43.2905 40.1158C43.2961 41.1195 43.2534 41.6278 42.2431 42.2013L37.4502 44.8943C37.3313 44.9614 37.1974 44.997 37.0611 44.9976H37.0587ZM42.484 31.3274C42.2703 31.3274 42.0654 31.2417 41.9143 31.0892C41.7632 30.9367 41.6783 30.7298 41.6783 30.5141V23.3134C41.6783 23.0976 41.7632 22.8908 41.9143 22.7382C42.0654 22.5857 42.2703 22.5 42.484 22.5C42.6977 22.5 42.9026 22.5857 43.0537 22.7382C43.2048 22.8908 43.2897 23.0976 43.2897 23.3134V30.5141C43.2897 30.6209 43.2688 30.7266 43.2283 30.8253C43.1878 30.924 43.1285 31.0137 43.0537 31.0892C42.9789 31.1647 42.8901 31.2246 42.7923 31.2655C42.6946 31.3064 42.5898 31.3274 42.484 31.3274Z" fill="#900B7B"/>
<path d="M30.6456 48.7025H29.0053C28.7164 48.7023 28.4395 48.5863 28.2353 48.3802C28.0311 48.174 27.9162 47.8944 27.916 47.6028V42.6023C27.9167 42.3109 28.0316 42.0316 28.2358 41.8257C28.44 41.6197 28.7166 41.5038 29.0053 41.5034H30.6488C31.3745 41.5034 32.0705 41.7941 32.584 42.3117C33.0976 42.8292 33.3868 43.5314 33.3881 44.264V45.9436C33.3864 46.6764 33.0966 47.3787 32.5823 47.896C32.0681 48.4133 31.3715 48.7034 30.6456 48.7025ZM29.5241 47.0758H30.6456C30.9439 47.0758 31.2301 46.9565 31.4415 46.744C31.6528 46.5315 31.7722 46.2431 31.7735 45.9419V44.264C31.7722 43.9628 31.6528 43.6744 31.4415 43.4619C31.2301 43.2494 30.9439 43.1301 30.6456 43.1301H29.5241V47.0758Z" fill="#900B7B"/>
<path d="M25.7638 45.9177H22.4268C22.2131 45.9177 22.0082 45.832 21.8571 45.6795C21.706 45.527 21.6211 45.3201 21.6211 45.1044C21.6211 44.8887 21.706 44.6818 21.8571 44.5292C22.0082 44.3767 22.2131 44.291 22.4268 44.291H25.7638C25.9775 44.291 26.1824 44.3767 26.3335 44.5292C26.4846 44.6818 26.5695 44.8887 26.5695 45.1044C26.5695 45.3201 26.4846 45.527 26.3335 45.6795C26.1824 45.832 25.9775 45.9177 25.7638 45.9177Z" fill="#900B7B"/>
<path d="M25.1426 48.7025H22.4268C22.2131 48.7025 22.0082 48.6168 21.8571 48.4643C21.706 48.3117 21.6211 48.1048 21.6211 47.8891C21.6211 47.6734 21.706 47.4665 21.8571 47.314C22.0082 47.1615 22.2131 47.0758 22.4268 47.0758H24.9581V43.1301H22.4268C22.2131 43.1301 22.0082 43.0445 21.8571 42.8919C21.706 42.7394 21.6211 42.5325 21.6211 42.3168C21.6211 42.1011 21.706 41.8942 21.8571 41.7416C22.0082 41.5891 22.2131 41.5034 22.4268 41.5034H25.1426C25.521 41.5041 25.8837 41.6561 26.1511 41.9263C26.4186 42.1965 26.569 42.5627 26.5695 42.9447V47.2628C26.5686 47.6445 26.418 48.0103 26.1506 48.2802C25.8831 48.55 25.5207 48.7018 25.1426 48.7025Z" fill="#900B7B"/>
<path d="M0.869027 48.3414C0.690483 48.3416 0.516934 48.2819 0.375639 48.1717C0.234343 48.0615 0.133307 47.9071 0.0884002 47.7326C0.0434933 47.5582 0.05726 47.3736 0.127538 47.2079C0.197816 47.0422 0.320623 46.9047 0.47667 46.8172L12.1845 40.2346C12.2769 40.1824 12.3786 40.149 12.4838 40.1365C12.589 40.1239 12.6956 40.1324 12.7975 40.1615C12.8995 40.1905 12.9947 40.2395 13.0779 40.3057C13.1611 40.372 13.2305 40.454 13.2822 40.5473C13.334 40.6406 13.367 40.7433 13.3794 40.8495C13.3919 40.9557 13.3835 41.0633 13.3547 41.1662C13.3259 41.2691 13.2774 41.3653 13.2118 41.4493C13.1462 41.5332 13.0649 41.6033 12.9725 41.6556L1.26058 48.2381C1.14097 48.3058 1.00615 48.3414 0.869027 48.3414Z" fill="#900B7B"/>
<path d="M5.96285 49.9593C5.88794 49.9594 5.81338 49.949 5.74129 49.9284L0.946002 48.5457C0.613284 48.451 0.33136 48.2269 0.162094 47.9226C-0.00364931 47.6213 -0.0442138 47.2659 0.0493018 46.9344L1.41892 42.0852C1.47736 41.8776 1.61507 41.702 1.80174 41.597C1.98841 41.492 2.20876 41.4662 2.41432 41.5252C2.61987 41.5841 2.79379 41.7232 2.89782 41.9116C3.00184 42.1001 3.02745 42.3225 2.96901 42.5301L1.6864 47.0694L6.18038 48.3635C6.36722 48.417 6.52862 48.5369 6.63486 48.7011C6.7411 48.8652 6.78502 49.0626 6.75854 49.2568C6.73206 49.4511 6.63696 49.6291 6.49076 49.7582C6.34455 49.8873 6.15707 49.9587 5.96285 49.9593Z" fill="#900B7B"/>
<path d="M54.1318 48.3417C53.9946 48.3417 53.8598 48.3061 53.7402 48.2384L42.0356 41.6559C41.9412 41.605 41.8578 41.5356 41.7902 41.4519C41.7227 41.3681 41.6723 41.2715 41.6421 41.1679C41.6119 41.0643 41.6025 40.9556 41.6143 40.8482C41.6262 40.7409 41.6591 40.637 41.7112 40.5426C41.7632 40.4482 41.8334 40.3653 41.9176 40.2986C42.0018 40.2319 42.0982 40.1828 42.2014 40.1541C42.3046 40.1255 42.4124 40.1179 42.5185 40.1317C42.6246 40.1456 42.7269 40.1807 42.8195 40.2349L54.5249 46.8175C54.681 46.9051 54.8039 47.0426 54.8741 47.2084C54.9444 47.3742 54.9581 47.5588 54.9131 47.7333C54.8681 47.9078 54.7669 48.0623 54.6255 48.1724C54.484 48.2825 54.3104 48.3421 54.1318 48.3417Z" fill="#900B7B"/>
<path d="M49.0431 49.9591C48.8487 49.9589 48.661 49.8878 48.5145 49.7588C48.368 49.6299 48.2726 49.4518 48.2459 49.2575C48.2192 49.0631 48.263 48.8655 48.3693 48.7012C48.4755 48.5369 48.637 48.4169 48.824 48.3633L53.3179 47.0693L52.0369 42.5307C52.0054 42.4272 51.9946 42.3185 52.0052 42.2107C52.0159 42.103 52.0477 41.9985 52.0989 41.9034C52.15 41.8082 52.2195 41.7244 52.3031 41.6567C52.3868 41.589 52.483 41.5388 52.5861 41.5092C52.6893 41.4795 52.7972 41.4709 52.9037 41.4839C53.0101 41.4969 53.1129 41.5312 53.2061 41.5849C53.2992 41.6385 53.3808 41.7103 53.4461 41.7962C53.5114 41.8821 53.559 41.9803 53.5862 42.085L54.9558 46.9294C55.0484 47.2624 55.0073 47.6188 54.8414 47.9215C54.6756 48.2241 54.3983 48.4486 54.0696 48.5463L49.2727 49.929C49.198 49.9501 49.1207 49.9602 49.0431 49.9591Z" fill="#900B7B"/>
<path d="M27.499 15.7014C27.2853 15.7014 27.0804 15.6157 26.9293 15.4632C26.7782 15.3107 26.6934 15.1038 26.6934 14.8881V1.33826C26.6934 1.12255 26.7782 0.915666 26.9293 0.763131C27.0804 0.610596 27.2853 0.524902 27.499 0.524902C27.7127 0.524902 27.9176 0.610596 28.0687 0.763131C28.2198 0.915666 28.3047 1.12255 28.3047 1.33826V14.8881C28.3047 15.1038 28.2198 15.3107 28.0687 15.4632C27.9176 15.6157 27.7127 15.7014 27.499 15.7014Z" fill="#900B7B"/>
<path d="M31.373 5.85796C31.267 5.85804 31.1621 5.83704 31.0643 5.79614C30.9664 5.75525 30.8774 5.69527 30.8026 5.61964L27.4993 2.28486L24.1961 5.61964C24.0451 5.77226 23.8401 5.85805 23.6264 5.85812C23.4127 5.8582 23.2077 5.77256 23.0565 5.62005C22.9054 5.46754 22.8204 5.26065 22.8203 5.04488C22.8202 4.82912 22.9051 4.62217 23.0561 4.46955L26.5825 0.907835C26.7031 0.785831 26.8463 0.689034 27.004 0.62299C27.1616 0.556945 27.3307 0.522949 27.5014 0.522949C27.6721 0.522949 27.8411 0.556945 27.9988 0.62299C28.1564 0.689034 28.2997 0.785831 28.4202 0.907835L31.9426 4.4663C32.0552 4.58005 32.1319 4.72496 32.163 4.88271C32.194 5.04047 32.1781 5.20398 32.1171 5.35258C32.0562 5.50118 31.9529 5.6282 31.8205 5.71757C31.688 5.80695 31.5323 5.85467 31.373 5.85471V5.85796Z" fill="#900B7B"/>

</svg>
