<svg width="61" height="40" viewBox="0 0 61 40" fill="none" xmlns="http://www.w3.org/2000/svg">
<path d="M12.0039 26.4863C11.4329 26.4863 11.1325 27.6447 11.1325 27.0684L11.0382 4.32388C11.0382 2.01846 13.0366 0.0012207 15.3205 0.0012207H44.9165C47.2004 0.0012207 49.1988 2.01846 49.1988 4.32388V11.643C49.1988 12.2194 48.7901 10.4788 48.2191 10.4788C47.6481 10.4788 47.2956 12.5104 47.2956 11.9341V4.32388C47.2956 2.97905 46.2488 1.9224 44.9165 1.9224H15.3205C13.9882 1.9224 12.9414 2.97905 12.9414 4.32388V26.8848C12.9414 27.4611 12.5849 26.4863 12.0039 26.4863Z" fill="#900B7B"/>
<path d="M57.7644 35.447H55.5757C55.0047 35.447 54.624 35.0628 54.624 34.4864C54.624 33.9101 55.0047 33.5259 55.5757 33.5259H57.7644C58.3354 33.5259 59.0016 33.0456 59.0016 32.2771V19.213C59.0016 18.4446 58.8112 17.9643 58.3354 17.484L53.6724 12.7771C53.1966 12.3928 52.5304 12.1047 51.9594 12.1047H49.1045V27.282C49.1045 27.8584 48.7239 28.2426 48.1529 28.2426H12.8471V32.2771C12.8471 32.8534 13.3229 33.5259 14.0842 33.5259H18.2715C18.8424 33.5259 19.2231 33.9101 19.2231 34.4864C19.2231 35.0628 18.8424 35.447 18.2715 35.447H14.0842C12.3713 35.447 10.9438 34.0061 10.9438 32.2771V27.282C10.9438 26.7057 11.3245 26.3214 11.8955 26.3214H47.2012V11.1441C47.2012 10.5677 47.5819 10.1835 48.1529 10.1835H51.9594C53.0062 10.1835 54.053 10.6638 55.0047 11.3362L59.7629 16.1392C60.6193 17.0037 61 17.9643 61 19.213V32.2771C60.9048 34.0061 59.4774 35.447 57.7644 35.447Z" fill="#900B7B"/>
<path d="M47.5819 35.447H26.2652C25.6942 35.447 25.3136 35.0628 25.3136 34.4864C25.3136 33.9101 25.6942 33.5259 26.2652 33.5259H47.5819C48.1529 33.5259 48.5335 33.9101 48.5335 34.4864C48.5335 35.0628 48.1529 35.447 47.5819 35.447Z" fill="#900B7B"/>
<path d="M59.9532 22.7672H48.1529C47.5819 22.7672 47.2012 22.383 47.2012 21.8066V11.1441C47.2012 10.5677 47.5819 10.1835 48.1529 10.1835H51.9594C53.1966 10.1835 54.1482 10.5677 55.0047 11.4323L59.6677 16.1392C60.429 17.0997 60.9048 18.1564 60.9048 19.213V21.8066C60.9048 22.383 60.5242 22.7672 59.9532 22.7672ZM49.1045 20.8461H59.0016V19.213C59.0016 18.6367 58.7161 17.9643 58.2402 17.484L53.6724 12.7771C53.1966 12.2968 52.7207 12.1047 51.9594 12.1047H49.1045V20.8461Z" fill="#900B7B"/>
<path d="M22.2683 39.0012C19.5086 39.0012 17.3198 36.7919 17.3198 34.0061C17.3198 31.2204 19.5086 29.0111 22.2683 29.0111C25.0281 29.0111 27.2168 31.2204 27.2168 34.0061C27.2168 36.7919 25.0281 39.0012 22.2683 39.0012ZM22.2683 30.9323C20.5554 30.9323 19.2231 32.2771 19.2231 34.0061C19.2231 35.7352 20.5554 37.08 22.2683 37.08C23.9813 37.08 25.3136 35.7352 25.3136 34.0061C25.3136 32.2771 23.9813 30.9323 22.2683 30.9323Z" fill="#900B7B"/>
<path d="M51.4836 39.0012C48.7239 39.0012 46.5351 36.7919 46.5351 34.0061C46.5351 31.2204 48.7239 29.0111 51.4836 29.0111C54.2434 29.0111 56.4321 31.2204 56.4321 34.0061C56.4321 36.7919 54.2434 39.0012 51.4836 39.0012ZM51.4836 30.9323C49.7707 30.9323 48.4384 32.2771 48.4384 34.0061C48.4384 35.7352 49.7707 37.08 51.4836 37.08C53.1966 37.08 54.5289 35.7352 54.5289 34.0061C54.5289 32.2771 53.1966 30.9323 51.4836 30.9323Z" fill="#900B7B"/>
<path d="M52.1498 25.8411H50.8175C50.2465 25.8411 49.8658 25.4569 49.8658 24.8805C49.8658 24.3042 50.2465 23.9199 50.8175 23.9199H52.1498C52.7207 23.9199 53.1014 24.3042 53.1014 24.8805C53.1014 25.4569 52.7207 25.8411 52.1498 25.8411Z" fill="#900B7B"/>
<path d="M8.08892 6.43718H3.80655C3.23557 6.43718 2.85491 6.05294 2.85491 5.47659C2.85491 4.90023 3.23557 4.516 3.80655 4.516H8.08892C8.65991 4.516 9.04056 4.90023 9.04056 5.47659C9.04056 6.05294 8.65991 6.43718 8.08892 6.43718Z" fill="#900B7B"/>
<path d="M8.08892 10.952H0.951638C0.380655 10.952 0 10.5677 0 9.99137C0 9.41501 0.380655 9.03078 0.951638 9.03078H8.08892C8.65991 9.03078 9.04056 9.41501 9.04056 9.99137C9.04056 10.5677 8.65991 10.952 8.08892 10.952Z" fill="#900B7B"/>
<path d="M8.08892 15.5628H3.80655C3.23557 15.5628 2.85491 15.1786 2.85491 14.6022C2.85491 14.0259 3.23557 13.6416 3.80655 13.6416H8.08892C8.65991 13.6416 9.04056 14.0259 9.04056 14.6022C9.04056 15.1786 8.65991 15.5628 8.08892 15.5628Z" fill="#900B7B"/>
<path d="M8.08892 20.1736H0.951638C0.380655 20.1736 0 19.7894 0 19.213C0 18.6367 0.380655 18.2525 0.951638 18.2525H8.08892C8.65991 18.2525 9.04056 18.6367 9.04056 19.213C9.04056 19.7894 8.65991 20.1736 8.08892 20.1736Z" fill="#900B7B"/>
<path d="M8.08892 24.6884H3.80655C3.23557 24.6884 2.85491 24.3042 2.85491 23.7278C2.85491 23.1515 3.23557 22.7672 3.80655 22.7672H8.08892C8.65991 22.7672 9.04056 23.1515 9.04056 23.7278C9.04056 24.3042 8.65991 24.6884 8.08892 24.6884Z" fill="#900B7B"/>
</svg>
