<svg viewBox="0 0 36 36" xmlns="http://www.w3.org/2000/svg">
    <path d="M26.1524 15.5841V8.7712C26.1524 8.57619 26.0623 8.39602 25.9348 8.25347L18.2966 0.232635C18.1541 0.082672 17.9514 0 17.7489 0H5.63873C3.40301 0 1.61719 1.82318 1.61719 4.05917V26.9588C1.61719 29.1948 3.40301 30.988 5.63873 30.988H15.1979C17.006 33.9892 20.2925 36 24.0364 36C29.7237 36 34.3682 31.378 34.3682 25.6833C34.3759 20.7087 30.8042 16.552 26.1524 15.5841ZM18.4993 2.63369L23.6239 8.02825H20.3C19.3095 8.02825 18.4993 7.21059 18.4993 6.22018V2.63369ZM5.63873 29.4873C4.23577 29.4873 3.11792 28.3617 3.11792 26.9588V4.05917C3.11792 2.64853 4.23577 1.50073 5.63873 1.50073H16.9986V6.22018C16.9986 8.04335 18.4768 9.52898 20.3 9.52898H24.6516V15.3888C24.4267 15.3814 24.2465 15.3589 24.0515 15.3589C21.4329 15.3589 19.0244 16.3644 17.2087 17.9401H7.67971C7.2669 17.9401 6.92934 18.2777 6.92934 18.6902C6.92934 19.103 7.2669 19.4406 7.67971 19.4406H15.8132C15.2803 20.1909 14.8376 20.9413 14.4926 21.7666H7.67971C7.2669 21.7666 6.92934 22.1042 6.92934 22.517C6.92934 22.9295 7.2669 23.2674 7.67971 23.2674H14.0048C13.8172 24.0177 13.7197 24.8505 13.7197 25.6833C13.7197 27.0337 13.9823 28.3694 14.455 29.495H5.63873V29.4873ZM24.0441 34.5069C19.1821 34.5069 15.2279 30.5527 15.2279 25.6907C15.2279 20.8287 19.1744 16.8744 24.0441 16.8744C28.9135 16.8744 32.8601 20.8287 32.8601 25.6907C32.8601 30.5527 28.9061 34.5069 24.0441 34.5069Z"/>
    <path d="M7.68005 15.6814H15.2807C15.6935 15.6814 16.031 15.3436 16.031 14.931C16.031 14.5182 15.6935 14.1807 15.2807 14.1807H7.68005C7.26724 14.1807 6.92969 14.5182 6.92969 14.931C6.92969 15.3436 7.26724 15.6814 7.68005 15.6814Z"/>
    <path d="M27.8856 25.5329L24.802 28.8568V20.6635C24.802 20.2506 24.4641 19.9131 24.0516 19.9131C23.6388 19.9131 23.3012 20.2506 23.3012 20.6635V28.8568L20.1949 25.5329C19.9098 25.2329 19.4297 25.2104 19.1295 25.4955C18.8293 25.7806 18.8067 26.2533 19.0921 26.5535L23.4814 31.2729C23.624 31.4229 23.819 31.513 24.0291 31.513C24.2392 31.513 24.4342 31.4229 24.5768 31.2729L28.9738 26.5535C29.2588 26.2533 29.2437 25.7732 28.9435 25.4955C28.6359 25.2104 28.1709 25.2329 27.8856 25.5329Z"/>
</svg>
