<svg width="30" height="30" viewBox="0 0 30 30" fill="none" xmlns="http://www.w3.org/2000/svg">
<path fill-rule="evenodd" clip-rule="evenodd" d="M13.1249 8.09664L9.36001 4.10178C8.84814 3.61393 8.04038 3.63624 7.55584 4.15159L6.71443 5.04651L6.51516 5.26922C4.96841 7.08607 4.56328 9.73015 5.49733 12.0626C6.87267 15.4971 8.55258 18.2678 10.5371 20.375C12.5215 22.4821 15.1302 24.265 18.3632 25.7236C20.6503 26.7556 23.2544 26.243 24.9644 24.4243L25.9006 23.4286C26.3668 22.9328 26.3664 22.1565 25.8999 21.6611L22.135 17.6663C21.6231 17.1784 20.8153 17.2007 20.3308 17.7161L18.6057 19.5509L18.243 19.4102C15.0041 18.0885 12.4484 15.2935 11.3057 11.7998L13.1256 9.86408C13.5918 9.36829 13.5915 8.59204 13.1249 8.09664Z" fill="white"/>
</svg>
