<svg width="41" height="41" viewBox="0 0 41 41" fill="none" xmlns="http://www.w3.org/2000/svg">
<rect width="41" height="41" rx="7.06897" fill="#F0EFF3"/>
<path d="M22.8564 20.9993L28.0517 15.804C28.2983 15.5579 28.437 15.2239 28.4373 14.8755C28.4376 14.5271 28.2995 14.1929 28.0534 13.9463C27.8072 13.6997 27.4732 13.561 27.1248 13.5607C26.7765 13.5604 26.4422 13.6985 26.1956 13.9447L21.0003 19.14L15.805 13.9447C15.5584 13.6981 15.224 13.5596 14.8753 13.5596C14.5266 13.5596 14.1922 13.6981 13.9456 13.9447C13.6991 14.1912 13.5605 14.5256 13.5605 14.8743C13.5605 15.223 13.6991 15.5575 13.9456 15.804L19.1409 20.9993L13.9456 26.1947C13.6991 26.4412 13.5605 26.7756 13.5605 27.1243C13.5605 27.473 13.6991 27.8075 13.9456 28.054C14.1922 28.3006 14.5266 28.4391 14.8753 28.4391C15.224 28.4391 15.5584 28.3006 15.805 28.054L21.0003 22.8587L26.1956 28.054C26.4422 28.3006 26.7766 28.4391 27.1253 28.4391C27.474 28.4391 27.8084 28.3006 28.055 28.054C28.3016 27.8075 28.4401 27.473 28.4401 27.1243C28.4401 26.7756 28.3016 26.4412 28.055 26.1947L22.8564 20.9993Z" fill="#2C2536"/>
</svg>
