<svg width="13" height="13" viewBox="0 0 13 13" fill="none" xmlns="http://www.w3.org/2000/svg">
<path fill-rule="evenodd" clip-rule="evenodd" d="M10.6705 0.271973C11.1098 0.634603 11.1098 1.22254 10.6705 1.58518L4.71599 6.5L10.6705 11.4148C11.1098 11.7775 11.1098 12.3654 10.6705 12.728C10.2311 13.0907 9.51884 13.0907 9.0795 12.728L2.32951 7.15661C1.89016 6.79397 1.89016 6.20604 2.32951 5.8434L9.0795 0.271973C9.51884 -0.0906576 10.2311 -0.0906575 10.6705 0.271973Z" fill="#878789"/>
</svg>
