<svg width="80" height="17" viewBox="0 0 80 17" fill="none" xmlns="http://www.w3.org/2000/svg">
<path d="M79.2799 9.11131C79.6954 8.69576 79.6954 8.02201 79.2799 7.60646L72.5081 0.834628C72.0925 0.419075 71.4188 0.419075 71.0032 0.834628C70.5877 1.25018 70.5877 1.92393 71.0032 2.33948L77.0226 8.35889L71.0032 14.3783C70.5877 14.7938 70.5877 15.4676 71.0032 15.8831C71.4188 16.2987 72.0925 16.2987 72.5081 15.8831L79.2799 9.11131ZM0.494141 9.42298H78.5275V7.2948H0.494141V9.42298Z" fill="#E8E8E8"/>
</svg>
