<svg width="8" height="13" viewBox="0 0 8 13" fill="none" xmlns="http://www.w3.org/2000/svg">
<g clip-path="url(#clip0_558_25)">
<path d="M7.83133 12.8407C8.05622 12.6283 8.05622 12.2837 7.83133 12.0713L1.39176 6.5003L7.83133 0.928718C8.05622 0.716322 8.05622 0.371694 7.83133 0.159298C7.60644 -0.0530992 7.2417 -0.0530992 7.01683 0.159298L0.164062 6.08795C0.0441884 6.20119 -0.00716668 6.35182 0.000799552 6.49974C-0.00716668 6.64818 0.0441884 6.7983 0.164062 6.91154L7.01743 12.8407C7.24228 13.0531 7.60644 13.0531 7.83133 12.8407Z" fill="#A3A3A3"/>
</g>
<defs>
<clipPath id="clip0_558_25">
<rect width="13" height="8" fill="white" transform="matrix(0 1 -1 0 8 0)"/>
</clipPath>
</defs>
</svg>


