<svg width="21" height="21" viewBox="0 0 21 21" fill="none" xmlns="http://www.w3.org/2000/svg">
<path fill-rule="evenodd" clip-rule="evenodd" d="M8.33984 18.2777C8.33984 19.4784 9.31314 20.4517 10.5138 20.4517C11.7144 20.4517 12.6877 19.4784 12.6877 18.2777V12.6257H18.3398C19.5404 12.6257 20.5137 11.6525 20.5137 10.4518C20.5137 9.25121 19.5404 8.27792 18.3398 8.27792H12.6877V2.62557C12.6877 1.42495 11.7144 0.45166 10.5138 0.45166C9.31314 0.45166 8.33984 1.42495 8.33984 2.62557L8.33984 8.27792H2.68758C1.48697 8.27792 0.513672 9.25121 0.513672 10.4518C0.513672 11.6525 1.48697 12.6257 2.68758 12.6257H8.33984L8.33984 18.2777Z" fill="#051485"/>
</svg>
