<svg width="35" height="35" viewBox="0 0 35 35" fill="none" xmlns="http://www.w3.org/2000/svg">
<path d="M0 3.5C0 1.567 1.567 0 3.5 0H31.5C33.433 0 35 1.567 35 3.5C35 5.433 33.433 7 31.5 7H3.5C1.567 7 0 5.433 0 3.5Z" fill="#102289"/>
<path d="M0 31.5C0 29.567 1.567 28 3.5 28H31.5C33.433 28 35 29.567 35 31.5C35 33.433 33.433 35 31.5 35H3.5C1.567 35 0 33.433 0 31.5Z" fill="#102289"/>
<path d="M0 17.5C0 15.567 1.567 14 3.5 14H31.5C33.433 14 35 15.567 35 17.5C35 19.433 33.433 21 31.5 21H3.5C1.567 21 0 19.433 0 17.5Z" fill="#102289"/>
</svg>
