<svg width="69" height="69" viewBox="0 0 69 69" fill="none" xmlns="http://www.w3.org/2000/svg">
<path fill-rule="evenodd" clip-rule="evenodd" d="M22.1789 0L21.4267 0.77389C19.9423 2.30141 18.4601 3.82669 16.9624 5.33647C16.5789 5.69981 16.1734 6.03928 15.7483 6.35294L24.7272 15.1694L15.3318 24.4941L6.5718 15.5647L0 22.3129V0H22.1789ZM68.4725 68.9751L68.4723 68.9751C68.2976 68.9628 68.1239 68.9506 67.9553 68.9506H47.0258L46.9128 68.7529L53.2023 62.7176L44.3293 53.9294L53.7529 44.5482L62.4776 53.4212L62.8701 53.0031L62.8703 53.0029L62.871 53.0021C63.8146 51.997 64.7178 51.0347 65.6047 50.1106C66.2782 49.4088 67.0617 48.6662 67.8441 47.9247L67.8445 47.9242L67.845 47.9237L67.8455 47.9233L67.846 47.9228L67.8465 47.9224C68.2359 47.5533 68.625 47.1845 69 46.8212V69C68.8262 69 68.6489 68.9875 68.4725 68.9751ZM67.4981 20.7239L67.5024 20.728L67.5054 20.731C68.0043 21.2135 68.5029 21.6958 68.9999 22.1788V0H46.821L52.1575 5.46353L53.1175 6.46588L44.3716 15.1129C45.408 16.1493 46.4397 17.1818 47.4755 18.2185C49.558 20.3025 51.6572 22.4033 53.8445 24.5859L62.527 15.7271C62.7577 15.9699 62.9826 16.212 63.2054 16.4518C63.63 16.9089 64.047 17.3577 64.4822 17.7882C65.4814 18.7732 66.4899 19.7487 67.4974 20.7232L67.4976 20.7234L67.4978 20.7236L67.4979 20.7237L67.4981 20.7239ZM21.945 68.9155H0.0625003V46.779L6.41547 53.4002L15.2108 44.4708L24.5497 53.9014L15.8249 62.5273L22.1779 68.6261L21.945 68.9155ZM31.3836 20.2655L22.8071 25.2067C24.3934 26.1206 25.9533 27.0238 27.4996 27.9191L27.5027 27.9209L27.5049 27.9221L27.5055 27.9225L27.5068 27.9232C29.7082 29.1978 31.8822 30.4565 34.066 31.7079C34.231 31.7678 34.4066 31.7924 34.5817 31.7803C34.7568 31.7681 34.9274 31.7194 35.0825 31.6373C36.2092 31.0242 37.3203 30.3799 38.4303 29.7363L38.4305 29.7362C38.8156 29.5129 39.2006 29.2897 39.586 29.0679L46.0943 25.2985C46.059 25.2515 46.0348 25.2082 46.0154 25.1736C45.9883 25.1251 45.9708 25.0938 45.946 25.0938C42.2848 22.962 38.6072 20.8444 34.9131 18.7408C34.7777 18.6801 34.6309 18.6487 34.4824 18.6487C34.334 18.6487 34.1873 18.6801 34.0519 18.7408C33.4159 19.0712 32.7971 19.4359 32.1811 19.799L32.1811 19.799L32.1811 19.7991C31.9151 19.9558 31.6497 20.1123 31.3836 20.2655ZM36.5572 48.9457V42.4516V36.2045C36.5571 36.028 36.5948 35.8535 36.6679 35.6927C36.741 35.532 36.8477 35.3888 36.9807 35.2728C40.5878 33.1551 44.2231 31.0375 47.8584 28.9692C47.962 28.9365 48.0683 28.9128 48.1761 28.8987C48.1761 29.0231 48.1868 29.1403 48.1975 29.2568C48.208 29.3715 48.2184 29.4854 48.2184 29.6045V41.6045C48.2139 41.792 48.1687 41.9763 48.0858 42.1445C48.0029 42.3127 47.8844 42.4609 47.7384 42.5787C44.3085 44.6366 40.8785 46.5946 37.3968 48.5821L37.3964 48.5823L37.0937 48.7551C36.9737 48.7692 36.8395 48.8187 36.5572 48.9457ZM29.6619 47.3928L32.3372 48.9246C32.3905 48.8119 32.4307 48.6934 32.4572 48.5716C32.4572 47.174 32.4611 45.7763 32.465 44.3787C32.4729 41.5834 32.4807 38.7881 32.4572 35.9928C32.4235 35.8197 32.3532 35.6558 32.2509 35.5121C32.1487 35.3684 32.0168 35.2483 31.8643 35.1599C29.7818 33.9278 27.6825 32.7169 25.5858 31.5074C24.9676 31.1508 24.3497 30.7943 23.7324 30.4375L20.8524 28.7999C20.796 29.075 20.796 29.2091 20.796 29.3502V29.3504C20.796 30.717 20.7905 32.0843 20.785 33.4521C20.774 36.1894 20.763 38.9287 20.796 41.6681C20.8292 41.8662 20.9043 42.055 21.0163 42.2217C21.1282 42.3885 21.2746 42.5294 21.4454 42.6351C23.4203 43.8017 25.4102 44.946 27.3987 46.0896C28.1536 46.5237 28.9083 46.9577 29.6619 47.3928Z" fill="#102289"/>
</svg>
