<svg width="202" height="202" viewBox="0 0 202 202" fill="none" xmlns="http://www.w3.org/2000/svg">
<path d="M74.321 13.2965H72.4616C72.4086 12.9916 72.3108 12.7215 72.1683 12.4862C72.0258 12.2475 71.8485 12.0453 71.6364 11.8796C71.4242 11.7139 71.1823 11.5896 70.9105 11.5067C70.642 11.4206 70.352 11.3775 70.0405 11.3775C69.487 11.3775 68.9964 11.5167 68.5689 11.7951C68.1413 12.0702 67.8066 12.4745 67.5646 13.0082C67.3227 13.5385 67.2017 14.1864 67.2017 14.9521C67.2017 15.7309 67.3227 16.3872 67.5646 16.9208C67.8099 17.4511 68.1446 17.8522 68.5689 18.1239C68.9964 18.3924 69.4853 18.5266 70.0355 18.5266C70.3404 18.5266 70.6255 18.4869 70.8906 18.4073C71.1591 18.3245 71.3994 18.2035 71.6115 18.0444C71.8269 17.8853 72.0076 17.6897 72.1534 17.4577C72.3026 17.2257 72.4053 16.9606 72.4616 16.6623L74.321 16.6722C74.2514 17.1561 74.1006 17.6102 73.8686 18.0344C73.6399 18.4587 73.34 18.8332 72.9688 19.158C72.5975 19.4795 72.1634 19.7314 71.6662 19.9137C71.169 20.0927 70.6172 20.1822 70.0107 20.1822C69.1158 20.1822 68.317 19.975 67.6143 19.5607C66.9117 19.1464 66.3582 18.5482 65.9538 17.766C65.5495 16.9838 65.3473 16.0458 65.3473 14.9521C65.3473 13.855 65.5511 12.917 65.9588 12.1381C66.3665 11.3559 66.9216 10.7577 67.6243 10.3434C68.3269 9.9291 69.1224 9.72195 70.0107 9.72195C70.5774 9.72195 71.1044 9.80149 71.5916 9.96058C72.0788 10.1197 72.513 10.3533 72.8942 10.6616C73.2753 10.9665 73.5885 11.341 73.8338 11.7852C74.0824 12.226 74.2448 12.7298 74.321 13.2965ZM75.513 13.8832V12.4066H82.1948V13.8832H79.7239V20.043H77.9838V13.8832H75.513ZM86.6444 20.1921C85.8986 20.1921 85.2523 20.0281 84.7054 19.6999C84.1586 19.3718 83.7343 18.9128 83.4327 18.3228C83.1344 17.7328 82.9853 17.0434 82.9853 16.2546C82.9853 15.4658 83.1344 14.7747 83.4327 14.1815C83.7343 13.5882 84.1586 13.1275 84.7054 12.7994C85.2523 12.4712 85.8986 12.3072 86.6444 12.3072C87.3901 12.3072 88.0364 12.4712 88.5833 12.7994C89.1301 13.1275 89.5527 13.5882 89.851 14.1815C90.1526 14.7747 90.3034 15.4658 90.3034 16.2546C90.3034 17.0434 90.1526 17.7328 89.851 18.3228C89.5527 18.9128 89.1301 19.3718 88.5833 19.6999C88.0364 20.0281 87.3901 20.1921 86.6444 20.1921ZM86.6543 18.7504C87.0587 18.7504 87.3967 18.6393 87.6685 18.4173C87.9403 18.1919 88.1425 17.8903 88.275 17.5124C88.4109 17.1346 88.4789 16.7137 88.4789 16.2496C88.4789 15.7823 88.4109 15.3597 88.275 14.9819C88.1425 14.6007 87.9403 14.2975 87.6685 14.0721C87.3967 13.8467 87.0587 13.734 86.6543 13.734C86.24 13.734 85.8953 13.8467 85.6202 14.0721C85.3484 14.2975 85.1446 14.6007 85.0087 14.9819C84.8761 15.3597 84.8098 15.7823 84.8098 16.2496C84.8098 16.7137 84.8761 17.1346 85.0087 17.5124C85.1446 17.8903 85.3484 18.1919 85.6202 18.4173C85.8953 18.6393 86.24 18.7504 86.6543 18.7504ZM91.831 22.9066V12.4066H93.6009V13.6694H93.7053C93.7981 13.4838 93.929 13.2866 94.098 13.0778C94.267 12.8656 94.4957 12.685 94.7841 12.5359C95.0724 12.3834 95.4403 12.3072 95.8878 12.3072C96.4777 12.3072 97.0097 12.458 97.4837 12.7596C97.9609 13.0579 98.3388 13.5004 98.6172 14.087C98.8989 14.6703 99.0398 15.3862 99.0398 16.2347C99.0398 17.0733 98.9022 17.7859 98.6271 18.3725C98.352 18.9592 97.9775 19.4066 97.5036 19.7148C97.0296 20.0231 96.4927 20.1772 95.8928 20.1772C95.4553 20.1772 95.0923 20.1043 94.804 19.9585C94.5156 19.8126 94.2836 19.637 94.108 19.4315C93.9356 19.2227 93.8014 19.0254 93.7053 18.8398H93.6307V22.9066H91.831ZM93.5959 16.2248C93.5959 16.7186 93.6655 17.1512 93.8047 17.5224C93.9472 17.8936 94.151 18.1836 94.4162 18.3924C94.6847 18.5979 95.0095 18.7006 95.3906 18.7006C95.7884 18.7006 96.1214 18.5946 96.3899 18.3825C96.6584 18.167 96.8606 17.8737 96.9964 17.5025C97.1357 17.128 97.2053 16.7021 97.2053 16.2248C97.2053 15.7508 97.1373 15.3299 97.0014 14.962C96.8655 14.5941 96.6634 14.3058 96.3949 14.0969C96.1264 13.8881 95.7917 13.7837 95.3906 13.7837C95.0062 13.7837 94.6797 13.8848 94.4112 14.087C94.1428 14.2892 93.9389 14.5726 93.7997 14.9371C93.6638 15.3017 93.5959 15.7309 93.5959 16.2248ZM103.912 20.1921C103.166 20.1921 102.52 20.0281 101.973 19.6999C101.426 19.3718 101.002 18.9128 100.7 18.3228C100.402 17.7328 100.253 17.0434 100.253 16.2546C100.253 15.4658 100.402 14.7747 100.7 14.1815C101.002 13.5882 101.426 13.1275 101.973 12.7994C102.52 12.4712 103.166 12.3072 103.912 12.3072C104.658 12.3072 105.304 12.4712 105.851 12.7994C106.398 13.1275 106.82 13.5882 107.119 14.1815C107.42 14.7747 107.571 15.4658 107.571 16.2546C107.571 17.0434 107.42 17.7328 107.119 18.3228C106.82 18.9128 106.398 19.3718 105.851 19.6999C105.304 20.0281 104.658 20.1921 103.912 20.1921ZM103.922 18.7504C104.326 18.7504 104.664 18.6393 104.936 18.4173C105.208 18.1919 105.41 17.8903 105.543 17.5124C105.679 17.1346 105.746 16.7137 105.746 16.2496C105.746 15.7823 105.679 15.3597 105.543 14.9819C105.41 14.6007 105.208 14.2975 104.936 14.0721C104.664 13.8467 104.326 13.734 103.922 13.734C103.508 13.734 103.163 13.8467 102.888 14.0721C102.616 14.2975 102.412 14.6007 102.276 14.9819C102.144 15.3597 102.077 15.7823 102.077 16.2496C102.077 16.7137 102.144 17.1346 102.276 17.5124C102.412 17.8903 102.616 18.1919 102.888 18.4173C103.163 18.6393 103.508 18.7504 103.922 18.7504ZM114.344 15.479V16.9556H110.277V15.479H114.344ZM110.834 12.4066V20.043H109.099V12.4066H110.834ZM115.522 12.4066V20.043H113.792V12.4066H115.522ZM119.54 20.1971C119.056 20.1971 118.62 20.1109 118.233 19.9386C117.848 19.7629 117.543 19.5044 117.318 19.163C117.096 18.8216 116.985 18.4007 116.985 17.9002C116.985 17.4693 117.064 17.113 117.223 16.8313C117.382 16.5496 117.6 16.3242 117.875 16.1552C118.15 15.9862 118.46 15.8585 118.804 15.7724C119.152 15.6829 119.512 15.6183 119.883 15.5785C120.331 15.5321 120.694 15.4906 120.972 15.4542C121.25 15.4144 121.453 15.3548 121.578 15.2752C121.708 15.1924 121.772 15.0647 121.772 14.8924V14.8626C121.772 14.488 121.661 14.198 121.439 13.9925C121.217 13.7871 120.897 13.6843 120.48 13.6843C120.039 13.6843 119.689 13.7804 119.431 13.9727C119.176 14.1649 119.003 14.3919 118.914 14.6538L117.233 14.4151C117.366 13.9511 117.585 13.5633 117.89 13.2518C118.194 12.9369 118.567 12.7016 119.008 12.5458C119.449 12.3867 119.936 12.3072 120.47 12.3072C120.838 12.3072 121.204 12.3503 121.569 12.4364C121.933 12.5226 122.266 12.6651 122.568 12.864C122.869 13.0595 123.111 13.3263 123.294 13.6644C123.479 14.0025 123.572 14.4251 123.572 14.9322V20.043H121.842V18.994H121.782C121.673 19.2061 121.519 19.4049 121.32 19.5906C121.124 19.7728 120.877 19.9203 120.579 20.033C120.284 20.1424 119.938 20.1971 119.54 20.1971ZM120.007 18.8746C120.369 18.8746 120.682 18.8034 120.947 18.6609C121.212 18.515 121.416 18.3228 121.559 18.0842C121.704 17.8455 121.777 17.5853 121.777 17.3036V16.4038C121.721 16.4502 121.625 16.4933 121.489 16.533C121.356 16.5728 121.207 16.6076 121.042 16.6374C120.876 16.6673 120.712 16.6938 120.549 16.717C120.387 16.7402 120.246 16.7601 120.127 16.7766C119.858 16.8131 119.618 16.8728 119.406 16.9556C119.194 17.0385 119.026 17.1545 118.904 17.3036C118.781 17.4495 118.72 17.6384 118.72 17.8704C118.72 18.2018 118.841 18.4521 119.083 18.6211C119.325 18.7901 119.633 18.8746 120.007 18.8746ZM128.934 20.043V9.86115H132.832C133.567 9.86115 134.179 9.97715 134.666 10.2092C135.157 10.4379 135.523 10.7511 135.765 11.1488C136.01 11.5465 136.133 11.9973 136.133 12.5011C136.133 12.9154 136.053 13.27 135.894 13.565C135.735 13.8567 135.521 14.0936 135.253 14.2759C134.984 14.4582 134.684 14.5891 134.353 14.6687V14.7681C134.714 14.788 135.061 14.899 135.392 15.1012C135.727 15.3001 136 15.5818 136.212 15.9464C136.424 16.311 136.531 16.7518 136.531 17.2688C136.531 17.7958 136.403 18.2698 136.148 18.6907C135.893 19.1083 135.508 19.4381 134.994 19.68C134.481 19.922 133.834 20.043 133.055 20.043H128.934ZM130.778 18.5018H132.762C133.432 18.5018 133.914 18.3742 134.209 18.119C134.507 17.8604 134.656 17.529 134.656 17.1246C134.656 16.823 134.582 16.5513 134.433 16.3093C134.283 16.064 134.071 15.8718 133.796 15.7326C133.521 15.5901 133.193 15.5188 132.812 15.5188H130.778V18.5018ZM130.778 14.1914H132.603C132.921 14.1914 133.208 14.1334 133.463 14.0174C133.718 13.8981 133.919 13.7307 134.065 13.5153C134.214 13.2965 134.288 13.038 134.288 12.7397C134.288 12.3453 134.149 12.0205 133.871 11.7653C133.596 11.5101 133.186 11.3825 132.643 11.3825H130.778V14.1914Z" fill="black"/>
<path d="M185.06 129.987L185.06 131.846C184.755 131.899 184.485 131.997 184.25 132.139C184.011 132.282 183.809 132.459 183.643 132.671C183.478 132.883 183.353 133.125 183.27 133.397C183.184 133.666 183.141 133.956 183.141 134.267C183.141 134.821 183.28 135.311 183.559 135.739C183.834 136.166 184.238 136.501 184.772 136.743C185.302 136.985 185.95 137.106 186.716 137.106C187.495 137.106 188.151 136.985 188.684 136.743C189.215 136.498 189.616 136.163 189.888 135.739C190.156 135.311 190.29 134.822 190.29 134.272C190.29 133.967 190.251 133.682 190.171 133.417C190.088 133.149 189.967 132.908 189.808 132.696C189.649 132.481 189.453 132.3 189.221 132.154C188.989 132.005 188.724 131.902 188.426 131.846L188.436 129.987C188.92 130.056 189.374 130.207 189.798 130.439C190.222 130.668 190.597 130.968 190.922 131.339C191.243 131.71 191.495 132.144 191.677 132.641C191.856 133.139 191.946 133.69 191.946 134.297C191.946 135.192 191.739 135.991 191.324 136.693C190.91 137.396 190.312 137.949 189.53 138.354C188.747 138.758 187.809 138.96 186.716 138.96C185.619 138.96 184.681 138.756 183.902 138.349C183.12 137.941 182.521 137.386 182.107 136.683C181.693 135.981 181.486 135.185 181.486 134.297C181.486 133.73 181.565 133.203 181.724 132.716C181.883 132.229 182.117 131.795 182.425 131.413C182.73 131.032 183.105 130.719 183.549 130.474C183.99 130.225 184.493 130.063 185.06 129.987ZM185.647 128.795L184.17 128.795L184.17 122.113L185.647 122.113L185.647 124.584L191.807 124.584L191.807 126.324L185.647 126.324L185.647 128.795ZM191.956 117.663C191.956 118.409 191.792 119.055 191.464 119.602C191.135 120.149 190.676 120.573 190.086 120.875C189.497 121.173 188.807 121.322 188.018 121.322C187.229 121.322 186.538 121.173 185.945 120.875C185.352 120.573 184.891 120.149 184.563 119.602C184.235 119.055 184.071 118.409 184.071 117.663C184.071 116.918 184.235 116.271 184.563 115.724C184.891 115.177 185.352 114.755 185.945 114.457C186.538 114.155 187.229 114.004 188.018 114.004C188.807 114.004 189.497 114.155 190.086 114.457C190.676 114.755 191.135 115.177 191.464 115.724C191.792 116.271 191.956 116.918 191.956 117.663ZM190.514 117.653C190.514 117.249 190.403 116.911 190.181 116.639C189.956 116.367 189.654 116.165 189.276 116.033C188.898 115.897 188.477 115.829 188.013 115.829C187.546 115.829 187.123 115.897 186.746 116.033C186.364 116.165 186.061 116.367 185.836 116.639C185.61 116.911 185.498 117.249 185.498 117.653C185.498 118.068 185.61 118.412 185.836 118.687C186.061 118.959 186.364 119.163 186.746 119.299C187.123 119.431 187.546 119.498 188.013 119.498C188.477 119.498 188.898 119.431 189.276 119.299C189.654 119.163 189.956 118.959 190.181 118.687C190.403 118.412 190.514 118.068 190.514 117.653ZM194.67 112.477L184.17 112.477L184.17 110.707L185.433 110.707L185.433 110.602C185.247 110.51 185.05 110.379 184.841 110.21C184.629 110.041 184.449 109.812 184.3 109.524C184.147 109.235 184.071 108.867 184.071 108.42C184.071 107.83 184.222 107.298 184.523 106.824C184.822 106.347 185.264 105.969 185.851 105.69C186.434 105.409 187.15 105.268 187.998 105.268C188.837 105.268 189.55 105.405 190.136 105.68C190.723 105.956 191.17 106.33 191.479 106.804C191.787 107.278 191.941 107.815 191.941 108.415C191.941 108.852 191.868 109.215 191.722 109.504C191.576 109.792 191.401 110.024 191.195 110.2C190.986 110.372 190.789 110.506 190.604 110.602L190.604 110.677L194.67 110.677L194.67 112.477ZM187.988 110.712C188.482 110.712 188.915 110.642 189.286 110.503C189.657 110.36 189.947 110.157 190.156 109.891C190.362 109.623 190.464 109.298 190.464 108.917C190.464 108.519 190.358 108.186 190.146 107.918C189.931 107.649 189.637 107.447 189.266 107.311C188.892 107.172 188.466 107.102 187.988 107.102C187.514 107.102 187.094 107.17 186.726 107.306C186.358 107.442 186.069 107.644 185.861 107.913C185.652 108.181 185.547 108.516 185.547 108.917C185.547 109.301 185.648 109.628 185.851 109.896C186.053 110.165 186.336 110.369 186.701 110.508C187.065 110.644 187.495 110.712 187.988 110.712ZM191.956 100.396C191.956 101.141 191.792 101.788 191.464 102.335C191.135 102.881 190.676 103.306 190.086 103.607C189.497 103.906 188.807 104.055 188.018 104.055C187.229 104.055 186.538 103.906 185.945 103.607C185.352 103.306 184.891 102.881 184.563 102.335C184.235 101.788 184.071 101.141 184.071 100.396C184.071 99.6499 184.235 99.0036 184.563 98.4568C184.891 97.9099 185.352 97.4873 185.945 97.189C186.538 96.8874 187.229 96.7366 188.018 96.7366C188.807 96.7366 189.497 96.8874 190.086 97.189C190.676 97.4873 191.135 97.9099 191.464 98.4568C191.792 99.0036 191.956 99.6499 191.956 100.396ZM190.514 100.386C190.514 99.9814 190.403 99.6433 190.181 99.3715C189.956 99.0998 189.654 98.8976 189.276 98.765C188.898 98.6291 188.477 98.5612 188.013 98.5612C187.546 98.5612 187.123 98.6291 186.746 98.765C186.364 98.8976 186.061 99.0998 185.836 99.3715C185.61 99.6433 185.498 99.9814 185.498 100.386C185.498 100.8 185.61 101.145 185.836 101.42C186.061 101.692 186.364 101.895 186.746 102.031C187.123 102.164 187.546 102.23 188.013 102.23C188.477 102.23 188.898 102.164 189.276 102.031C189.654 101.895 189.956 101.692 190.181 101.42C190.403 101.145 190.514 100.8 190.514 100.386ZM187.243 89.964L188.719 89.964L188.719 94.0308L187.243 94.0308L187.243 89.964ZM184.17 93.474L191.807 93.474L191.807 95.2091L184.17 95.2091L184.17 93.474ZM184.17 88.7858L191.807 88.7858L191.807 90.5159L184.17 90.5159L184.17 88.7858ZM191.961 84.7675C191.961 85.2514 191.875 85.6872 191.702 86.075C191.527 86.4595 191.268 86.7644 190.927 86.9898C190.585 87.2119 190.164 87.3229 189.664 87.3229C189.233 87.3229 188.877 87.2433 188.595 87.0843C188.313 86.9252 188.088 86.7081 187.919 86.433C187.75 86.1579 187.622 85.848 187.536 85.5033C187.447 85.1553 187.382 84.7957 187.342 84.4244C187.296 83.977 187.254 83.6141 187.218 83.3357C187.178 83.0573 187.118 82.8551 187.039 82.7291C186.956 82.5999 186.828 82.5352 186.656 82.5352L186.626 82.5352C186.252 82.5352 185.962 82.6463 185.756 82.8683C185.551 83.0904 185.448 83.4102 185.448 83.8279C185.448 84.2687 185.544 84.6183 185.736 84.8769C185.929 85.1321 186.156 85.3044 186.417 85.3939L186.179 87.0743C185.715 86.9417 185.327 86.723 185.015 86.4181C184.701 86.1131 184.465 85.7403 184.309 85.2994C184.15 84.8586 184.071 84.3714 184.071 83.8378C184.071 83.4699 184.114 83.1037 184.2 82.7391C184.286 82.3745 184.429 82.0414 184.628 81.7398C184.823 81.4382 185.09 81.1962 185.428 81.0139C185.766 80.8283 186.189 80.7355 186.696 80.7355L191.807 80.7355L191.807 82.4656L190.758 82.4656L190.758 82.5253C190.97 82.6347 191.169 82.7888 191.354 82.9877C191.537 83.1832 191.684 83.4301 191.797 83.7284C191.906 84.0234 191.961 84.3698 191.961 84.7675ZM190.638 84.3002C190.638 83.9389 190.567 83.6257 190.425 83.3605C190.279 83.0954 190.086 82.8915 189.848 82.749C189.609 82.6032 189.349 82.5303 189.067 82.5303L188.167 82.5303C188.214 82.5866 188.257 82.6827 188.297 82.8186C188.336 82.9512 188.371 83.1003 188.401 83.2661C188.431 83.4318 188.457 83.5959 188.481 83.7583C188.504 83.9207 188.524 84.0615 188.54 84.1808C188.577 84.4493 188.636 84.6896 188.719 84.9017C188.802 85.1138 188.918 85.2812 189.067 85.4039C189.213 85.5265 189.402 85.5878 189.634 85.5878C189.965 85.5878 190.216 85.4668 190.385 85.2249C190.554 84.9829 190.638 84.6747 190.638 84.3002ZM185.06 66.6585L185.06 68.5178C184.755 68.5709 184.485 68.6686 184.25 68.8112C184.011 68.9537 183.809 69.131 183.643 69.3431C183.478 69.5552 183.353 69.7972 183.27 70.069C183.184 70.3374 183.141 70.6275 183.141 70.939C183.141 71.4925 183.28 71.983 183.559 72.4106C183.834 72.8382 184.238 73.1729 184.772 73.4149C185.302 73.6568 185.95 73.7778 186.716 73.7778C187.495 73.7778 188.151 73.6568 188.684 73.4149C189.215 73.1696 189.616 72.8348 189.888 72.4106C190.156 71.983 190.29 71.4942 190.29 70.944C190.29 70.6391 190.251 70.354 190.171 70.0889C190.088 69.8204 189.967 69.5801 189.808 69.368C189.649 69.1526 189.453 68.9719 189.221 68.8261C188.989 68.6769 188.724 68.5742 188.426 68.5178L188.436 66.6585C188.92 66.7281 189.374 66.8789 189.798 67.1109C190.222 67.3396 190.597 67.6395 190.922 68.0107C191.243 68.382 191.495 68.8161 191.677 69.3133C191.856 69.8105 191.946 70.3623 191.946 70.9688C191.946 71.8637 191.739 72.6625 191.324 73.3651C190.91 74.0678 190.312 74.6213 189.53 75.0257C188.747 75.43 187.809 75.6322 186.716 75.6322C185.619 75.6322 184.681 75.4284 183.902 75.0207C183.12 74.613 182.521 74.0579 182.107 73.3552C181.693 72.6526 181.486 71.8571 181.486 70.9688C181.486 70.4021 181.565 69.8751 181.724 69.3879C181.883 68.9007 182.117 68.4665 182.425 68.0853C182.73 67.7042 183.105 67.391 183.549 67.1457C183.99 66.8971 184.493 66.7347 185.06 66.6585Z" fill="black"/>
<path fill-rule="evenodd" clip-rule="evenodd" d="M29.4154 1.26862V0.121582H30.569V1.26862H29.4154ZM124.011 1.26862V0.121582H125.165V1.26862H124.011ZM171.308 1.26862V0.121582H172.462V1.26862H171.308ZM29.4154 5.85677V3.56269H30.569V5.85677H29.4154ZM124.011 5.85677V3.56269H125.165V5.85677H124.011ZM171.308 5.85677V3.56269H172.462V5.85677H171.308ZM29.4154 10.4449V8.15084H30.569V10.4449H29.4154ZM124.011 10.4449V8.15084H125.165V10.4449H124.011ZM171.308 10.4449V8.15084H172.462V10.4449H171.308ZM29.4154 15.0331V12.739H30.569V15.0331H29.4154ZM124.011 15.0331V12.739H125.165V15.0331H124.011ZM171.308 15.0331V12.739H172.462V15.0331H171.308ZM29.4154 19.6212V17.3271H30.569V19.6212H29.4154ZM124.011 19.6212V17.3271H125.165V19.6212H124.011ZM171.308 19.6212V17.3271H172.462V19.6212H171.308ZM29.4154 24.2094V21.9153H30.569V24.2094H29.4154ZM124.011 24.2094V21.9153H125.165V24.2094H124.011ZM171.308 24.2094V21.9153H172.462V24.2094H171.308ZM29.4154 28.7975V26.5034H30.569V28.7975H29.4154ZM124.011 28.7975V26.5034H125.165V28.7975H124.011ZM171.308 28.7975V26.5034H172.462V28.7975H171.308ZM175.497 30.6915H173.203V29.5379L175.497 29.5379V30.6915ZM180.085 30.6915H177.791V29.5379H180.085V30.6915ZM184.673 30.6915H182.379V29.5379H184.673V30.6915ZM189.261 30.6915L186.967 30.6915V29.5379H189.261V30.6915ZM193.849 30.6915H191.555V29.5379H193.849V30.6915ZM198.437 30.6915H196.143V29.5379H198.437V30.6915ZM201.879 30.6915H200.731V29.5379H201.879V30.6915ZM138.792 30.6915H136.497V29.5379H138.792V30.6915ZM143.38 30.6915H141.086V29.5379H143.38V30.6915ZM147.968 30.6915L145.674 30.6915V29.5379H147.968V30.6915ZM152.556 30.6915H150.262V29.5379H152.556V30.6915ZM157.144 30.6915H154.85V29.5379H157.144V30.6915ZM161.732 30.6915H159.438V29.5379H161.732V30.6915ZM166.32 30.6915H164.026V29.5379H166.32V30.6915ZM170.908 30.6915H168.614V29.5379H170.908V30.6915ZM97.4982 30.6915H95.2041V29.5379H97.4982V30.6915ZM102.086 30.6915H99.7923V29.5379H102.086V30.6915ZM106.674 30.6915H104.38V29.5379H106.674V30.6915ZM111.263 30.6915H108.969V29.5379H111.263V30.6915ZM115.851 30.6915H113.557V29.5379H115.851V30.6915ZM120.439 30.6915H118.145V29.5379H120.439V30.6915ZM125.027 30.6915H122.733V29.5379H125.027V30.6915ZM129.615 30.6915H127.321V29.5379H129.615V30.6915ZM134.203 30.6915H131.909V29.5379H134.203V30.6915ZM56.2048 30.6915H53.9108V29.5379L56.2048 29.5379V30.6915ZM60.793 30.6915H58.4989V29.5379H60.793V30.6915ZM65.3811 30.6915H63.0871V29.5379H65.3811V30.6915ZM69.9693 30.6915H67.6752V29.5379H69.9693V30.6915ZM74.5574 30.6915H72.2634V29.5379H74.5574V30.6915ZM79.1456 30.6915H76.8515V29.5379H79.1456V30.6915ZM83.7337 30.6915H81.4397V29.5379H83.7337V30.6915ZM88.3219 30.6915H86.0278V29.5379H88.3219V30.6915ZM92.91 30.6915H90.616V29.5379H92.91V30.6915ZM14.9115 30.6915H12.6174V29.538L14.9115 29.5379V30.6915ZM19.4996 30.6915H17.2056V29.5379H19.4996V30.6915ZM24.0878 30.6915H21.7937V29.5379H24.0878V30.6915ZM28.6759 30.6915L26.3819 30.6915V29.5379H28.6759V30.6915ZM33.2641 30.6915H30.97V29.5379H33.2641V30.6915ZM37.8522 30.6915H35.5582V29.5379H37.8522V30.6915ZM42.4404 30.6915H40.1463V29.5379H42.4404V30.6915ZM47.0285 30.6915H44.7345V29.5379H47.0285V30.6915ZM51.6167 30.6915H49.3226V29.5379H51.6167V30.6915ZM1.14704 30.6915H0V29.538H1.14704V30.6915ZM5.73519 30.6915H3.44111V29.538H5.73519V30.6915ZM10.3233 30.6915H8.02926V29.538H10.3233V30.6915ZM29.4154 33.3857V31.0916H30.569V33.3857H29.4154ZM124.011 33.3857V31.0916H125.165V33.3857H124.011ZM171.308 33.3857V31.0916H172.462V33.3857H171.308ZM29.4154 37.9738V35.6797H30.569V37.9738H29.4154ZM124.011 37.9738V35.6797H125.165V37.9738H124.011ZM171.308 37.9738V35.6797H172.462V37.9738H171.308ZM29.4154 42.562V40.2679H30.569V42.562H29.4154ZM124.011 42.562V40.2679H125.165V42.562H124.011ZM171.308 42.562V40.2679H172.462V42.562H171.308ZM29.4154 47.1501V44.856H30.569V47.1501H29.4154ZM124.011 47.1501V44.856H125.165V47.1501H124.011ZM171.308 47.1501V44.856H172.462V47.1501H171.308ZM29.4154 51.7383V49.4442H30.569V51.7383H29.4154ZM124.011 51.7383V49.4442H125.165V51.7383H124.011ZM171.308 51.7383V49.4442H172.462V51.7383H171.308ZM29.4154 56.3264V54.0323H30.569V56.3264H29.4154ZM124.011 56.3264V54.0323H125.165V56.3264H124.011ZM171.308 56.3264V54.0323H172.462V56.3264H171.308ZM29.4154 60.9146V58.6205H30.569V60.9146H29.4154ZM124.011 60.9146V58.6205H125.165V60.9146H124.011ZM171.308 60.9146V58.6205H172.462V60.9146H171.308ZM29.4154 65.5027V63.2086H30.569V65.5027H29.4154ZM124.011 65.5027V63.2086H125.165V65.5027H124.011ZM171.308 65.5027V63.2086H172.462V65.5027H171.308ZM29.4154 70.0909V67.7968H30.569V70.0909H29.4154ZM124.011 70.0909V67.7968H125.165V70.0909H124.011ZM171.308 70.0909V67.7968H172.462V70.0909H171.308ZM29.4154 74.679V72.3849H30.569V74.679H29.4154ZM124.011 74.679V72.3849H125.165V74.679H124.011ZM171.308 74.679V72.3849H172.462V74.679H171.308ZM147.968 77.9889H145.674V76.8353H147.968V77.9889ZM152.556 77.9889H150.262V76.8353H152.556V77.9889ZM157.144 77.9889H154.85V76.8353H157.144V77.9889ZM161.732 77.9889H159.438V76.8353H161.732V77.9889ZM166.32 77.9889H164.026V76.8353H166.32V77.9889ZM170.908 77.9889H168.614V76.8353H170.908V77.9889ZM175.497 77.9889H173.203V76.8353H175.497V77.9889ZM180.085 77.9889H177.791V76.8353H180.085V77.9889ZM184.673 77.9889H182.379V76.8353H184.673V77.9889ZM189.261 77.9889H186.967V76.8353H189.261V77.9889ZM193.849 77.9889H191.555V76.8353H193.849V77.9889ZM198.437 77.9889H196.143V76.8353H198.437V77.9889ZM201.879 77.9889H200.731V76.8353H201.879V77.9889ZM1.14704 77.9889H0V76.8353H1.14704V77.9889ZM5.73519 77.9889H3.44111V76.8353H5.73519V77.9889ZM10.3233 77.9889H8.02926V76.8353H10.3233V77.9889ZM14.9115 77.9889H12.6174V76.8353H14.9115V77.9889ZM19.4996 77.9889H17.2056V76.8353H19.4996V77.9889ZM24.0878 77.9889H21.7937V76.8353H24.0878V77.9889ZM28.6759 77.9889H26.3819V76.8353H28.6759V77.9889ZM33.2641 77.9889H30.97V76.8353H33.2641V77.9889ZM37.8522 77.9889H35.5582V76.8353H37.8522V77.9889ZM42.4404 77.9889H40.1463V76.8353H42.4404V77.9889ZM47.0285 77.9889H44.7345V76.8353H47.0285V77.9889ZM51.6167 77.9889H49.3226V76.8353H51.6167V77.9889ZM56.2048 77.9889H53.9108V76.8353H56.2048V77.9889ZM60.793 77.9889H58.4989V76.8353H60.793V77.9889ZM65.3811 77.9889H63.0871V76.8353H65.3811V77.9889ZM69.9693 77.9889H67.6752V76.8353H69.9693V77.9889ZM74.5574 77.9889H72.2634V76.8353H74.5574V77.9889ZM79.1456 77.9889H76.8515V76.8353H79.1456V77.9889ZM83.7337 77.9889H81.4397V76.8353H83.7337V77.9889ZM88.3219 77.9889H86.0278V76.8353H88.3219V77.9889ZM92.91 77.9889H90.616V76.8353H92.91V77.9889ZM97.4982 77.9889H95.2041V76.8353H97.4982V77.9889ZM102.086 77.9889H99.7923V76.8353H102.086V77.9889ZM106.674 77.9889H104.38V76.8353H106.674V77.9889ZM111.263 77.9889H108.969V76.8353H111.263V77.9889ZM115.851 77.9889H113.557V76.8353H115.851V77.9889ZM120.439 77.9889H118.145V76.8353H120.439V77.9889ZM124.011 77.9889H122.733V76.8353H125.027V76.9731H125.165V79.2672H124.011V77.9889ZM129.615 77.9889H127.321V76.8353H129.615V77.9889ZM134.203 77.9889H131.909V76.8353H134.203V77.9889ZM138.792 77.9889H136.497V76.8353H138.792V77.9889ZM143.38 77.9889H141.086V76.8353H143.38V77.9889ZM29.4154 79.2672V76.9731H30.569V79.2672H29.4154ZM171.308 79.2672V76.9731H172.462V79.2672H171.308ZM29.4154 83.8553V81.5612H30.569V83.8553H29.4154ZM124.011 83.8553V81.5612H125.165V83.8553H124.011ZM171.308 83.8553V81.5612H172.462V83.8553H171.308ZM29.4154 88.4435V86.1494H30.569V88.4435H29.4154ZM124.011 88.4435V86.1494H125.165V88.4435H124.011ZM171.308 88.4435V86.1494H172.462V88.4435H171.308ZM29.4154 93.0316V90.7375H30.569V93.0316H29.4154ZM124.011 93.0316V90.7375H125.165V93.0316H124.011ZM171.308 93.0316V90.7375H172.462V93.0316H171.308ZM29.4154 97.6198V95.3257H30.569V97.6198H29.4154ZM124.011 97.6198V95.3257H125.165V97.6198H124.011ZM171.308 97.6198V95.3257H172.462V97.6198H171.308ZM29.4154 102.208V99.9138H30.569V102.208H29.4154ZM124.011 102.208V99.9138H125.165V102.208H124.011ZM171.308 102.208V99.9138H172.462V102.208H171.308ZM29.4154 106.796V104.502H30.569V106.796H29.4154ZM124.011 106.796V104.502H125.165V106.796H124.011ZM171.308 106.796V104.502H172.462V106.796H171.308ZM29.4154 111.384V109.09H30.569V111.384H29.4154ZM124.011 111.384V109.09H125.165V111.384H124.011ZM171.308 111.384V109.09H172.462V111.384H171.308ZM29.4154 115.972V113.678H30.569V115.972H29.4154ZM124.011 115.972V113.678H125.165V115.972H124.011ZM171.308 115.972V113.678H172.462V115.972H171.308ZM29.4154 120.561V118.266H30.569V120.561H29.4154ZM124.011 120.561V118.266H125.165V120.561H124.011ZM171.308 120.561V118.266H172.462V120.561H171.308ZM29.4154 125.149V122.855H30.569V125.149H29.4154ZM124.011 125.149V122.855H125.165V125.149H124.011ZM171.308 125.149V122.855H172.462V125.149H171.308ZM29.4154 129.737V127.443H30.569V129.737H29.4154ZM124.011 129.737V127.443H125.165V129.737H124.011ZM171.308 129.737V127.443H172.462V129.737H171.308ZM29.4154 134.325V132.031H30.569V134.325H29.4154ZM124.011 134.325V132.031H125.165V134.325H124.011ZM171.308 134.325V132.031H172.462V134.325H171.308ZM29.4154 138.913V136.619H30.569V138.913H29.4154ZM124.011 138.913V136.619H125.165V138.913H124.011ZM171.308 138.913V136.619H172.462V138.913H171.308ZM29.4154 143.501V141.207H30.569V143.501H29.4154ZM124.011 143.501V141.207H125.165V143.501H124.011ZM171.308 143.501V141.207H172.462V143.501H171.308ZM29.4154 148.089V145.795H30.569V148.089H29.4154ZM124.011 148.089V145.795H125.165V148.089H124.011ZM171.308 148.089V145.795H172.462V148.089H171.308ZM29.4154 152.677V150.383H30.569V152.677H29.4154ZM124.011 152.677V150.383H125.165V152.677H124.011ZM171.308 152.677V150.383H172.462V152.677H171.308ZM29.4154 157.266V154.972H30.569V157.266H29.4154ZM124.011 157.266V154.972H125.165V157.266H124.011ZM171.308 157.266V154.972H172.462V157.266H171.308ZM29.4154 161.854V159.56H30.569V161.854H29.4154ZM124.011 161.854V159.56H125.165V161.854H124.011ZM171.308 161.854V159.56H172.462V161.854H171.308ZM29.4154 166.442V164.148H30.569V166.442H29.4154ZM124.011 166.442V164.148H125.165V166.442H124.011ZM171.308 166.442V164.148H172.462V166.442H171.308ZM29.4154 171.03V168.736H30.569V171.03H29.4154ZM124.011 170.276V168.736H125.165V171.03H125.027V171.43H122.733V170.276H124.011ZM171.308 171.03V168.736H172.462V171.03H171.308ZM129.615 171.43H127.321V170.276H129.615V171.43ZM134.203 171.43H131.909V170.276H134.203V171.43ZM138.792 171.43H136.497V170.276H138.792V171.43ZM143.38 171.43H141.086V170.276H143.38V171.43ZM147.968 171.43H145.674V170.276H147.968V171.43ZM152.556 171.43H150.262V170.276H152.556V171.43ZM157.144 171.43H154.85V170.276H157.144V171.43ZM161.732 171.43H159.438V170.276H161.732V171.43ZM166.32 171.43H164.026V170.276H166.32V171.43ZM170.908 171.43H168.614V170.276H170.908V171.43ZM175.497 171.43H173.203V170.276H175.497V171.43ZM180.085 171.43H177.791V170.276H180.085V171.43ZM184.673 171.43H182.379V170.276H184.673V171.43ZM189.261 171.43H186.967V170.276H189.261V171.43ZM193.849 171.43H191.555V170.276H193.849V171.43ZM198.437 171.43H196.143V170.276H198.437V171.43ZM201.879 171.43H200.731V170.276H201.879V171.43ZM1.14704 171.43H0V170.276H1.14704V171.43ZM5.73519 171.43H3.44111V170.276H5.73519V171.43ZM10.3233 171.43H8.02926V170.276H10.3233V171.43ZM14.9115 171.43H12.6174V170.276H14.9115V171.43ZM19.4996 171.43H17.2056V170.276H19.4996V171.43ZM24.0878 171.43H21.7937V170.276H24.0878V171.43ZM28.6759 171.43H26.3819V170.276H28.6759V171.43ZM33.2641 171.43H30.97V170.276H33.2641V171.43ZM37.8522 171.43H35.5582V170.276H37.8522V171.43ZM42.4404 171.43H40.1463V170.276H42.4404V171.43ZM47.0285 171.43H44.7345V170.276H47.0285V171.43ZM51.6167 171.43H49.3226V170.276H51.6167V171.43ZM56.2048 171.43H53.9108V170.276H56.2048V171.43ZM60.793 171.43H58.4989V170.276H60.793V171.43ZM65.3811 171.43H63.0871V170.276H65.3811V171.43ZM69.9693 171.43H67.6752V170.276H69.9693V171.43ZM74.5574 171.43H72.2634V170.276H74.5574V171.43ZM79.1456 171.43H76.8515V170.276H79.1456V171.43ZM83.7337 171.43H81.4397V170.276H83.7337V171.43ZM88.3219 171.43H86.0278V170.276H88.3219V171.43ZM92.91 171.43H90.616V170.276H92.91V171.43ZM97.4982 171.43H95.2041V170.276H97.4982V171.43ZM102.086 171.43H99.7923V170.276H102.086V171.43ZM106.674 171.43H104.38V170.276H106.674V171.43ZM111.263 171.43H108.969V170.276H111.263V171.43ZM115.851 171.43H113.557V170.276H115.851V171.43ZM120.439 171.43H118.145V170.276H120.439V171.43ZM29.4154 175.618V173.324H30.569V175.618H29.4154ZM124.011 175.618V173.324H125.165V175.618H124.011ZM171.308 175.618V173.324H172.462V175.618H171.308ZM29.4154 180.206V177.912H30.569V180.206H29.4154ZM124.011 180.206V177.912H125.165V180.206H124.011ZM171.308 180.206V177.912H172.462V180.206H171.308ZM29.4154 184.794V182.5H30.569V184.794H29.4154ZM124.011 184.794V182.5H125.165V184.794H124.011ZM171.308 184.794V182.5H172.462V184.794H171.308ZM29.4154 189.383V187.089H30.569V189.383H29.4154ZM124.011 189.383V187.089H125.165V189.383H124.011ZM171.308 189.383V187.089H172.462V189.383H171.308ZM29.4154 193.971V191.677H30.569V193.971H29.4154ZM124.011 193.971V191.677H125.165V193.971H124.011ZM171.308 193.971V191.677H172.462V193.971H171.308ZM29.4154 198.559V196.265H30.569V198.559H29.4154ZM124.011 198.559V196.265H125.165V198.559H124.011ZM171.308 198.559V196.265H172.462V198.559H171.308ZM29.4154 202V200.853H30.569V202H29.4154ZM124.011 202V200.853H125.165V202H124.011ZM171.308 202V200.853H172.462V202H171.308Z" fill="black" fill-opacity="0.21"/>
<path d="M171.884 43.9579C171.884 36.3125 165.686 30.1147 158.041 30.1147H43.8353C36.19 30.1147 29.9922 36.3125 29.9922 43.9578V63.5689C29.9922 71.2142 36.19 77.412 43.8353 77.412H158.041C165.686 77.412 171.884 71.2142 171.884 63.5689V43.9579Z" fill="#051485"/>
<path d="M138.43 30.1147C130.785 30.1147 124.587 36.3125 124.587 43.9578L124.587 157.01C124.587 164.655 130.785 170.853 138.43 170.853H158.041C165.687 170.853 171.884 164.655 171.884 157.01L171.884 43.9579C171.884 36.3125 165.686 30.1147 158.041 30.1147L138.43 30.1147Z" fill="#051485"/>
<path d="M98.8164 59.4043V57.8532H99.3981C99.6599 57.8532 99.8754 57.8151 100.044 57.7389C100.213 57.6626 100.349 57.5533 100.452 57.4107C100.558 57.2682 100.646 57.1025 100.716 56.9136L100.85 56.5705L97.2106 49.0833H99.1396L101.675 54.5322L103.868 49.0833H105.767L102.257 57.3859C102.094 57.7438 101.907 58.0769 101.695 58.3852C101.483 58.6901 101.206 58.937 100.865 59.1259C100.527 59.3115 100.086 59.4043 99.5423 59.4043H98.8164ZM111.491 51.6288V53.1053H108.2V59.2651H106.44V51.6288H111.491ZM111.779 59.2651L111.769 57.7836H112.032C112.231 57.7836 112.398 57.7389 112.534 57.6494C112.67 57.5599 112.783 57.4107 112.872 57.2019C112.962 56.9898 113.031 56.7048 113.081 56.3468C113.131 55.9889 113.166 55.5431 113.186 55.0095L113.32 51.6288H118.888V59.2651H117.148V53.1053H114.955L114.836 55.5663C114.806 56.2026 114.735 56.7545 114.622 57.2218C114.513 57.6858 114.357 58.0686 114.155 58.3703C113.956 58.6719 113.706 58.8972 113.404 59.0464C113.103 59.1922 112.746 59.2651 112.335 59.2651H111.779ZM124.031 59.4143C123.285 59.4143 122.639 59.2502 122.092 58.9221C121.545 58.594 121.121 58.1349 120.819 57.545C120.521 56.955 120.372 56.2656 120.372 55.4768C120.372 54.688 120.521 53.9969 120.819 53.4036C121.121 52.8104 121.545 52.3497 122.092 52.0215C122.639 51.6934 123.285 51.5293 124.031 51.5293C124.777 51.5293 125.423 51.6934 125.97 52.0215C126.517 52.3497 126.939 52.8104 127.238 53.4036C127.539 53.9969 127.69 54.688 127.69 55.4768C127.69 56.2656 127.539 56.955 127.238 57.545C126.939 58.1349 126.517 58.594 125.97 58.9221C125.423 59.2502 124.777 59.4143 124.031 59.4143ZM124.041 57.9725C124.445 57.9725 124.783 57.8615 125.055 57.6394C125.327 57.414 125.529 57.1124 125.662 56.7346C125.798 56.3568 125.866 55.9358 125.866 55.4718C125.866 55.0045 125.798 54.5819 125.662 54.2041C125.529 53.8229 125.327 53.5196 125.055 53.2943C124.783 53.0689 124.445 52.9562 124.041 52.9562C123.627 52.9562 123.282 53.0689 123.007 53.2943C122.735 53.5196 122.531 53.8229 122.395 54.2041C122.263 54.5819 122.197 55.0045 122.197 55.4718C122.197 55.9358 122.263 56.3568 122.395 56.7346C122.531 57.1124 122.735 57.414 123.007 57.6394C123.282 57.8615 123.627 57.9725 124.041 57.9725ZM129.218 59.2651V51.6288H132.424C133.329 51.6288 134.043 51.8094 134.567 52.1707C135.094 52.5319 135.358 53.0357 135.358 53.682C135.358 54.1096 135.208 54.4593 134.91 54.731C134.615 54.9995 134.212 55.1801 133.702 55.2729C134.103 55.3061 134.454 55.4072 134.756 55.5762C135.061 55.7453 135.3 55.9673 135.472 56.2424C135.644 56.5175 135.73 56.834 135.73 57.192C135.73 57.6129 135.619 57.9792 135.397 58.2907C135.179 58.5989 134.859 58.8392 134.438 59.0116C134.02 59.1806 133.513 59.2651 132.917 59.2651H129.218ZM130.903 57.8482H132.917C133.248 57.8482 133.508 57.7703 133.697 57.6146C133.886 57.4555 133.98 57.24 133.98 56.9683C133.98 56.6534 133.886 56.4065 133.697 56.2275C133.508 56.0452 133.248 55.9541 132.917 55.9541H130.903V57.8482ZM130.903 54.7907H132.459C132.704 54.7907 132.915 54.7559 133.091 54.6863C133.266 54.6134 133.4 54.5123 133.493 54.383C133.586 54.2505 133.632 54.093 133.632 53.9107C133.632 53.6489 133.525 53.4434 133.309 53.2943C133.097 53.1451 132.802 53.0705 132.424 53.0705H130.903V54.7907ZM139.413 59.4193C138.929 59.4193 138.493 59.3331 138.106 59.1607C137.721 58.9851 137.416 58.7265 137.191 58.3852C136.969 58.0438 136.858 57.6229 136.858 57.1224C136.858 56.6915 136.937 56.3352 137.096 56.0535C137.256 55.7718 137.473 55.5464 137.748 55.3774C138.023 55.2083 138.333 55.0807 138.677 54.9945C139.025 54.9051 139.385 54.8404 139.756 54.8006C140.204 54.7542 140.567 54.7128 140.845 54.6764C141.123 54.6366 141.326 54.5769 141.452 54.4974C141.581 54.4145 141.645 54.2869 141.645 54.1146V54.0847C141.645 53.7102 141.534 53.4202 141.312 53.2147C141.09 53.0092 140.77 52.9065 140.353 52.9065C139.912 52.9065 139.562 53.0026 139.304 53.1948C139.049 53.3871 138.876 53.6141 138.787 53.8759L137.106 53.6373C137.239 53.1733 137.458 52.7855 137.763 52.4739C138.068 52.1591 138.44 51.9238 138.881 51.768C139.322 51.6089 139.809 51.5293 140.343 51.5293C140.711 51.5293 141.077 51.5724 141.442 51.6586C141.806 51.7448 142.139 51.8873 142.441 52.0862C142.742 52.2817 142.984 52.5485 143.167 52.8866C143.352 53.2247 143.445 53.6472 143.445 54.1543V59.2651H141.715V58.2161H141.655C141.546 58.4283 141.392 58.6271 141.193 58.8127C140.997 58.995 140.751 59.1425 140.452 59.2552C140.157 59.3646 139.811 59.4193 139.413 59.4193ZM139.881 58.0968C140.242 58.0968 140.555 58.0256 140.82 57.883C141.085 57.7372 141.289 57.545 141.432 57.3063C141.577 57.0677 141.65 56.8075 141.65 56.5258V55.6259C141.594 55.6723 141.498 55.7154 141.362 55.7552C141.229 55.795 141.08 55.8298 140.915 55.8596C140.749 55.8894 140.585 55.9159 140.422 55.9391C140.26 55.9623 140.119 55.9822 140 55.9988C139.731 56.0353 139.491 56.0949 139.279 56.1778C139.067 56.2606 138.899 56.3766 138.777 56.5258C138.654 56.6716 138.593 56.8605 138.593 57.0926C138.593 57.424 138.714 57.6742 138.956 57.8433C139.198 58.0123 139.506 58.0968 139.881 58.0968ZM149.769 59.2651V53.0904H148.138C147.724 53.0904 147.406 53.1865 147.184 53.3788C146.962 53.571 146.852 53.8096 146.856 54.0947C146.852 54.3797 146.957 54.615 147.169 54.8006C147.381 54.9863 147.684 55.0791 148.079 55.0791H150.336V56.3916H148.079C147.469 56.3916 146.942 56.2954 146.498 56.1032C146.054 55.911 145.712 55.6392 145.474 55.2879C145.235 54.9365 145.116 54.5256 145.116 54.0549C145.116 53.5644 145.237 53.1385 145.479 52.7772C145.724 52.4126 146.072 52.1309 146.523 51.932C146.977 51.7299 147.515 51.6288 148.138 51.6288H151.454V59.2651H149.769ZM144.837 59.2651L146.97 55.3475H148.745L146.607 59.2651H144.837Z" fill="white"/>
</svg>
