<svg width="18" height="13" viewBox="0 0 18 13" fill="none" xmlns="http://www.w3.org/2000/svg">
<path d="M1.0664 6.08112C0.751461 6.39606 0.751461 6.90667 1.0664 7.22161L6.19861 12.3538C6.51355 12.6688 7.02416 12.6688 7.3391 12.3538C7.65404 12.0389 7.65404 11.5283 7.3391 11.2133L2.77714 6.65137L7.3391 2.0894C7.65404 1.77446 7.65404 1.26385 7.3391 0.948911C7.02416 0.633973 6.51355 0.633973 6.19861 0.948911L1.0664 6.08112ZM17.7656 5.84492L1.63664 5.84492V7.45782L17.7656 7.45782V5.84492Z" fill="white"/>
</svg>
