<svg width="213" height="43" viewBox="0 0 213 43" fill="none" xmlns="http://www.w3.org/2000/svg">
<path d="M21.9755 3.08156L25.627 14.3197C25.8278 14.9377 26.4038 15.3561 27.0536 15.3561H38.87C39.3544 15.3561 39.5558 15.9759 39.1639 16.2606L29.6042 23.2062C29.0785 23.5881 28.8585 24.2652 29.0593 24.8832L32.7108 36.1213C32.8605 36.582 32.3332 36.965 31.9414 36.6803L22.3817 29.7348C21.8559 29.3528 21.1441 29.3528 20.6183 29.7348L11.0586 36.6803C10.6668 36.965 10.1395 36.582 10.2892 36.1213L13.9407 24.8832C14.1415 24.2652 13.9215 23.5881 13.3958 23.2062L3.83607 16.2606C3.44422 15.9759 3.64561 15.3561 4.12997 15.3561H15.9464C16.5962 15.3561 17.1722 14.9377 17.373 14.3197L21.0245 3.08156C21.1741 2.6209 21.8259 2.6209 21.9755 3.08156Z" stroke="#EA3619"/>
<path d="M191.976 3.08156L195.627 14.3197C195.828 14.9377 196.404 15.3561 197.054 15.3561H208.87C209.354 15.3561 209.556 15.9759 209.164 16.2606L199.604 23.2062C199.078 23.5881 198.859 24.2652 199.059 24.8832L202.711 36.1213C202.86 36.582 202.333 36.965 201.941 36.6803L192.382 29.7348C191.856 29.3528 191.144 29.3528 190.618 29.7348L181.059 36.6803C180.667 36.965 180.14 36.582 180.289 36.1213L183.941 24.8832C184.141 24.2652 183.922 23.5881 183.396 23.2062L173.836 16.2606C173.444 15.9759 173.646 15.3561 174.13 15.3561H185.946C186.596 15.3561 187.172 14.9377 187.373 14.3197L191.024 3.08156C191.174 2.6209 191.826 2.6209 191.976 3.08156Z" stroke="#EA3619"/>
<path d="M148.976 3.08156L152.627 14.3197C152.828 14.9377 153.404 15.3561 154.054 15.3561H165.87C166.354 15.3561 166.556 15.9759 166.164 16.2606L156.604 23.2062C156.078 23.5881 155.859 24.2652 156.059 24.8832L159.711 36.1213C159.86 36.582 159.333 36.965 158.941 36.6803L149.382 29.7348C148.856 29.3528 148.144 29.3528 147.618 29.7348L138.059 36.6803C137.667 36.965 137.14 36.582 137.289 36.1213L140.941 24.8832C141.141 24.2652 140.922 23.5881 140.396 23.2062L130.836 16.2606C130.444 15.9759 130.646 15.3561 131.13 15.3561H142.946C143.596 15.3561 144.172 14.9377 144.373 14.3197L148.024 3.08156C148.174 2.6209 148.826 2.6209 148.976 3.08156Z" stroke="#EA3619"/>
<path d="M107.976 3.08156L111.627 14.3197C111.828 14.9377 112.404 15.3561 113.054 15.3561H124.87C125.354 15.3561 125.556 15.9759 125.164 16.2606L115.604 23.2062C115.078 23.5881 114.859 24.2652 115.059 24.8832L118.711 36.1213C118.86 36.582 118.333 36.965 117.941 36.6803L108.382 29.7348C107.856 29.3528 107.144 29.3528 106.618 29.7348L97.0586 36.6803C96.6668 36.965 96.1395 36.582 96.2892 36.1213L99.9407 24.8832C100.141 24.2652 99.9215 23.5881 99.3958 23.2062L89.8361 16.2606C89.4442 15.9759 89.6456 15.3561 90.13 15.3561H101.946C102.596 15.3561 103.172 14.9377 103.373 14.3197L107.024 3.08156C107.174 2.6209 107.826 2.6209 107.976 3.08156Z" stroke="#EA3619"/>
<path d="M64.9755 3.08156L68.627 14.3197C68.8278 14.9377 69.4038 15.3561 70.0536 15.3561H81.87C82.3544 15.3561 82.5558 15.9759 82.1639 16.2606L72.6042 23.2062C72.0785 23.5881 71.8585 24.2652 72.0593 24.8832L75.7108 36.1213C75.8605 36.582 75.3332 36.965 74.9414 36.6803L65.3817 29.7348C64.8559 29.3528 64.1441 29.3528 63.6183 29.7348L54.0586 36.6803C53.6668 36.965 53.1395 36.582 53.2892 36.1213L56.9407 24.8832C57.1415 24.2652 56.9215 23.5881 56.3958 23.2062L46.8361 16.2606C46.4442 15.9759 46.6456 15.3561 47.13 15.3561H58.9464C59.5962 15.3561 60.1722 14.9377 60.373 14.3197L64.0245 3.08156C64.1741 2.6209 64.8259 2.6209 64.9755 3.08156Z" stroke="#EA3619"/>
</svg>
