<svg width="13" height="13" viewBox="0 0 13 13" fill="none" xmlns="http://www.w3.org/2000/svg">
<path fill-rule="evenodd" clip-rule="evenodd" d="M2.32951 12.728C1.89017 12.3654 1.89017 11.7775 2.32951 11.4148L8.28401 6.5L2.32951 1.58518C1.89017 1.22254 1.89017 0.634601 2.32951 0.271972C2.76885 -0.0906575 3.48115 -0.0906574 3.9205 0.271972L10.6705 5.8434C11.1098 6.20604 11.1098 6.79397 10.6705 7.15661L3.9205 12.728C3.48115 13.0907 2.76884 13.0907 2.32951 12.728Z" fill="#878789"/>
</svg>
