<svg width="351" height="137" viewBox="0 0 351 137" fill="none" xmlns="http://www.w3.org/2000/svg">
<rect x="387.656" y="0.554688" width="117.452" height="422.314" transform="rotate(66.4223 387.656 0.554688)" fill="#051485"/>
<path d="M241.989 111.763L255.875 104.278L251.547 104.103L241.605 108.372L241.989 111.763Z" fill="#5B75F7"/>
<path d="M255.877 104.277V106.035L241.992 113.521V111.404L255.877 104.277Z" fill="white"/>
<path d="M232.773 113.505H241.99L256.335 88.6172L255.883 73.75L232.773 113.505Z" fill="#1935D1"/>
<path d="M255.895 73.75V76.9564L244.363 93.6274L255.895 73.75Z" fill="white"/>
<path d="M255.812 89.5183L255.881 73.75L269.543 97.2999H260.316L255.812 89.5183ZM273.738 104.531L274.291 105.483H265.052L264.501 104.531H273.738Z" fill="#5B75F7"/>
<path fill-rule="evenodd" clip-rule="evenodd" d="M285.309 107.691H316.993V107.488H285.309V107.691Z" fill="white"/>
<path fill-rule="evenodd" clip-rule="evenodd" d="M285.309 110.16H307.497V109.958H285.309V110.16Z" fill="white"/>
<path fill-rule="evenodd" clip-rule="evenodd" d="M285.309 112.631H297.122V112.429H285.309V112.631Z" fill="white"/>
<path d="M261.179 103.563H262.534V103.363L260.087 98.0986H259.49L257.051 103.363V103.563H258.406L258.724 102.885H260.861L261.179 103.563ZM260.412 101.706H259.173L259.785 100.288L260.412 101.706ZM265.616 100.403L267.01 103.563H268.366V103.363L265.918 98.0986H265.322L262.882 103.363V103.563H264.238L265.616 100.403ZM272.463 98.168C271.192 98.168 270.333 98.168 269.078 98.168C269.078 99.9561 269.078 101.76 269.078 103.563C270.333 103.563 271.262 103.563 272.532 103.563C272.532 103.155 272.532 102.738 272.532 102.338C271.719 102.338 271.254 102.338 270.457 102.338C270.457 102.014 270.457 101.706 270.457 101.39H272.3C272.3 100.981 272.3 100.573 272.3 100.164H270.457V99.4012C271.254 99.4012 271.657 99.4012 272.463 99.4012C272.463 98.985 272.463 98.5688 272.463 98.168ZM275.142 103.563V101.505C275.32 101.505 275.491 101.505 275.677 101.474L276.869 103.563H278.411V103.347L276.939 100.973C278.016 100.288 277.985 99.2702 277.985 98.168C277.504 98.168 277.032 98.168 276.56 98.168C276.56 99.1777 276.629 100.21 275.243 100.21H275.142V98.168C274.662 98.168 274.197 98.168 273.733 98.168V103.563C274.197 103.563 274.662 103.563 275.142 103.563ZM278.883 100.866C278.891 102.7 280.285 103.625 281.663 103.617C282.817 103.617 284.033 103.016 284.235 101.49C283.762 101.49 283.336 101.49 282.872 101.49C282.724 102.068 282.252 102.361 281.663 102.361C280.842 102.353 280.316 101.659 280.316 100.866C280.316 99.9715 280.85 99.3626 281.663 99.3626C282.244 99.3626 282.655 99.6092 282.848 100.156C283.321 100.156 283.739 100.156 284.211 100.156C284.002 98.7152 282.786 98.1063 281.663 98.1063C280.285 98.1063 278.891 99.0313 278.883 100.866ZM288.68 98.168C287.41 98.168 286.55 98.168 285.296 98.168C285.296 99.9561 285.296 101.76 285.296 103.563C286.55 103.563 287.48 103.563 288.75 103.563C288.75 103.155 288.75 102.738 288.75 102.338C287.937 102.338 287.472 102.338 286.674 102.338C286.674 102.014 286.674 101.706 286.674 101.39H288.518C288.518 100.981 288.518 100.573 288.518 100.164H286.674V99.4012C287.472 99.4012 287.875 99.4012 288.68 99.4012C288.68 98.985 288.68 98.5688 288.68 98.168ZM293.327 98.168C292.057 98.168 291.197 98.168 289.942 98.168C289.942 99.9561 289.942 101.76 289.942 103.563C291.197 103.563 292.126 103.563 293.397 103.563C293.397 103.155 293.397 102.738 293.397 102.338C292.583 102.338 292.119 102.338 291.321 102.338C291.321 102.014 291.321 101.706 291.321 101.39H293.164C293.164 100.981 293.164 100.573 293.164 100.164H291.321V99.4012C292.119 99.4012 292.522 99.4012 293.327 99.4012C293.327 98.985 293.327 98.5688 293.327 98.168ZM298.593 99.8251C298.593 98.8925 297.842 98.168 296.905 98.168H294.589V103.563H297.13C298.237 103.563 298.81 102.8 298.818 101.86C298.818 101.382 298.609 100.981 298.167 100.758C298.431 100.542 298.593 100.149 298.593 99.8251ZM297.029 101.42C297.587 101.42 297.594 102.338 297.037 102.338H295.929V101.42H297.029ZM296.797 99.4012C297.354 99.4012 297.354 100.272 296.804 100.272H295.929V99.4012H296.797ZM299.577 100.866C299.585 102.7 300.979 103.625 302.357 103.617C303.511 103.617 304.727 103.016 304.928 101.49C304.456 101.49 304.03 101.49 303.565 101.49C303.418 102.068 302.946 102.361 302.357 102.361C301.536 102.353 301.01 101.659 301.01 100.866C301.01 99.9715 301.544 99.3626 302.357 99.3626C302.938 99.3626 303.349 99.6092 303.542 100.156C304.015 100.156 304.433 100.156 304.905 100.156C304.696 98.7152 303.48 98.1063 302.357 98.1063C300.979 98.1063 299.585 99.0313 299.577 100.866ZM307.407 103.563V101.505C307.585 101.505 307.755 101.505 307.941 101.474L309.134 103.563H310.675V103.347L309.204 100.973C310.28 100.288 310.249 99.2702 310.249 98.168C309.769 98.168 309.297 98.168 308.824 98.168C308.824 99.1777 308.894 100.21 307.508 100.21H307.407V98.168C306.927 98.168 306.462 98.168 305.997 98.168V103.563C306.462 103.563 306.927 103.563 307.407 103.563ZM314.71 100.912V103.563C315.19 103.563 315.671 103.563 316.143 103.563V98.1449H315.639L312.898 100.808V98.168C312.425 98.168 311.953 98.168 311.481 98.168V103.563H311.976L314.71 100.912ZM320.914 98.168C319.643 98.168 318.784 98.168 317.529 98.168C317.529 99.9561 317.529 101.76 317.529 103.563C318.784 103.563 319.713 103.563 320.983 103.563C320.983 103.155 320.983 102.738 320.983 102.338C320.17 102.338 319.705 102.338 318.908 102.338C318.908 102.014 318.908 101.706 318.908 101.39H320.751C320.751 100.981 320.751 100.573 320.751 100.164H318.908V99.4012C319.705 99.4012 320.108 99.4012 320.914 99.4012C320.914 98.985 320.914 98.5688 320.914 98.168ZM259.15 112.796V110.738C259.328 110.738 259.498 110.738 259.684 110.708L260.877 112.796H262.418V112.58L260.946 110.207C262.023 109.521 261.992 108.503 261.992 107.401C261.512 107.401 261.039 107.401 260.567 107.401C260.567 108.411 260.637 109.444 259.25 109.444H259.15V107.401C258.669 107.401 258.205 107.401 257.74 107.401V112.796C258.205 112.796 258.669 112.796 259.15 112.796ZM263.549 112.796H265.043L267.615 107.609V107.401H266.112L265.183 109.39H265.144L264.122 107.401H262.573V107.609L264.401 110.908L263.549 112.65V112.796ZM270.302 111.101L271.293 112.796H272.788V112.588L271.03 109.937L272.594 107.609V107.401H271.162L270.294 108.804H270.256L269.396 107.401H267.955V107.609L269.52 109.937L267.77 112.588V112.796H269.264L270.256 111.101H270.302ZM278.093 107.401C277.621 107.401 277.148 107.401 276.676 107.401V109.359H275.003V107.401C274.531 107.401 274.05 107.401 273.586 107.401V112.796C274.05 112.796 274.531 112.796 275.003 112.796V110.631H276.676V112.796C277.148 112.796 277.621 112.796 278.093 112.796V107.401ZM282.717 110.145V112.796C283.197 112.796 283.677 112.796 284.15 112.796V107.378H283.646L280.904 110.041V107.401C280.432 107.401 279.96 107.401 279.487 107.401V112.796H279.983L282.717 110.145Z" fill="white"/>
</svg>
