<svg width="47" height="47" viewBox="0 0 47 47" fill="none" xmlns="http://www.w3.org/2000/svg">
<path d="M34.6313 19.5921C34.6604 19.5477 34.7044 19.5151 34.7554 19.5004C34.8065 19.4856 34.8611 19.4895 34.9094 19.5114C36.2547 19.8179 37.649 19.8408 39.0036 19.5785C40.3581 19.3163 41.6432 18.7746 42.7767 17.9882C43.9025 17.2031 44.8522 16.192 45.5652 15.0194C46.2783 13.8468 46.7391 12.5384 46.9181 11.1777C46.9181 11.1645 46.935 11.1272 46.9446 11.1007C46.9542 11.0742 46.9699 11.0345 46.9795 11.0019L47 10.9393V8.83696L46.9868 8.78518L46.817 8.12413C46.6676 7.54374 46.5135 6.9453 46.3521 6.35649C46.2833 6.12833 46.1918 5.90766 46.0788 5.69784L46.0595 5.66052C45.9374 5.39402 45.7535 5.16044 45.5232 4.97911C45.2928 4.79778 45.0226 4.67391 44.7348 4.61776C44.4466 4.57587 44.1526 4.60316 43.877 4.69738C43.6014 4.7916 43.3523 4.95004 43.1501 5.15961C42.4576 5.83632 41.7628 6.5347 41.0908 7.20659C40.7994 7.5004 40.5071 7.7938 40.2141 8.0868L39.6734 8.62744C39.2989 9.00192 39.0713 9.2295 38.9123 9.27044C38.7534 9.31138 38.4415 9.2307 37.9261 9.09223H37.8984C37.7864 8.85141 37.7177 8.12894 37.79 7.90618L39.4506 6.24571L41.6761 4.01932C42.2589 3.43532 42.5094 2.78029 42.3805 2.17462C42.2601 1.58822 41.7784 1.11019 41.0559 0.828427C40.4108 0.594693 39.7525 0.398891 39.0845 0.242026C38.8015 0.169779 38.5089 0.0951248 38.2247 0.0156535L38.1693 0H36.0679L36.0101 0.0168575L35.9005 0.0529806C35.8615 0.0678594 35.8212 0.0791449 35.7801 0.086696C34.425 0.263976 33.1223 0.723995 31.9564 1.43694C30.7905 2.14988 29.7875 3.09983 29.0123 4.22522C28.2218 5.34722 27.676 6.62276 27.41 7.96917C27.1441 9.31559 27.164 10.7029 27.4684 12.0411C27.5106 12.2229 27.4973 12.2723 27.3733 12.3951C25.8391 13.9159 24.2856 15.4704 22.7839 16.9707C22.2573 17.4965 21.7314 18.0223 21.2064 18.5481L12.5359 9.87851L12.5744 9.84118C12.8454 9.5811 13.126 9.31138 13.3993 9.02962C13.5934 8.84403 13.7457 8.6191 13.8458 8.3699C13.9459 8.1207 13.9916 7.85298 13.9798 7.58468C13.9529 7.32019 13.8701 7.06443 13.7368 6.8344C13.6035 6.60437 13.4228 6.40534 13.2066 6.25053C11.6556 5.04642 9.98288 3.77368 7.9429 2.2264C7.0927 1.5822 6.20759 1.63759 5.45012 2.38293C4.39039 3.4269 3.35956 4.45761 2.38774 5.44619C1.66519 6.18431 1.60257 7.08016 2.22517 7.90257C3.73288 9.89296 5.05875 11.6257 6.27744 13.2007C6.43146 13.4143 6.62928 13.5928 6.8577 13.724C7.08612 13.8552 7.33989 13.9362 7.6021 13.9616C8.11149 13.9966 8.6281 13.7846 9.0532 13.368C9.33379 13.0911 9.59873 12.8117 9.85402 12.5408L9.8733 12.5203L18.5547 21.1995L17.92 21.8353C16.0823 23.6752 14.1869 25.5777 12.301 27.4368C12.2437 27.4578 12.1822 27.4648 12.1216 27.4573C11.0045 27.212 9.85454 27.1539 8.71843 27.2851C7.18265 27.4697 5.71149 28.0116 4.42293 28.8673C3.13438 29.723 2.06429 30.8687 1.29847 32.2125C0.532644 33.5563 0.0923948 35.0609 0.0130378 36.6055C-0.0663192 38.1501 0.217421 39.6919 0.841497 41.1071C1.1558 41.8103 1.65195 42.2582 2.23721 42.3666C2.82247 42.475 3.44145 42.2353 3.99179 41.6911L4.64448 41.0409C5.70782 39.9812 6.81211 38.8855 7.87666 37.7898C7.99708 37.6694 8.04887 37.6537 8.23071 37.6946H8.24516C8.66062 37.7874 8.95928 37.8536 9.04357 37.9355C9.12787 38.0173 9.18808 38.2967 9.28442 38.7073L9.29045 38.7314C9.335 38.9264 9.31814 38.9891 9.18206 39.1215C7.8574 40.4207 6.54959 41.7308 5.22011 43.071C4.73841 43.5635 4.52166 44.1547 4.62402 44.7278C4.72638 45.301 5.13581 45.7935 5.77285 46.0909C6.85715 46.5963 8.02659 46.8941 9.22059 46.9687C10.7598 47.0718 12.3017 46.8135 13.7232 46.2143C15.1447 45.6152 16.4063 44.692 17.4073 43.5183C18.4082 42.3447 19.1208 40.9532 19.4879 39.455C19.855 37.9569 19.8666 36.3937 19.5217 34.8903C19.5008 34.8414 19.4979 34.7867 19.5133 34.7359C19.5287 34.685 19.5615 34.6412 19.606 34.6121C20.8391 33.3984 22.0795 32.1521 23.2801 30.9468L23.6281 30.5976L23.7136 30.5073C24.3157 31.2767 24.6337 31.9715 24.5144 32.8264C24.4133 33.5489 24.6276 34.1509 25.19 34.7145C27.5443 37.0589 29.9347 39.449 32.2457 41.7597C33.6016 43.1171 34.958 44.4734 36.3148 45.8284C37.0975 46.6087 37.9935 47 38.8895 47C39.7854 47 40.6717 46.6123 41.4497 45.838C41.9085 45.3817 42.3661 44.9217 42.8225 44.4629C43.6655 43.6201 44.5349 42.7423 45.4032 41.897C46.0149 41.2949 46.6917 40.5725 46.9832 39.5526L46.9988 39.496V38.3051L46.9868 38.2558C46.7387 37.2359 46.0896 36.5267 45.5007 35.9403C41.8146 32.2749 38.2235 28.6831 34.8288 25.2658C34.1953 24.6276 33.5559 24.3904 32.7539 24.4976C31.9518 24.6048 31.2738 24.2857 30.5272 23.7029L31.5737 22.6589C32.5768 21.6595 33.6161 20.6216 34.6313 19.5921ZM27.3227 29.532L26.3039 28.0064L28.02 26.2965L29.5433 27.3152L27.3227 29.532ZM15.8957 35.1648C16.2218 36.137 16.3016 37.1748 16.128 38.1854C15.9545 39.196 15.5328 40.1477 14.901 40.9554C14.3121 41.7225 13.5552 42.3445 12.6885 42.7737C11.8217 43.2028 10.8682 43.4277 9.90099 43.431L10.3743 42.9494C11.0354 42.2835 11.7182 41.596 12.401 40.9337C12.6666 40.6934 12.8617 40.3853 12.9655 40.0425C13.0692 39.6997 13.0777 39.3351 12.9899 38.9879C12.7803 38.035 12.572 37.083 12.3649 36.1317C12.2989 35.7535 12.1175 35.4049 11.8457 35.1337C11.5738 34.8625 11.2248 34.682 10.8463 34.6169L10.485 34.5375C9.68422 34.3653 8.8557 34.1871 8.04405 34.0028C7.86864 33.9625 7.68935 33.9415 7.50937 33.9402C7.23495 33.9405 6.96361 33.9981 6.71271 34.1092C6.46181 34.2204 6.23687 34.3826 6.05224 34.5856C5.39353 35.2672 4.70831 35.9475 4.04477 36.6049L3.56308 37.0866C3.56348 36.5638 3.63149 36.0434 3.76539 35.5381C3.98007 34.6962 4.3653 33.9073 4.89724 33.2203C5.42917 32.5333 6.09649 31.9627 6.85787 31.5441C7.6098 31.1264 8.44051 30.8701 9.29703 30.7913C10.1536 30.7125 11.0171 30.813 11.8326 31.0865C12.8141 31.4128 13.5811 31.2262 14.3218 30.4844C19.6878 25.0912 25.1334 19.6475 30.5079 14.3C31.251 13.5595 31.4376 12.7925 31.1101 11.8111C30.7828 10.8416 30.7013 9.80612 30.8728 8.79739C31.0443 7.78866 31.4634 6.83825 32.0927 6.03138C32.6824 5.26039 33.4411 4.63489 34.3104 4.203C35.1797 3.7711 36.1365 3.54432 37.1072 3.54008C36.947 3.70023 36.7881 3.86158 36.6255 4.02173C35.9668 4.68519 35.2864 5.37033 34.6048 6.03018C34.0424 6.57323 33.8473 7.24392 34.0231 8.02178C34.2206 8.89235 34.4109 9.78098 34.5951 10.6407L34.6361 10.8298C34.7007 11.2094 34.8812 11.5597 35.1529 11.8327C35.4246 12.1056 35.7741 12.2878 36.1534 12.3542C37.1056 12.5605 38.0573 12.7688 39.0087 12.9791C39.3561 13.067 39.721 13.0586 40.064 12.9549C40.4071 12.8511 40.7154 12.656 40.9559 12.3903C41.6195 11.7063 42.3083 11.0224 42.9742 10.3602L43.4487 9.88935C43.4487 10.524 43.3487 11.1546 43.1525 11.7581C42.9065 12.5621 42.5013 13.3084 41.9609 13.9526C41.4205 14.5968 40.756 15.1256 40.007 15.5077C39.2685 15.8911 38.4604 16.1221 37.6308 16.1868C36.8012 16.2516 35.967 16.1488 35.178 15.8846C34.1989 15.5607 33.4318 15.7485 32.69 16.4939C27.407 21.804 21.9614 27.249 16.5038 32.6771C15.7596 33.414 15.573 34.1822 15.8957 35.1648ZM28.8076 33.2936L33.3006 28.7999L43.2223 38.7217C43.2729 38.7723 43.3271 38.8265 43.3716 38.8735L43.2356 39.0107L41.9892 40.257C40.9872 41.2576 39.9516 42.2919 38.9376 43.3142L38.881 43.3684L38.8654 43.354C36.1317 40.611 33.3451 37.8271 30.65 35.1347L28.8076 33.2936ZM9.42772 7.84959L7.86221 9.41493L5.96553 6.94169L6.95422 5.95793L9.42772 7.84959Z" fill="#051485"/>
</svg>
