<svg width="24" height="24" viewBox="0 0 24 24" fill="none" xmlns="http://www.w3.org/2000/svg">
<path fill-rule="evenodd" clip-rule="evenodd" d="M12 22C12 22 19 15.5228 19 9C19 4.5 15.866 2 12 2C8.13401 2 5 4.47715 5 9C5 15.5228 12 22 12 22ZM14.999 8.99994C14.999 7.34308 13.6559 5.99994 11.999 5.99994C10.3422 5.99994 8.99902 7.34308 8.99902 8.99994C8.99902 10.6568 10.3422 11.9999 11.999 11.9999C13.6559 11.9999 14.999 10.6568 14.999 8.99994Z" fill="url(#paint0_linear_607_578)"/>
<defs>
<linearGradient id="paint0_linear_607_578" x1="6.21291" y1="18.0921" x2="8.93703" y2="3.8153" gradientUnits="userSpaceOnUse">
<stop stop-color="#3330B4"/>
<stop offset="0.494792" stop-color="#4741B6"/>
<stop offset="1" stop-color="#6842B7"/>
</linearGradient>
</defs>
</svg>
