<svg width="24" height="24" viewBox="0 0 24 24" fill="none" xmlns="http://www.w3.org/2000/svg">
<path fill-rule="evenodd" clip-rule="evenodd" d="M16.2667 8.66884C16.6299 8.31012 17.2188 8.31009 17.5821 8.66877C17.9453 9.02745 17.9453 9.60902 17.5821 9.96773L11.8785 15.5824C11.4909 15.964 10.8694 15.9658 10.4796 15.5865L7.47245 12.6603C7.10926 12.3015 7.10929 11.72 7.47252 11.3613C7.83575 11.0026 8.42463 11.0026 8.78782 11.3614L11.181 13.671L16.2667 8.66884Z" fill="#8DDA71"/>
</svg>
