<svg width="48" height="48" viewBox="0 0 48 48" fill="none" xmlns="http://www.w3.org/2000/svg">
<circle cx="24" cy="24" r="24" fill="#00A674"/>
<path fill-rule="evenodd" clip-rule="evenodd" d="M38 17.1009L21.181 34L12 24.7752L15.0862 21.6743L21.181 27.7982L34.9138 14L38 17.1009Z" fill="white"/>
</svg>
