<svg viewBox="0 0 32 32" xmlns="http://www.w3.org/2000/svg">
<path d="M5.33325 8H26.6666M5.33325 16H26.6666M5.33325 24H26.6666" stroke-width="2" stroke-linecap="round" stroke-linejoin="round"/>
</svg>
