<svg width="272" height="186" viewBox="0 0 272 186" fill="none" xmlns="http://www.w3.org/2000/svg">
<circle cx="179.246" cy="92.7196" r="91.7196" fill="black" stroke="black" stroke-width="1.4" stroke-linecap="round" stroke-linejoin="round"/>
<path d="M261.794 92.7196C261.794 143.375 220.729 184.439 170.074 184.439C119.419 184.439 78.3545 143.375 78.3545 92.7196C78.3545 42.0643 119.419 1 170.074 1C220.729 1 261.794 42.0643 261.794 92.7196Z" fill="#6E89D3" stroke="#6E89D3" stroke-width="1.4" stroke-linecap="round" stroke-linejoin="round"/>
<path d="M261.794 92.7196C261.794 42.0643 220.73 1 170.074 1" stroke="white" stroke-width="1.4" stroke-linecap="round" stroke-linejoin="round"/>
<circle cx="170.074" cy="92.7196" r="68.7897" fill="white" stroke="white" stroke-width="1.4" stroke-linecap="round" stroke-linejoin="round"/>
<path d="M18.7296 32.5392L73.4934 43.5596" stroke="black" stroke-width="1.4" stroke-linecap="round" stroke-linejoin="round"/>
<path d="M59.9574 88.48L87.3394 93.9902" stroke="black" stroke-width="1.4" stroke-linecap="round" stroke-linejoin="round"/>
<circle cx="170.074" cy="92.7192" r="45.8598" fill="#6E89D3" stroke="#6E89D3" stroke-width="1.4" stroke-linecap="round" stroke-linejoin="round"/>
<circle cx="170.074" cy="92.7199" r="22.9299" fill="white" stroke="black" stroke-width="1.4" stroke-linecap="round" stroke-linejoin="round"/>
<circle cx="169.665" cy="92.7199" r="4.82735" fill="black" stroke="black" stroke-width="1.4" stroke-linecap="round" stroke-linejoin="round"/>
<path d="M25.2525 49.9548C15.8277 45.802 9.25676 55.086 8.69018 60.5571L41.5092 67.1615C40.0173 63.1562 34.6773 54.1076 25.2525 49.9548Z" fill="white" stroke="black" stroke-width="1.4" stroke-linecap="round" stroke-linejoin="round"/>
<path d="M35.4644 57.6395L37.0735 65.6851" stroke="black" stroke-width="1.4" stroke-linecap="round" stroke-linejoin="round"/>
<path d="M31.9243 54.4218L33.8553 65.6849" stroke="black" stroke-width="1.4" stroke-linecap="round" stroke-linejoin="round"/>
<path d="M28.0623 51.8475L30.3153 65.6853" stroke="black" stroke-width="1.4" stroke-linecap="round" stroke-linejoin="round"/>
<path d="M23.8787 49.2733L27.097 65.6857" stroke="black" stroke-width="1.4" stroke-linecap="round" stroke-linejoin="round"/>
<path d="M3.39221 59.4147L160.747 91.08" stroke="black" stroke-width="6" stroke-linecap="round" stroke-linejoin="round"/>
<path d="M147.991 88.1008L141.505 74.145L170.087 91.7297L169.366 93.3641L136.611 98.4607L147.991 88.1008Z" fill="black" stroke="black" stroke-width="1.4" stroke-linecap="round" stroke-linejoin="round"/>
<path d="M136.611 98.4608L169.367 93.3642" stroke="white" stroke-width="1.4" stroke-linecap="round" stroke-linejoin="round"/>
<path d="M19.8622 76.7415C9.56473 76.9255 7.09633 65.8225 8.69011 60.558L41.5091 67.1624C38.5841 70.2788 30.1597 76.5575 19.8622 76.7415Z" fill="white" stroke="black" stroke-width="1.4" stroke-linecap="round" stroke-linejoin="round"/>
<circle cx="179.246" cy="92.7196" r="91.7196" fill="black" stroke="black" stroke-width="1.4" stroke-linecap="round" stroke-linejoin="round"/>
<path d="M261.794 92.7196C261.794 143.375 220.729 184.439 170.074 184.439C119.419 184.439 78.3545 143.375 78.3545 92.7196C78.3545 42.0643 119.419 1 170.074 1C220.729 1 261.794 42.0643 261.794 92.7196Z" fill="#6E89D3" stroke="#6E89D3" stroke-width="1.4" stroke-linecap="round" stroke-linejoin="round"/>
<path d="M261.794 92.7196C261.794 42.0643 220.729 1 170.074 1" stroke="white" stroke-width="1.4" stroke-linecap="round" stroke-linejoin="round"/>
<circle cx="170.074" cy="92.7196" r="68.7897" fill="white" stroke="white" stroke-width="1.4" stroke-linecap="round" stroke-linejoin="round"/>
<path d="M18.7293 32.5392L73.4932 43.5596" stroke="black" stroke-width="1.4" stroke-linecap="round" stroke-linejoin="round"/>
<path d="M59.957 88.48L87.3389 93.9902" stroke="black" stroke-width="1.4" stroke-linecap="round" stroke-linejoin="round"/>
<circle cx="170.074" cy="92.7192" r="45.8598" fill="#6E89D3" stroke="#6E89D3" stroke-width="1.4" stroke-linecap="round" stroke-linejoin="round"/>
<circle cx="170.074" cy="92.7199" r="22.9299" fill="white" stroke="black" stroke-width="1.4" stroke-linecap="round" stroke-linejoin="round"/>
<circle cx="169.664" cy="92.7199" r="4.82735" fill="black" stroke="black" stroke-width="1.4" stroke-linecap="round" stroke-linejoin="round"/>
<path d="M25.2523 49.9548C15.8275 45.802 9.25652 55.086 8.68993 60.5571L41.509 67.1615C40.0171 63.1562 34.677 54.1076 25.2523 49.9548Z" fill="white" stroke="black" stroke-width="1.4" stroke-linecap="round" stroke-linejoin="round"/>
<path d="M35.4641 57.6395L37.0733 65.6851" stroke="black" stroke-width="1.4" stroke-linecap="round" stroke-linejoin="round"/>
<path d="M31.9241 54.4218L33.8551 65.6849" stroke="black" stroke-width="1.4" stroke-linecap="round" stroke-linejoin="round"/>
<path d="M28.062 51.8475L30.315 65.6853" stroke="black" stroke-width="1.4" stroke-linecap="round" stroke-linejoin="round"/>
<path d="M23.8784 49.2733L27.0968 65.6857" stroke="black" stroke-width="1.4" stroke-linecap="round" stroke-linejoin="round"/>
<path d="M3.39196 59.4147L160.747 91.08" stroke="black" stroke-width="6" stroke-linecap="round" stroke-linejoin="round"/>
<path d="M147.991 88.1008L141.505 74.145L170.087 91.7297L169.366 93.3641L136.611 98.4607L147.991 88.1008Z" fill="black" stroke="black" stroke-width="1.4" stroke-linecap="round" stroke-linejoin="round"/>
<path d="M136.611 98.4608L169.366 93.3642" stroke="white" stroke-width="1.4" stroke-linecap="round" stroke-linejoin="round"/>
<path d="M19.862 76.7415C9.56449 76.9255 7.09608 65.8225 8.68987 60.558L41.5089 67.1624C38.5839 70.2788 30.1595 76.5575 19.862 76.7415Z" fill="white" stroke="black" stroke-width="1.4" stroke-linecap="round" stroke-linejoin="round"/>
</svg>
