<svg width="32" height="32" viewBox="0 0 32 32" fill="none" xmlns="http://www.w3.org/2000/svg">
<path d="M9.3335 9.33301L22.6668 22.6663M9.3335 22.6663L22.6668 9.33301" stroke-width="2" stroke-linecap="round" stroke-linejoin="round"/>
</svg>
