<svg width="655" height="540" viewBox="0 0 655 540" fill="none" xmlns="http://www.w3.org/2000/svg">
<g filter="url(#filter0_d_338_30656)">
<g opacity="0.3">
<path d="M269.268 252.003C267.797 251.646 266.805 250.229 267.012 248.697C267.461 245.349 268.065 241.972 268.804 238.656C269.164 237.042 270.76 236.025 272.373 236.386C272.391 236.389 272.413 236.396 272.43 236.4C274.008 236.782 274.997 238.363 274.644 239.955C273.944 243.104 273.369 246.313 272.941 249.493C272.72 251.132 271.217 252.281 269.578 252.06C269.471 252.049 269.368 252.028 269.268 252.003ZM275.6 226.73C275.486 226.701 275.372 226.669 275.261 226.626C273.712 226.052 272.923 224.327 273.498 222.782C274.679 219.601 276.011 216.442 277.449 213.387C278.152 211.891 279.93 211.256 281.429 211.955C282.921 212.662 283.564 214.443 282.857 215.935C281.486 218.837 280.226 221.839 279.102 224.863C278.57 226.301 277.053 227.083 275.6 226.73ZM287.337 203.477C287.012 203.399 286.698 203.263 286.402 203.07C285.02 202.164 284.635 200.311 285.542 198.93C287.398 196.099 289.4 193.311 291.492 190.648C292.513 189.349 294.394 189.128 295.694 190.145C296.993 191.166 297.218 193.047 296.197 194.346C294.209 196.874 292.306 199.519 290.546 202.21C289.832 203.299 288.533 203.767 287.337 203.477ZM303.986 183.43C303.45 183.302 302.947 183.024 302.536 182.595C301.394 181.403 301.43 179.511 302.622 178.365C305.067 176.02 307.641 173.75 310.275 171.622C311.56 170.587 313.442 170.787 314.48 172.068C315.519 173.353 315.319 175.235 314.034 176.273C311.532 178.294 309.087 180.45 306.763 182.677C305.999 183.416 304.946 183.666 303.986 183.43ZM324.682 167.599C323.933 167.417 323.254 166.946 322.826 166.232C321.973 164.815 322.433 162.98 323.847 162.127C326.742 160.385 329.755 158.743 332.8 157.247C334.281 156.519 336.073 157.13 336.801 158.611C337.529 160.092 336.919 161.884 335.438 162.616C332.543 164.037 329.68 165.597 326.928 167.253C326.228 167.678 325.421 167.781 324.682 167.599ZM348.367 156.744C347.396 156.508 346.564 155.791 346.229 154.774C345.711 153.203 346.564 151.515 348.135 150.997C351.351 149.937 354.649 149.002 357.944 148.22C359.55 147.838 361.164 148.83 361.546 150.44C361.928 152.046 360.935 153.66 359.329 154.042C356.198 154.784 353.061 155.673 350.009 156.68C349.455 156.858 348.891 156.869 348.367 156.744ZM456.547 175.667C456.144 175.57 455.758 175.385 455.409 175.113C452.878 173.132 450.229 171.233 447.53 169.473C446.149 168.57 445.756 166.718 446.659 165.336C447.563 163.951 449.415 163.562 450.8 164.465C453.642 166.318 456.433 168.317 459.096 170.405C460.395 171.422 460.624 173.303 459.606 174.603C458.864 175.559 457.654 175.934 456.547 175.667ZM373.854 151.407C372.647 151.115 371.705 150.087 371.583 148.78C371.43 147.135 372.636 145.678 374.278 145.521C377.648 145.203 381.075 145.029 384.459 145C386.112 144.993 387.461 146.314 387.475 147.966C387.49 149.619 386.162 150.968 384.509 150.983C381.293 151.008 378.041 151.175 374.842 151.475C374.5 151.511 374.164 151.486 373.854 151.407ZM434.359 162.016C434.166 161.97 433.977 161.906 433.791 161.816C430.882 160.449 427.873 159.193 424.849 158.075C423.3 157.501 422.507 155.784 423.079 154.235C423.653 152.685 425.374 151.886 426.92 152.464C430.1 153.638 433.266 154.963 436.329 156.401C437.825 157.105 438.467 158.886 437.768 160.378C437.154 161.688 435.711 162.345 434.359 162.016ZM399.89 151.9C398.423 151.543 397.431 150.13 397.634 148.602C397.852 146.963 399.355 145.814 400.993 146.028C404.345 146.474 407.726 147.067 411.035 147.799C411.056 147.802 411.078 147.806 411.095 147.813C412.673 148.195 413.662 149.773 413.309 151.361C412.952 152.975 411.356 153.995 409.743 153.638C406.598 152.946 403.389 152.382 400.205 151.957C400.097 151.943 399.99 151.925 399.89 151.9Z" fill="#AC00FF"/>
<path d="M471.84 190.063C471.268 189.924 470.729 189.617 470.308 189.142C469.287 187.989 468.224 186.836 467.146 185.715C466 184.527 466.039 182.631 467.228 181.485C468.416 180.339 470.312 180.375 471.458 181.567C472.589 182.742 473.706 183.955 474.784 185.169C475.88 186.404 475.766 188.296 474.531 189.392C473.771 190.07 472.76 190.284 471.84 190.063Z" fill="#AC00FF"/>
</g>
<g opacity="0.3">
<path d="M500.86 276.501C499.457 276.162 498.468 274.845 498.586 273.36C498.708 271.821 498.8 270.258 498.857 268.709C498.922 267.06 500.31 265.771 501.96 265.832C503.616 265.896 504.897 267.284 504.837 268.934C504.776 270.565 504.676 272.214 504.551 273.831C504.419 275.477 502.98 276.705 501.331 276.576C501.171 276.565 501.014 276.54 500.86 276.501Z" fill="#AC00FF"/>
<path d="M357.383 380.602C356.044 380.277 354.709 379.927 353.374 379.556C351.782 379.113 350.854 377.464 351.297 375.872C351.739 374.28 353.399 373.348 354.981 373.795C358.065 374.655 361.174 375.387 364.265 375.976C365.889 376.29 366.949 377.853 366.642 379.474C366.332 381.098 364.765 382.162 363.144 381.851C361.227 381.483 359.289 381.062 357.383 380.602ZM338.485 374.287C338.325 374.248 338.161 374.194 338.003 374.126C334.941 372.806 331.896 371.339 328.962 369.768C327.505 368.99 326.956 367.176 327.734 365.72C328.512 364.264 330.329 363.71 331.782 364.496C334.57 365.988 337.461 367.38 340.37 368.636C341.887 369.29 342.587 371.049 341.93 372.567C341.348 373.923 339.877 374.626 338.485 374.287ZM378.761 383.729C377.391 383.397 376.409 382.126 376.484 380.67C376.57 379.02 377.976 377.753 379.625 377.839C382.781 378.003 385.986 378.035 389.152 377.932C390.805 377.882 392.187 379.174 392.24 380.823C392.294 382.476 390.998 383.857 389.349 383.911C386.015 384.021 382.638 383.986 379.315 383.814C379.125 383.8 378.94 383.772 378.761 383.729ZM316.2 361.597C315.833 361.508 315.476 361.344 315.147 361.108C312.452 359.148 309.807 357.046 307.287 354.868C306.038 353.787 305.902 351.899 306.984 350.649C308.065 349.4 309.953 349.261 311.203 350.346C313.594 352.416 316.108 354.412 318.667 356.271C320.002 357.242 320.298 359.113 319.327 360.448C318.592 361.458 317.343 361.872 316.2 361.597ZM404.341 382.215C403.217 381.944 402.306 381.027 402.099 379.813C401.821 378.185 402.913 376.639 404.541 376.357C407.654 375.826 410.788 375.147 413.854 374.351C415.453 373.937 417.085 374.894 417.502 376.497C417.916 378.096 416.956 379.727 415.36 380.141C412.13 380.98 408.832 381.69 405.555 382.254C405.137 382.329 404.727 382.312 404.341 382.215ZM428.971 375.13C428.072 374.912 427.287 374.28 426.908 373.359C426.28 371.831 427.008 370.082 428.536 369.454C431.467 368.247 434.379 366.905 437.192 365.463C438.663 364.706 440.462 365.288 441.219 366.759C441.972 368.229 441.39 370.032 439.923 370.785C436.96 372.302 433.894 373.716 430.813 374.983C430.207 375.237 429.564 375.272 428.971 375.13ZM451.471 362.843C450.789 362.679 450.161 362.272 449.725 361.651C448.779 360.298 449.111 358.431 450.464 357.485C453.063 355.668 455.615 353.726 458.046 351.706C459.317 350.649 461.201 350.824 462.258 352.095C463.315 353.366 463.14 355.25 461.869 356.307C459.31 358.435 456.625 360.48 453.891 362.39C453.156 362.9 452.274 363.036 451.471 362.843ZM470.75 345.941C470.275 345.827 469.826 345.595 469.44 345.241C468.219 344.127 468.137 342.236 469.251 341.018C471.389 338.68 473.452 336.224 475.38 333.719C476.386 332.408 478.268 332.166 479.574 333.172C480.884 334.179 481.127 336.057 480.12 337.367C478.089 340.008 475.915 342.593 473.667 345.056C472.903 345.887 471.778 346.191 470.75 345.941ZM485.857 325.212C485.589 325.148 485.328 325.044 485.079 324.902C483.644 324.084 483.144 322.257 483.961 320.822C485.528 318.076 486.995 315.228 488.33 312.354C489.026 310.855 490.808 310.206 492.3 310.898C493.799 311.594 494.449 313.372 493.756 314.871C492.353 317.898 490.808 320.896 489.159 323.784C488.484 324.969 487.12 325.519 485.857 325.212ZM496.034 301.685C495.973 301.671 495.916 301.653 495.855 301.635C494.277 301.149 493.392 299.475 493.878 297.898C494.563 295.67 495.191 293.393 495.741 291.133C495.941 290.316 496.13 289.495 496.309 288.677C496.662 287.064 498.258 286.043 499.871 286.4C501.513 286.728 502.505 288.349 502.152 289.962C501.963 290.823 501.763 291.686 501.556 292.547C500.978 294.924 500.321 297.319 499.596 299.664C499.129 301.178 497.558 302.056 496.034 301.685Z" fill="#AC00FF"/>
<path d="M297.214 344.252C296.636 344.113 296.093 343.799 295.672 343.321C294.605 342.103 293.541 340.84 292.517 339.569C291.478 338.284 291.681 336.399 292.967 335.364C294.252 334.329 296.133 334.525 297.171 335.814C298.146 337.024 299.156 338.223 300.17 339.38C301.259 340.622 301.137 342.51 299.895 343.599C299.131 344.263 298.128 344.477 297.214 344.252Z" fill="#AC00FF"/>
</g>
<path d="M425.97 200.829C432.855 205.234 438.856 210.681 443.828 216.878L460.73 214.936M425.97 200.829L459.443 217.012L459.445 217.016L459.446 217.017M425.97 200.829L426.087 183.827L425.97 200.829ZM460.73 214.936L460.889 216.323L460.889 216.325L461.072 217.916M460.73 214.936L460.89 216.323L460.89 216.325L461.073 217.916L461.072 217.916M460.73 214.936C461.323 214.868 461.894 215.182 462.151 215.721L470.961 234.13M461.072 217.916C460.401 217.993 459.744 217.639 459.446 217.017M461.072 217.916L459.938 218.047M459.446 217.017L459.938 218.047M459.446 217.017L465.532 300.958L465.534 300.958L465.523 302.556L466.841 303.026L465.523 302.562L465.514 303.958M459.938 218.047L467.762 234.395M459.938 218.047L444.171 219.858L442.525 220.047L441.488 218.755C436.716 212.808 430.959 207.582 424.353 203.356L422.958 202.464L422.97 200.808L423.08 184.948L405.985 178.925L396.121 191.347L395.091 192.643L393.446 192.463C385.648 191.61 377.887 192.069 370.439 193.707L368.822 194.062L367.659 192.883L356.514 181.585L340.165 189.409L341.976 205.177L342.165 206.822L340.874 207.859C334.926 212.631 329.7 218.389 325.474 224.995L324.582 226.389L322.926 226.378L307.066 226.268L301.04 243.356L313.461 253.219L314.758 254.249L314.578 255.895C313.725 263.692 314.187 271.453 315.822 278.899L316.177 280.516L314.998 281.678L303.7 292.823L311.527 309.168L327.295 307.357L328.941 307.168L329.977 308.46C334.749 314.407 340.507 319.633 347.113 323.859L348.508 324.751L348.496 326.407L348.386 342.267L365.474 348.293L375.338 335.872L376.367 334.575L378.013 334.755C385.81 335.608 393.572 335.146 401.021 333.511L402.638 333.157L403.8 334.335L414.945 345.633L431.294 337.809L429.482 322.042L429.293 320.396L430.585 319.359C436.532 314.587 441.759 308.83 445.985 302.224L446.877 300.829L448.532 300.841L464.393 300.95L470.418 283.863L457.997 273.999L456.701 272.969L456.881 271.324C457.733 263.526 457.275 255.765 455.637 248.321L455.281 246.703L456.461 245.54L467.762 234.395M470.961 234.13L469.701 234.73L469.699 234.731L468.253 235.421M470.961 234.13L469.702 234.732L469.7 234.733L468.255 235.425L468.253 235.421M470.961 234.13C471.218 234.669 471.107 235.311 470.682 235.729L458.567 247.676C460.274 255.433 460.752 263.522 459.863 271.65L473.178 282.223C473.645 282.594 473.827 283.219 473.627 283.783L466.842 303.027C466.642 303.587 466.11 303.962 465.514 303.958M468.253 235.421C467.966 234.818 468.081 234.083 468.574 233.595M468.253 235.421L467.762 234.395M468.574 233.595L468.576 233.593L468.579 233.59C468.578 233.591 468.576 233.593 468.574 233.595ZM468.574 233.595L467.762 234.395M465.514 303.958L465.522 302.561L415.751 346.45L415.747 346.447C415.259 345.952 414.523 345.836 413.92 346.124M465.514 303.958L448.512 303.84C444.107 310.726 438.659 316.727 432.463 321.699L434.405 338.601M434.405 338.601L433.018 338.76L433.015 338.76L431.424 338.943L431.424 338.944L433.016 338.761L433.018 338.761L434.405 338.601ZM434.405 338.601C434.472 339.194 434.158 339.765 433.619 340.022L415.211 348.832M415.211 348.832L414.61 347.572L414.609 347.57L413.92 346.124M415.211 348.832C414.672 349.089 414.029 348.978 413.612 348.553L413.92 346.124M415.211 348.832L414.608 347.573L414.607 347.571L413.916 346.126L413.92 346.124M471.312 284.573C471.312 284.572 471.311 284.572 471.31 284.571L471.312 284.572L471.312 284.573ZM432.324 337.316L432.321 337.317C432.323 337.316 432.326 337.315 432.328 337.314L432.324 337.316ZM364.764 349.187C364.765 349.186 364.765 349.186 364.766 349.185L364.764 349.187L364.764 349.187ZM366.556 348.674L366.552 348.673C366.553 348.673 366.555 348.674 366.556 348.674ZM300.146 242.646C300.147 242.647 300.148 242.647 300.149 242.648L300.147 242.646L300.146 242.646Z" fill="#C73FFF" stroke="black" stroke-width="6"/>
<path d="M373.915 310.199C372.34 309.817 370.771 309.352 369.212 308.803C366.113 307.709 363.122 306.303 360.315 304.614C360.192 304.535 360.063 304.461 359.939 304.382C358.969 303.788 358.538 302.649 358.791 301.6C358.85 301.342 358.954 301.095 359.103 300.857C359.845 299.654 361.419 299.283 362.627 300.02C365.231 301.624 368.023 302.951 370.919 303.971C371.078 304.025 371.241 304.08 371.395 304.134C378.271 306.486 385.474 307.03 392.449 305.842C396.237 305.194 399.959 304.035 403.534 302.367C403.563 302.352 403.593 302.342 403.623 302.327C403.712 302.283 403.801 302.243 403.89 302.199C414.281 297.223 422.118 288.5 425.95 277.634C426.445 276.228 426.866 274.807 427.212 273.376C429.544 263.758 428.509 253.713 424.178 244.663C419.202 234.272 410.479 226.44 399.613 222.609C388.751 218.782 377.038 219.406 366.647 224.381C356.256 229.356 348.419 238.079 344.588 248.946C344.097 250.327 343.682 251.733 343.34 253.144C341.85 259.282 341.721 265.673 342.984 271.862C343.063 272.243 343.048 272.624 342.964 272.975C342.736 273.911 341.988 274.678 340.988 274.881C339.602 275.159 338.251 274.273 337.964 272.881C336.553 265.956 336.696 258.802 338.36 251.936C338.746 250.351 339.206 248.782 339.756 247.238C344.043 235.079 352.805 225.321 364.434 219.757C376.063 214.193 389.157 213.48 401.316 217.777C413.474 222.064 423.232 230.826 428.796 242.455C433.643 252.579 434.801 263.817 432.192 274.574C431.806 276.174 431.336 277.763 430.782 279.332C422.475 302.877 397.667 315.966 373.915 310.199Z" fill="black"/>
<path d="M380.879 283.544C371.162 281.184 364.362 271.978 365.304 261.733C366.34 250.471 376.345 242.15 387.611 243.186C393.069 243.685 398.002 246.284 401.504 250.496C405.006 254.708 406.662 260.034 406.159 265.489C405.123 276.754 395.118 285.071 383.852 284.036C382.835 283.943 381.842 283.776 380.879 283.544ZM389.471 248.329C388.721 248.147 387.954 248.019 387.168 247.948C378.533 247.151 370.862 253.534 370.066 262.169C369.27 270.804 375.649 278.478 384.288 279.271C392.922 280.067 400.594 273.684 401.39 265.05C401.775 260.866 400.508 256.782 397.82 253.552C395.639 250.928 392.73 249.122 389.471 248.329Z" fill="black"/>
<g opacity="0.3">
<path d="M151.499 304.53C150.721 304.34 150.132 303.662 150.089 302.823C150.014 301.256 149.986 299.668 150.007 298.097C150.021 297.076 150.856 296.262 151.877 296.273C152.898 296.28 153.712 297.123 153.701 298.144C153.684 299.639 153.709 301.153 153.78 302.648C153.83 303.666 153.041 304.533 152.024 304.58C151.842 304.587 151.667 304.569 151.499 304.53Z" fill="#AC00FF"/>
<path d="M152.131 290.333C151.221 290.112 150.606 289.234 150.739 288.288C151.106 285.614 151.613 282.926 152.252 280.302C152.388 279.749 152.527 279.199 152.673 278.646C152.938 277.661 153.99 277.122 154.933 277.332C155.918 277.593 156.507 278.607 156.247 279.592C156.107 280.12 155.972 280.649 155.843 281.177C155.236 283.679 154.751 286.242 154.401 288.791C154.262 289.801 153.33 290.508 152.32 290.372C152.252 290.358 152.191 290.347 152.131 290.333ZM157.046 271.792C156.96 271.771 156.875 271.746 156.793 271.714C155.847 271.332 155.386 270.258 155.765 269.312C156.982 266.274 158.399 263.282 159.973 260.427C160.466 259.534 161.594 259.213 162.483 259.702C163.375 260.195 163.7 261.319 163.207 262.212C161.704 264.939 160.355 267.791 159.191 270.689C158.849 271.55 157.924 272.007 157.046 271.792ZM166.313 255.001C166.084 254.947 165.863 254.844 165.663 254.701C164.839 254.101 164.657 252.945 165.256 252.12C167.177 249.479 169.286 246.923 171.524 244.535C172.224 243.789 173.388 243.75 174.134 244.449C174.876 245.145 174.916 246.316 174.219 247.059C172.085 249.336 170.075 251.767 168.244 254.291C167.791 254.915 167.02 255.172 166.313 255.001ZM179.424 240.997C179.053 240.908 178.706 240.701 178.442 240.387C177.789 239.602 177.896 238.438 178.678 237.785C181.194 235.689 183.861 233.733 186.61 231.966C187.47 231.417 188.612 231.666 189.162 232.523C189.715 233.38 189.465 234.522 188.605 235.075C185.988 236.757 183.443 238.624 181.045 240.623C180.577 241.012 179.974 241.133 179.424 240.997ZM195.555 230.624C195.037 230.499 194.577 230.149 194.324 229.628C193.881 228.711 194.266 227.608 195.187 227.162C198.132 225.744 201.195 224.492 204.286 223.446C205.254 223.117 206.303 223.635 206.628 224.602C206.956 225.57 206.435 226.619 205.471 226.944C202.519 227.943 199.599 229.136 196.79 230.488C196.39 230.685 195.955 230.721 195.555 230.624ZM213.714 224.481C213.043 224.317 212.489 223.781 212.339 223.057C212.132 222.057 212.778 221.083 213.774 220.876C216.976 220.215 220.25 219.751 223.505 219.494C224.526 219.416 225.411 220.172 225.493 221.19C225.575 222.207 224.815 223.096 223.798 223.178C220.696 223.424 217.576 223.867 214.52 224.495C214.246 224.552 213.971 224.542 213.714 224.481ZM232.818 222.964C231.976 222.76 231.369 221.982 231.412 221.086C231.458 220.065 232.322 219.276 233.339 219.323C236.595 219.469 239.882 219.823 243.117 220.369C244.123 220.558 244.801 221.497 244.626 222.5C244.455 223.506 243.502 224.181 242.495 224.013C239.411 223.488 236.274 223.153 233.172 223.014C233.054 223.007 232.932 222.989 232.818 222.964ZM260.747 229.496C260.643 229.471 260.54 229.435 260.44 229.393C257.973 228.311 255.407 227.344 252.804 226.519C252.412 226.391 252.023 226.273 251.637 226.159C250.659 225.866 250.102 224.838 250.395 223.86C250.684 222.878 251.73 222.296 252.694 222.618C253.108 222.742 253.518 222.867 253.932 223.003C256.649 223.863 259.34 224.877 261.928 226.016C262.864 226.426 263.288 227.515 262.878 228.45C262.507 229.278 261.6 229.703 260.747 229.496Z" fill="#AC00FF"/>
</g>
<g opacity="0.3">
<path d="M212.043 376.824C211.061 376.585 210.454 375.603 210.679 374.618C210.908 373.626 211.896 373.001 212.892 373.23C215.887 373.915 218.946 374.425 221.991 374.74C222.998 374.854 223.744 375.753 223.637 376.767C223.53 377.781 222.623 378.52 221.609 378.413C218.418 378.077 215.209 377.545 212.071 376.828C212.061 376.828 212.053 376.828 212.043 376.824ZM202.976 374.165C202.912 374.151 202.847 374.129 202.783 374.108C199.756 373.019 196.765 371.738 193.891 370.295C192.981 369.835 192.61 368.728 193.07 367.818C193.527 366.904 194.641 366.54 195.551 366.993C198.293 368.368 201.145 369.592 204.032 370.631C204.993 370.974 205.492 372.034 205.146 372.994C204.825 373.894 203.879 374.386 202.976 374.165ZM230.805 378.777C230.009 378.584 229.409 377.874 229.395 377.017C229.377 376 230.187 375.157 231.204 375.136C234.278 375.075 237.373 374.829 240.403 374.4C241.417 374.261 242.349 374.961 242.488 375.971C242.631 376.981 241.927 377.916 240.917 378.059C237.74 378.509 234.496 378.766 231.276 378.827C231.112 378.834 230.954 378.816 230.805 378.777ZM186.113 365.691C185.91 365.641 185.71 365.555 185.524 365.434C182.847 363.649 180.252 361.682 177.814 359.583C177.039 358.919 176.953 357.752 177.617 356.977C178.281 356.206 179.449 356.117 180.223 356.781C182.547 358.78 185.021 360.654 187.577 362.357C188.426 362.924 188.655 364.07 188.091 364.92C187.644 365.584 186.848 365.869 186.113 365.691ZM249.477 376.139C248.842 375.985 248.306 375.496 248.128 374.822C247.864 373.836 248.449 372.823 249.434 372.559C252.397 371.766 255.338 370.784 258.183 369.635C259.129 369.253 260.207 369.714 260.589 370.659C260.971 371.605 260.511 372.683 259.565 373.065C256.581 374.265 253.497 375.296 250.391 376.128C250.08 376.21 249.766 376.21 249.477 376.139ZM266.975 369.096C266.49 368.978 266.051 368.664 265.794 368.193C265.301 367.3 265.626 366.176 266.519 365.683C269.21 364.199 271.834 362.542 274.318 360.754C275.146 360.158 276.303 360.347 276.895 361.175C277.492 362.003 277.302 363.156 276.478 363.752C273.872 365.626 271.123 367.368 268.303 368.921C267.879 369.153 267.407 369.203 266.975 369.096ZM282.282 358.066C281.939 357.984 281.618 357.802 281.361 357.523C280.668 356.774 280.715 355.606 281.464 354.914C283.724 352.833 285.873 350.591 287.854 348.257C288.514 347.482 289.678 347.382 290.456 348.042C291.235 348.703 291.331 349.867 290.67 350.648C288.593 353.097 286.341 355.446 283.97 357.63C283.499 358.062 282.86 358.205 282.282 358.066Z" fill="#AC00FF"/>
<path d="M171.742 353.329C171.396 353.244 171.071 353.062 170.814 352.776C169.75 351.605 168.715 350.399 167.741 349.188C167.102 348.396 167.223 347.232 168.019 346.59C168.812 345.954 169.975 346.076 170.618 346.868C171.55 348.021 172.535 349.174 173.549 350.292C174.234 351.045 174.18 352.216 173.424 352.901C172.952 353.329 172.321 353.468 171.742 353.329Z" fill="#AC00FF"/>
</g>
<path d="M193.461 327.849L192.424 326.558L190.779 326.747L180.934 327.878L176.311 318.214L183.368 311.256L184.548 310.093L184.192 308.475C183.119 303.597 182.817 298.514 183.377 293.405L183.557 291.758L182.26 290.729L174.504 284.57L178.066 274.467L187.97 274.535L189.626 274.547L190.518 273.152C193.288 268.823 196.712 265.05 200.606 261.924L201.898 260.887L201.709 259.242L200.577 249.397L210.241 244.773L217.199 251.831L218.362 253.011L219.98 252.655C224.858 251.581 229.942 251.28 235.051 251.84L236.697 252.02L237.727 250.723L243.886 242.967L253.988 246.529L253.92 256.433L253.909 258.089L255.303 258.981C259.632 261.751 263.405 265.174 266.532 269.069L267.568 270.361L269.214 270.172L279.059 269.04L283.682 278.704L276.624 285.662L275.444 286.825L275.8 288.443C276.874 293.321 277.175 298.404 276.616 303.514L276.435 305.16L277.732 306.19L285.488 312.349L281.927 322.451L272.022 322.383L270.366 322.372L269.474 323.767C266.709 328.095 263.282 331.867 259.386 334.995L258.095 336.031L258.284 337.676L259.415 347.522L249.752 352.145L242.793 345.087L241.63 343.907L240.012 344.263C235.134 345.337 230.051 345.638 224.942 345.079L223.296 344.898L222.266 346.195L216.107 353.951L206.004 350.39L206.072 340.485L206.084 338.829L204.688 337.937C200.361 335.171 196.588 331.745 193.461 327.849ZM181.573 329.214L181.57 329.207C181.571 329.209 181.572 329.212 181.573 329.214ZM199.241 250.036L199.248 250.033C199.246 250.034 199.244 250.035 199.241 250.036ZM280.529 268.871C280.526 268.872 280.524 268.872 280.522 268.872L280.529 268.871Z" fill="#C73FFF" stroke="black" stroke-width="6"/>
<path d="M226.675 312.033C223.78 311.33 221.196 309.723 219.254 307.392C216.87 304.522 215.741 300.896 216.084 297.18C216.787 289.509 223.605 283.844 231.276 284.547C238.958 285.268 244.616 292.072 243.909 299.743C243.567 303.459 241.8 306.821 238.93 309.206C236.06 311.594 232.433 312.718 228.713 312.375C228.021 312.308 227.339 312.193 226.675 312.033ZM232.426 288.47C231.944 288.352 231.448 288.27 230.937 288.223C225.294 287.706 220.282 291.875 219.761 297.519C219.511 300.253 220.336 302.92 222.092 305.029C223.848 307.142 226.322 308.438 229.053 308.695C231.787 308.945 234.453 308.117 236.567 306.364C238.68 304.608 239.979 302.134 240.229 299.4C240.704 294.267 237.295 289.651 232.426 288.47Z" fill="black"/>
<path d="M222.067 332.133C220.931 331.858 219.8 331.523 218.675 331.126C216.441 330.338 214.285 329.324 212.261 328.107C212.172 328.049 212.079 327.996 211.99 327.939C211.29 327.51 210.979 326.689 211.161 325.933C211.204 325.747 211.279 325.569 211.386 325.397C211.922 324.53 213.057 324.262 213.928 324.794C215.805 325.95 217.819 326.907 219.907 327.642C220.021 327.682 220.139 327.721 220.25 327.76C225.208 329.456 230.402 329.849 235.431 328.992C238.162 328.524 240.846 327.689 243.424 326.486C243.445 326.475 243.466 326.468 243.488 326.457C243.552 326.425 243.616 326.397 243.681 326.365C251.173 322.777 256.824 316.487 259.587 308.652C259.944 307.638 260.247 306.614 260.497 305.582C262.178 298.647 261.432 291.404 258.309 284.879C254.721 277.386 248.432 271.739 240.596 268.976C232.765 266.217 224.319 266.666 216.826 270.254C209.334 273.841 203.683 280.131 200.92 287.966C200.567 288.962 200.267 289.976 200.021 290.993C198.946 295.42 198.853 300.028 199.764 304.49C199.821 304.765 199.81 305.04 199.749 305.293C199.585 305.968 199.046 306.521 198.325 306.667C197.326 306.867 196.351 306.228 196.144 305.225C195.127 300.231 195.23 295.073 196.43 290.122C196.708 288.98 197.04 287.848 197.436 286.735C200.528 277.968 206.846 270.932 215.231 266.92C223.616 262.908 233.057 262.394 241.824 265.492C250.591 268.583 257.627 274.901 261.639 283.286C265.134 290.586 265.969 298.689 264.088 306.446C263.81 307.599 263.471 308.745 263.071 309.877C257.081 326.854 239.194 336.292 222.067 332.133Z" fill="black"/>
</g>
<defs>
<filter id="filter0_d_338_30656" x="0" y="0.264706" width="654.839" height="538.974" filterUnits="userSpaceOnUse" color-interpolation-filters="sRGB">
<feFlood flood-opacity="0" result="BackgroundImageFix"/>
<feColorMatrix in="SourceAlpha" type="matrix" values="0 0 0 0 0 0 0 0 0 0 0 0 0 0 0 0 0 0 127 0" result="hardAlpha"/>
<feOffset dy="5.26471"/>
<feGaussianBlur stdDeviation="75"/>
<feComposite in2="hardAlpha" operator="out"/>
<feColorMatrix type="matrix" values="0 0 0 0 0.704779 0 0 0 0 0.0875 0 0 0 0 1 0 0 0 1 0"/>
<feBlend mode="normal" in2="BackgroundImageFix" result="effect1_dropShadow_338_30656"/>
<feBlend mode="normal" in="SourceGraphic" in2="effect1_dropShadow_338_30656" result="shape"/>
</filter>
</defs>
</svg>
