<svg width="541" height="603" viewBox="0 0 541 603" fill="none" xmlns="http://www.w3.org/2000/svg">
<g filter="url(#filter0_d_277_53553)">
<path d="M195.225 132.5H345.94C353.589 132.5 359.787 138.699 359.787 146.348V447.822C359.787 455.471 353.589 461.669 345.94 461.669H195.225C187.576 461.669 181.377 455.471 181.377 447.822V146.348C181.377 138.699 187.576 132.5 195.225 132.5Z" fill="#8507B1" stroke="black" stroke-width="3"/>
<path d="M348.122 138.707C351.277 138.707 353.834 141.242 353.834 144.347V450.153C353.834 453.269 351.266 455.793 348.122 455.793H193.295C190.14 455.793 187.584 453.258 187.584 450.153V144.347C187.584 141.231 190.151 138.707 193.295 138.707H348.122Z" fill="black"/>
<path d="M210.099 159.509H331.065C334.377 159.509 337.073 162.203 337.083 165.529V199.955C337.083 203.279 334.389 205.973 331.065 205.973H210.099C206.775 205.973 204.081 203.279 204.081 199.955V165.527C204.081 162.203 206.775 159.509 210.099 159.509Z" fill="white" stroke="black"/>
<path d="M215.747 166.765H276.126C277.93 166.765 279.402 168.236 279.402 170.041C279.402 171.846 277.93 173.318 276.126 173.318H215.747C213.943 173.318 212.471 171.846 212.471 170.041C212.471 168.236 213.943 166.765 215.747 166.765Z" fill="black" stroke="black"/>
<path d="M214.525 179.459H319.736C320.869 179.459 321.79 180.38 321.79 181.514C321.79 182.647 320.869 183.568 319.736 183.568H214.525C213.392 183.568 212.471 182.647 212.471 181.514C212.471 180.38 213.392 179.459 214.525 179.459Z" fill="#BCD7E9" stroke="black"/>
<path d="M214.525 188.884H290.538C291.671 188.884 292.592 189.805 292.592 190.938C292.592 192.071 291.671 192.992 290.538 192.992H214.525C213.392 192.992 212.471 192.071 212.471 190.938C212.471 189.805 213.392 188.884 214.525 188.884Z" fill="#BCD7E9" stroke="black"/>
<path d="M225.524 197.372H237.91C239.043 197.372 239.964 198.294 239.964 199.427C239.964 200.56 239.043 201.481 237.91 201.481H225.524C224.391 201.481 223.47 200.56 223.47 199.427C223.47 198.294 224.391 197.372 225.524 197.372Z" fill="black" stroke="black"/>
<path d="M220.65 202.494H214.169L217.41 196.881L220.65 202.494Z" fill="#00F700" stroke="black"/>
<path d="M262.165 197.372H274.551C275.684 197.372 276.606 198.294 276.606 199.427C276.606 200.56 275.684 201.481 274.551 201.481H262.165C261.032 201.481 260.111 200.56 260.111 199.427C260.111 198.294 261.032 197.372 262.165 197.372Z" fill="black" stroke="black"/>
<path d="M250.81 196.381H257.291L254.051 201.994L250.81 196.381Z" fill="#FF008A" stroke="black"/>
<path d="M210.099 217.983H331.065C334.377 217.983 337.073 220.676 337.083 224.002V258.429C337.083 261.753 334.389 264.447 331.065 264.447H210.099C206.775 264.447 204.081 261.753 204.081 258.429V224.001C204.081 220.677 206.775 217.983 210.099 217.983Z" fill="white" stroke="black"/>
<path d="M215.747 225.238H276.126C277.93 225.238 279.402 226.71 279.402 228.515C279.402 230.32 277.93 231.791 276.126 231.791H215.747C213.943 231.791 212.471 230.32 212.471 228.515C212.471 226.71 213.943 225.238 215.747 225.238Z" fill="black" stroke="black"/>
<path d="M214.525 237.933H319.736C320.869 237.933 321.79 238.854 321.79 239.987C321.79 241.12 320.869 242.041 319.736 242.041H214.525C213.392 242.041 212.471 241.12 212.471 239.987C212.471 238.854 213.392 237.933 214.525 237.933Z" fill="#BCD7E9" stroke="black"/>
<path d="M214.525 247.357H290.538C291.671 247.357 292.592 248.279 292.592 249.412C292.592 250.545 291.671 251.466 290.538 251.466H214.525C213.392 251.466 212.471 250.545 212.471 249.412C212.471 248.279 213.392 247.357 214.525 247.357Z" fill="#BCD7E9" stroke="black"/>
<path d="M225.524 255.857H237.91C239.043 255.857 239.964 256.778 239.964 257.911C239.964 259.044 239.043 259.966 237.91 259.966H225.524C224.391 259.966 223.47 259.044 223.47 257.911C223.47 256.778 224.391 255.857 225.524 255.857Z" fill="black" stroke="black"/>
<path d="M220.65 260.968H214.169L217.41 255.355L220.65 260.968Z" fill="#00F700" stroke="black"/>
<path d="M262.165 255.857H274.551C275.684 255.857 276.606 256.778 276.606 257.911C276.606 259.044 275.684 259.966 274.551 259.966H262.165C261.032 259.966 260.111 259.044 260.111 257.911C260.111 256.778 261.032 255.857 262.165 255.857Z" fill="black" stroke="black"/>
<path d="M250.81 254.855H257.291L254.051 260.468L250.81 254.855Z" fill="#FF008A" stroke="black"/>
<path d="M210.099 276.457H331.065C334.377 276.457 337.073 279.15 337.083 282.476V316.903C337.083 320.227 334.389 322.92 331.065 322.92H210.099C206.775 322.92 204.081 320.227 204.081 316.903V282.475C204.081 279.15 206.775 276.457 210.099 276.457Z" fill="white" stroke="black"/>
<path d="M215.747 283.723H276.126C277.931 283.723 279.402 285.185 279.402 287C279.402 288.804 277.93 290.276 276.126 290.276H215.747C213.943 290.276 212.471 288.804 212.471 287C212.471 285.185 213.942 283.723 215.747 283.723Z" fill="black" stroke="black"/>
<path d="M214.525 296.418H319.736C320.869 296.418 321.79 297.339 321.79 298.472C321.79 299.605 320.869 300.526 319.736 300.526H214.525C213.392 300.526 212.471 299.605 212.471 298.472C212.471 297.339 213.392 296.418 214.525 296.418Z" fill="#BCD7E9" stroke="black"/>
<path d="M214.525 305.831H290.538C291.671 305.831 292.592 306.752 292.592 307.885C292.592 309.019 291.671 309.94 290.538 309.94H214.525C213.392 309.94 212.471 309.018 212.471 307.885C212.471 306.752 213.392 305.831 214.525 305.831Z" fill="#BCD7E9" stroke="black"/>
<path d="M225.524 314.331H237.91C239.043 314.331 239.964 315.252 239.964 316.385C239.964 317.518 239.043 318.439 237.91 318.439H225.524C224.391 318.439 223.47 317.518 223.47 316.385C223.47 315.252 224.391 314.331 225.524 314.331Z" fill="black" stroke="black"/>
<path d="M220.65 319.441H214.169L217.41 313.829L220.65 319.441Z" fill="#00F700" stroke="black"/>
<path d="M262.165 314.331H274.551C275.684 314.331 276.606 315.252 276.606 316.385C276.606 317.518 275.684 318.439 274.551 318.439H262.165C261.032 318.439 260.111 317.518 260.111 316.385C260.111 315.252 261.032 314.331 262.165 314.331Z" fill="black" stroke="black"/>
<path d="M250.81 313.329H257.291L254.051 318.941L250.81 313.329Z" fill="#FF008A" stroke="black"/>
<rect x="274.198" y="353.498" width="129.204" height="46.404" rx="7.002" fill="#820FB9"/>
<path d="M303.951 374.291L301.082 374.291C301.001 373.821 300.85 373.404 300.63 373.041C300.41 372.673 300.136 372.361 299.809 372.105C299.482 371.849 299.108 371.658 298.689 371.53C298.275 371.397 297.828 371.33 297.347 371.33C296.493 371.33 295.736 371.545 295.076 371.975C294.417 372.399 293.9 373.023 293.527 373.846C293.154 374.664 292.967 375.664 292.967 376.845C292.967 378.047 293.154 379.06 293.527 379.883C293.905 380.701 294.422 381.32 295.076 381.739C295.736 382.153 296.49 382.36 297.339 382.36C297.81 382.36 298.249 382.299 298.658 382.176C299.073 382.049 299.443 381.862 299.771 381.616C300.103 381.371 300.382 381.069 300.607 380.711C300.837 380.353 300.995 379.944 301.082 379.484L303.951 379.499C303.844 380.246 303.611 380.947 303.253 381.601C302.9 382.256 302.437 382.833 301.865 383.335C301.292 383.831 300.622 384.219 299.855 384.501C299.088 384.777 298.237 384.915 297.301 384.915C295.92 384.915 294.688 384.595 293.604 383.956C292.52 383.317 291.666 382.394 291.042 381.187C290.418 379.98 290.106 378.533 290.106 376.845C290.106 375.153 290.42 373.706 291.049 372.504C291.678 371.297 292.535 370.374 293.619 369.735C294.703 369.096 295.93 368.776 297.301 368.776C298.175 368.776 298.988 368.899 299.74 369.144C300.492 369.39 301.162 369.75 301.75 370.226C302.338 370.696 302.821 371.274 303.199 371.959C303.583 372.639 303.833 373.417 303.951 374.291ZM320.594 376.845C320.594 378.538 320.277 379.988 319.643 381.195C319.014 382.396 318.155 383.317 317.066 383.956C315.982 384.595 314.752 384.915 313.376 384.915C312.001 384.915 310.768 384.595 309.679 383.956C308.595 383.312 307.736 382.389 307.102 381.187C306.473 379.98 306.158 378.533 306.158 376.845C306.158 375.153 306.473 373.706 307.102 372.504C307.736 371.297 308.595 370.374 309.679 369.735C310.768 369.096 312.001 368.776 313.376 368.776C314.752 368.776 315.982 369.096 317.066 369.735C318.155 370.374 319.014 371.297 319.643 372.504C320.277 373.706 320.594 375.153 320.594 376.845ZM317.733 376.845C317.733 375.654 317.546 374.649 317.173 373.831C316.805 373.008 316.294 372.386 315.639 371.967C314.984 371.543 314.23 371.33 313.376 371.33C312.522 371.33 311.768 371.543 311.113 371.967C310.459 372.386 309.945 373.008 309.572 373.831C309.203 374.649 309.019 375.654 309.019 376.845C309.019 378.037 309.203 379.044 309.572 379.868C309.945 380.686 310.459 381.307 311.113 381.731C311.768 382.151 312.522 382.36 313.376 382.36C314.23 382.36 314.984 382.151 315.639 381.731C316.294 381.307 316.805 380.686 317.173 379.868C317.546 379.044 317.733 378.037 317.733 376.845ZM323.284 384.7L323.284 368.991L329.175 368.991C330.382 368.991 331.395 369.216 332.213 369.666C333.036 370.116 333.658 370.735 334.077 371.522C334.501 372.304 334.713 373.194 334.713 374.191C334.713 375.199 334.501 376.094 334.077 376.876C333.652 377.658 333.026 378.275 332.198 378.725C331.369 379.17 330.349 379.392 329.137 379.392L325.233 379.392L325.233 377.053L328.754 377.053C329.459 377.053 330.037 376.93 330.487 376.684C330.937 376.439 331.269 376.101 331.484 375.672C331.704 375.242 331.814 374.749 331.814 374.191C331.814 373.634 331.704 373.143 331.484 372.719C331.269 372.294 330.934 371.964 330.479 371.729C330.029 371.489 329.449 371.369 328.738 371.369L326.13 371.369L326.13 384.7L323.284 384.7ZM336.111 368.991L339.325 368.991L343.168 375.94L343.322 375.94L347.165 368.991L350.378 368.991L344.664 378.84L344.664 384.7L341.826 384.7L341.826 378.84L336.111 368.991Z" fill="white"/>
<path d="M383.9 365.9H371.9C371.237 365.9 370.7 366.437 370.7 367.1L370.7 380.3H383.9C384.563 380.3 385.1 379.763 385.1 379.1L385.1 367.1C385.1 366.437 384.563 365.9 383.9 365.9Z" fill="white" stroke="#04DF00" stroke-width="1.8" stroke-linecap="round" stroke-linejoin="round"/>
<path d="M364.7 387.5L376.7 387.5C377.363 387.5 377.9 386.963 377.9 386.3L377.9 374.3C377.9 373.637 377.363 373.1 376.7 373.1L364.7 373.1C364.037 373.1 363.5 373.637 363.5 374.3L363.5 386.3C363.5 386.963 364.037 387.5 364.7 387.5Z" fill="white" stroke="#04DF00" stroke-width="1.8" stroke-linecap="round" stroke-linejoin="round"/>
<rect x="274.198" y="353.498" width="129.204" height="46.404" rx="7.002" stroke="black" stroke-width="3.204"/>
<rect x="137.398" y="353.498" width="129.204" height="46.404" rx="7.002" fill="#820FB9"/>
<path d="M161.694 373.309C161.622 372.639 161.32 372.118 160.789 371.745C160.262 371.371 159.577 371.185 158.733 371.185C158.14 371.185 157.631 371.274 157.207 371.453C156.782 371.632 156.457 371.875 156.232 372.182C156.007 372.489 155.892 372.839 155.887 373.233C155.887 373.56 155.961 373.844 156.11 374.084C156.263 374.324 156.47 374.529 156.731 374.698C156.992 374.861 157.281 374.999 157.598 375.112C157.915 375.224 158.234 375.319 158.557 375.396L160.029 375.764C160.622 375.902 161.193 376.089 161.74 376.324C162.292 376.559 162.786 376.856 163.22 377.214C163.66 377.572 164.008 378.004 164.263 378.51C164.519 379.016 164.647 379.609 164.647 380.289C164.647 381.21 164.412 382.02 163.941 382.721C163.471 383.416 162.791 383.961 161.901 384.355C161.016 384.743 159.945 384.938 158.687 384.938C157.465 384.938 156.404 384.749 155.504 384.37C154.609 383.992 153.908 383.439 153.402 382.713C152.901 381.987 152.63 381.103 152.589 380.059L155.389 380.059C155.43 380.606 155.598 381.062 155.895 381.425C156.192 381.788 156.578 382.059 157.053 382.238C157.534 382.417 158.071 382.506 158.664 382.506C159.283 382.506 159.825 382.414 160.29 382.23C160.761 382.041 161.129 381.78 161.395 381.448C161.661 381.11 161.796 380.716 161.801 380.266C161.796 379.857 161.676 379.52 161.441 379.254C161.205 378.983 160.876 378.758 160.451 378.579C160.032 378.395 159.541 378.231 158.978 378.088L157.191 377.628C155.897 377.295 154.875 376.792 154.123 376.117C153.376 375.437 153.003 374.534 153.003 373.409C153.003 372.483 153.254 371.673 153.755 370.978C154.261 370.282 154.949 369.743 155.818 369.359C156.688 368.97 157.672 368.776 158.771 368.776C159.886 368.776 160.863 368.97 161.701 369.359C162.545 369.743 163.207 370.277 163.688 370.962C164.169 371.642 164.417 372.425 164.432 373.309L161.694 373.309ZM180.093 368.991L180.093 384.7L177.562 384.7L170.16 374L170.03 374L170.03 384.7L167.184 384.7L167.184 368.991L169.73 368.991L177.125 379.699L177.263 379.699L177.263 368.991L180.093 368.991ZM186.04 368.991L186.04 384.7L183.194 384.7L183.194 368.991L186.04 368.991ZM189.121 384.7L189.121 368.991L195.012 368.991C196.219 368.991 197.232 369.216 198.05 369.666C198.873 370.116 199.494 370.735 199.914 371.522C200.338 372.304 200.55 373.194 200.55 374.191C200.55 375.199 200.338 376.094 199.914 376.876C199.489 377.658 198.863 378.275 198.034 378.725C197.206 379.17 196.186 379.392 194.974 379.392L191.07 379.392L191.07 377.053L194.59 377.053C195.296 377.053 195.874 376.93 196.324 376.684C196.774 376.439 197.106 376.101 197.321 375.672C197.541 375.242 197.651 374.749 197.651 374.191C197.651 373.634 197.541 373.143 197.321 372.719C197.106 372.294 196.771 371.964 196.316 371.729C195.866 371.489 195.286 371.369 194.575 371.369L191.967 371.369L191.967 384.7L189.121 384.7ZM203.022 384.7L203.022 368.991L213.239 368.991L213.239 371.376L205.868 371.376L205.868 375.641L212.71 375.641L212.71 378.027L205.868 378.027L205.868 382.314L213.301 382.314L213.301 384.7L203.022 384.7Z" fill="white"/>
<path fill-rule="evenodd" clip-rule="evenodd" d="M238 389.205C244.907 389.205 250.505 383.606 250.505 376.7C250.505 369.793 244.907 364.195 238 364.195C231.094 364.195 225.495 369.793 225.495 376.7C225.495 383.606 231.094 389.205 238 389.205ZM238 386.174C243.232 386.174 247.474 381.932 247.474 376.7C247.474 371.468 243.232 367.226 238 367.226C232.768 367.226 228.526 371.468 228.526 376.7C228.526 381.932 232.768 386.174 238 386.174Z" fill="white"/>
<rect x="237.053" y="362.3" width="1.89474" height="9.47368" fill="#04DF00"/>
<rect x="237.053" y="381.626" width="1.89474" height="9.47368" fill="#04DF00"/>
<rect x="252.4" y="375.753" width="1.89474" height="9.47368" transform="rotate(90 252.4 375.753)" fill="#04DF00"/>
<rect x="233.074" y="375.753" width="1.89474" height="9.47368" transform="rotate(90 233.074 375.753)" fill="#04DF00"/>
<rect x="137.398" y="353.498" width="129.204" height="46.404" rx="7.002" stroke="black" stroke-width="3.204"/>
</g>
<defs>
<filter id="filter0_d_277_53553" x="0.795898" y="0.738235" width="539.208" height="602.169" filterUnits="userSpaceOnUse" color-interpolation-filters="sRGB">
<feFlood flood-opacity="0" result="BackgroundImageFix"/>
<feColorMatrix in="SourceAlpha" type="matrix" values="0 0 0 0 0 0 0 0 0 0 0 0 0 0 0 0 0 0 127 0" result="hardAlpha"/>
<feOffset dy="4.73824"/>
<feGaussianBlur stdDeviation="67.5"/>
<feComposite in2="hardAlpha" operator="out"/>
<feColorMatrix type="matrix" values="0 0 0 0 0.704779 0 0 0 0 0.0875 0 0 0 0 1 0 0 0 0.7 0"/>
<feBlend mode="normal" in2="BackgroundImageFix" result="effect1_dropShadow_277_53553"/>
<feBlend mode="normal" in="SourceGraphic" in2="effect1_dropShadow_277_53553" result="shape"/>
</filter>
</defs>
</svg>
