<svg width="354" height="269" viewBox="0 0 354 269" fill="none" xmlns="http://www.w3.org/2000/svg">
<path d="M112.14 14.2C111.553 14.2 111.027 14.1733 110.56 14.12C110.107 14.0667 109.607 13.9667 109.06 13.82C108.447 13.66 107.94 13.4533 107.54 13.2C107.14 12.9333 106.807 12.5667 106.54 12.1C106.26 11.6333 106.12 11.08 106.12 10.44V4.74C106.12 2.12667 108.127 0.819999 112.14 0.819999C113.167 0.819999 114.54 0.966666 116.26 1.26V3.6C114.713 3.22667 113.353 3.04 112.18 3.04C111.687 3.04 111.3 3.05333 111.02 3.08C110.753 3.10667 110.473 3.17333 110.18 3.28C109.553 3.49333 109.24 3.96667 109.24 4.7V10.22C109.24 11.3933 110.313 11.98 112.46 11.98C113.38 11.98 114.673 11.7867 116.34 11.4V13.76C114.913 14.0533 113.513 14.2 112.14 14.2ZM124.194 14.2C123.474 14.2 122.807 14.1533 122.194 14.06C121.594 13.9667 120.967 13.8067 120.314 13.58C119.607 13.34 119.054 12.9533 118.654 12.42C118.254 11.8733 118.054 11.2133 118.054 10.44V4.76C118.054 4.12 118.194 3.54667 118.474 3.04C118.767 2.53333 119.14 2.13333 119.594 1.84C119.994 1.58667 120.487 1.37333 121.074 1.2C121.66 1.02667 122.207 0.919999 122.714 0.88C123.18 0.839999 123.674 0.819999 124.194 0.819999C124.807 0.819999 125.34 0.846666 125.794 0.899999C126.247 0.94 126.754 1.03333 127.314 1.18C127.954 1.36667 128.48 1.59333 128.894 1.86C129.307 2.12667 129.654 2.5 129.934 2.98C130.227 3.47333 130.374 4.06667 130.374 4.76V10.44C130.374 11.16 130.18 11.78 129.794 12.3C129.42 12.82 128.9 13.2133 128.234 13.48C127.034 13.96 125.687 14.2 124.194 14.2ZM124.234 11.98C124.674 11.98 125.04 11.9667 125.334 11.94C125.64 11.9 125.954 11.8333 126.274 11.74C126.594 11.6467 126.834 11.4933 126.994 11.28C127.167 11.0533 127.254 10.7733 127.254 10.44V4.74C127.254 4.12667 127.007 3.69333 126.514 3.44C126.02 3.17333 125.254 3.04 124.214 3.04C123.174 3.04 122.407 3.16667 121.914 3.42C121.42 3.67333 121.174 4.11333 121.174 4.74V10.44C121.174 10.7733 121.26 11.0533 121.434 11.28C121.607 11.4933 121.86 11.6467 122.194 11.74C122.514 11.8333 122.82 11.9 123.114 11.94C123.42 11.9667 123.794 11.98 124.234 11.98ZM132.884 1.02H138.084C139.351 1.02 140.351 1.10667 141.084 1.28C141.831 1.45333 142.371 1.76 142.704 2.2C143.051 2.62667 143.224 3.22667 143.224 4V6.46C143.224 7.31333 143.038 7.98 142.664 8.46C142.304 8.94 141.724 9.28 140.924 9.48C140.138 9.68 139.071 9.78 137.724 9.78H136.004V14H132.884V1.02ZM137.984 7.64C138.798 7.64 139.371 7.54667 139.704 7.36C140.038 7.16 140.204 6.82667 140.204 6.36V4.28C140.204 3.85333 140.044 3.57333 139.724 3.44C139.418 3.30667 138.824 3.24 137.944 3.24H136.004V7.64H137.984ZM148.883 8.8L144.183 1.02H147.723L150.463 6.1L153.183 1.02H156.743L152.003 8.76V14H148.883V8.8ZM167.104 14.2C165.864 14.2 164.331 14.08 162.504 13.84V11.46C164.771 11.8067 166.317 11.98 167.144 11.98C168.877 11.98 169.744 11.5333 169.744 10.64V9.8C169.744 9.37333 169.617 9.04667 169.364 8.82C169.124 8.59333 168.684 8.48 168.044 8.48H166.524C163.671 8.48 162.244 7.34667 162.244 5.08V4.12C162.244 2.98667 162.717 2.15333 163.664 1.62C164.611 1.08667 166.111 0.819999 168.164 0.819999C169.231 0.819999 170.584 0.906666 172.224 1.08V3.4C170.211 3.16 168.824 3.04 168.064 3.04C167.011 3.04 166.304 3.12667 165.944 3.3C165.557 3.48667 165.364 3.78 165.364 4.18V5.1C165.364 5.78 165.937 6.12 167.084 6.12H168.644C170.124 6.12 171.197 6.39333 171.864 6.94C172.531 7.48667 172.864 8.32 172.864 9.44V10.3C172.864 11.8467 172.311 12.8933 171.204 13.44C170.671 13.72 170.077 13.9133 169.424 14.02C168.784 14.14 168.011 14.2 167.104 14.2ZM180.613 14.2C176.866 14.2 174.993 12.9467 174.993 10.44V1.02H178.113V10.44C178.113 11.0267 178.299 11.4333 178.673 11.66C179.059 11.8733 179.719 11.98 180.653 11.98C181.573 11.98 182.213 11.8733 182.573 11.66C182.946 11.4333 183.133 11.0267 183.133 10.44V1.02H186.253V10.44C186.253 12.9467 184.373 14.2 180.613 14.2ZM194.757 14.2C194.171 14.2 193.644 14.1733 193.177 14.12C192.724 14.0667 192.224 13.9667 191.677 13.82C191.064 13.66 190.557 13.4533 190.157 13.2C189.757 12.9333 189.424 12.5667 189.157 12.1C188.877 11.6333 188.737 11.08 188.737 10.44V4.74C188.737 2.12667 190.744 0.819999 194.757 0.819999C195.784 0.819999 197.157 0.966666 198.877 1.26V3.6C197.331 3.22667 195.971 3.04 194.797 3.04C194.304 3.04 193.917 3.05333 193.637 3.08C193.371 3.10667 193.091 3.17333 192.797 3.28C192.171 3.49333 191.857 3.96667 191.857 4.7V10.22C191.857 11.3933 192.931 11.98 195.077 11.98C195.997 11.98 197.291 11.7867 198.957 11.4V13.76C197.531 14.0533 196.131 14.2 194.757 14.2ZM206.691 14.2C206.104 14.2 205.577 14.1733 205.111 14.12C204.657 14.0667 204.157 13.9667 203.611 13.82C202.997 13.66 202.491 13.4533 202.091 13.2C201.691 12.9333 201.357 12.5667 201.091 12.1C200.811 11.6333 200.671 11.08 200.671 10.44V4.74C200.671 2.12667 202.677 0.819999 206.691 0.819999C207.717 0.819999 209.091 0.966666 210.811 1.26V3.6C209.264 3.22667 207.904 3.04 206.731 3.04C206.237 3.04 205.851 3.05333 205.571 3.08C205.304 3.10667 205.024 3.17333 204.731 3.28C204.104 3.49333 203.791 3.96667 203.791 4.7V10.22C203.791 11.3933 204.864 11.98 207.011 11.98C207.931 11.98 209.224 11.7867 210.891 11.4V13.76C209.464 14.0533 208.064 14.2 206.691 14.2ZM212.884 1.02H222.784V3.24H216.004V6.22H222.124V8.44H216.004V11.78H222.984V14H212.884V1.02ZM229.291 14.2C228.051 14.2 226.518 14.08 224.691 13.84V11.46C226.958 11.8067 228.505 11.98 229.331 11.98C231.065 11.98 231.931 11.5333 231.931 10.64V9.8C231.931 9.37333 231.805 9.04667 231.551 8.82C231.311 8.59333 230.871 8.48 230.231 8.48H228.711C225.858 8.48 224.431 7.34667 224.431 5.08V4.12C224.431 2.98667 224.905 2.15333 225.851 1.62C226.798 1.08667 228.298 0.819999 230.351 0.819999C231.418 0.819999 232.771 0.906666 234.411 1.08V3.4C232.398 3.16 231.011 3.04 230.251 3.04C229.198 3.04 228.491 3.12667 228.131 3.3C227.745 3.48667 227.551 3.78 227.551 4.18V5.1C227.551 5.78 228.125 6.12 229.271 6.12H230.831C232.311 6.12 233.385 6.39333 234.051 6.94C234.718 7.48667 235.051 8.32 235.051 9.44V10.3C235.051 11.8467 234.498 12.8933 233.391 13.44C232.858 13.72 232.265 13.9133 231.611 14.02C230.971 14.14 230.198 14.2 229.291 14.2ZM241.42 14.2C240.18 14.2 238.647 14.08 236.82 13.84V11.46C239.087 11.8067 240.634 11.98 241.46 11.98C243.194 11.98 244.06 11.5333 244.06 10.64V9.8C244.06 9.37333 243.934 9.04667 243.68 8.82C243.44 8.59333 243 8.48 242.36 8.48H240.84C237.987 8.48 236.56 7.34667 236.56 5.08V4.12C236.56 2.98667 237.034 2.15333 237.98 1.62C238.927 1.08667 240.427 0.819999 242.48 0.819999C243.547 0.819999 244.9 0.906666 246.54 1.08V3.4C244.527 3.16 243.14 3.04 242.38 3.04C241.327 3.04 240.62 3.12667 240.26 3.3C239.874 3.48667 239.68 3.78 239.68 4.18V5.1C239.68 5.78 240.254 6.12 241.4 6.12H242.96C244.44 6.12 245.514 6.39333 246.18 6.94C246.847 7.48667 247.18 8.32 247.18 9.44V10.3C247.18 11.8467 246.627 12.8933 245.52 13.44C244.987 13.72 244.394 13.9133 243.74 14.02C243.1 14.14 242.327 14.2 241.42 14.2Z" fill="#FF7C23"/>
<path d="M129.4 21.02H132.52V34H129.4V21.02ZM135.318 21.02H138.478L144.758 29.88V21.02H147.538V34H144.378L138.098 25V34H135.318V21.02ZM158.787 24.08L155.247 26.04V23.58L159.347 21.02H161.707V34H158.787V24.08ZM176.898 34.2C176.311 34.2 175.784 34.1733 175.318 34.12C174.864 34.0667 174.364 33.9667 173.818 33.82C173.204 33.66 172.698 33.4533 172.298 33.2C171.898 32.9333 171.564 32.5667 171.298 32.1C171.018 31.6333 170.878 31.08 170.878 30.44V24.74C170.878 22.1267 172.884 20.82 176.898 20.82C177.924 20.82 179.298 20.9667 181.018 21.26V23.6C179.471 23.2267 178.111 23.04 176.938 23.04C176.444 23.04 176.058 23.0533 175.778 23.08C175.511 23.1067 175.231 23.1733 174.938 23.28C174.311 23.4933 173.998 23.9667 173.998 24.7V30.22C173.998 31.3933 175.071 31.98 177.218 31.98C178.138 31.98 179.431 31.7867 181.098 31.4V33.76C179.671 34.0533 178.271 34.2 176.898 34.2ZM183.091 21.02H186.211V31.78H192.591V34H183.091V21.02ZM194.693 21.02H197.813V34H194.693V21.02ZM206.351 34.2C205.764 34.2 205.238 34.1733 204.771 34.12C204.318 34.0667 203.818 33.9667 203.271 33.82C202.658 33.66 202.151 33.4533 201.751 33.2C201.351 32.9333 201.018 32.5667 200.751 32.1C200.471 31.6333 200.331 31.08 200.331 30.44V24.74C200.331 22.1267 202.338 20.82 206.351 20.82C207.378 20.82 208.751 20.9667 210.471 21.26V23.6C208.924 23.2267 207.564 23.04 206.391 23.04C205.898 23.04 205.511 23.0533 205.231 23.08C204.964 23.1067 204.684 23.1733 204.391 23.28C203.764 23.4933 203.451 23.9667 203.451 24.7V30.22C203.451 31.3933 204.524 31.98 206.671 31.98C207.591 31.98 208.884 31.7867 210.551 31.4V33.76C209.124 34.0533 207.724 34.2 206.351 34.2ZM212.545 21.02H215.665V34H212.545V21.02ZM215.745 27.12L220.605 21.02H224.265L219.345 27.06L224.805 34H221.005L215.745 27.12Z" fill="white"/>
<path d="M257 1V33H259V1H257ZM96 33V1H94V33H96Z" fill="white" mask="url(#path-1-inside-1_802_7929)"/>
<path d="M66.7326 65.6963L63.7736 60.7982H66.0023L67.7273 63.9964L69.4398 60.7982H71.6811L68.6969 65.6711V68.9701H66.7326V65.6963ZM76.347 69.096C75.8937 69.096 75.4739 69.0666 75.0878 69.0079C74.7101 68.9491 74.3155 68.8484 73.9042 68.7057C73.4593 68.5546 73.1109 68.3111 72.8591 67.9754C72.6073 67.6312 72.4813 67.2157 72.4813 66.7288V63.1528C72.4813 62.7499 72.5695 62.3889 72.7458 62.0699C72.9304 61.7509 73.1655 61.4991 73.4509 61.3144C73.7027 61.1549 74.0133 61.0206 74.3827 60.9115C74.752 60.8024 75.0962 60.7352 75.4152 60.71C75.709 60.6848 76.0196 60.6722 76.347 60.6722C76.7331 60.6722 77.0689 60.689 77.3543 60.7226C77.6397 60.7478 77.9587 60.8066 78.3112 60.8989C78.7142 61.0164 79.0457 61.1591 79.306 61.327C79.5662 61.4949 79.7845 61.7299 79.9607 62.0321C80.1454 62.3427 80.2377 62.7163 80.2377 63.1528V66.7288C80.2377 67.1821 80.116 67.5724 79.8726 67.8998C79.6376 68.2272 79.3102 68.4748 78.8905 68.6427C78.135 68.9449 77.2871 69.096 76.347 69.096ZM76.3721 67.6983C76.6492 67.6983 76.88 67.6899 77.0647 67.6732C77.2577 67.648 77.455 67.606 77.6565 67.5472C77.8579 67.4885 78.009 67.3919 78.1098 67.2576C78.2189 67.1149 78.2735 66.9387 78.2735 66.7288V63.1402C78.2735 62.7541 78.1182 62.4812 77.8076 62.3217C77.497 62.1539 77.0143 62.0699 76.3595 62.0699C75.7048 62.0699 75.2221 62.1497 74.9115 62.3092C74.6009 62.4686 74.4456 62.7457 74.4456 63.1402V66.7288C74.4456 66.9387 74.5002 67.1149 74.6093 67.2576C74.7184 67.3919 74.8779 67.4885 75.0878 67.5472C75.2893 67.606 75.4823 67.648 75.667 67.6732C75.8601 67.6899 76.0951 67.6983 76.3721 67.6983ZM85.3315 69.096C82.9727 69.096 81.7933 68.3069 81.7933 66.7288V60.7982H83.7576V66.7288C83.7576 67.0981 83.8751 67.3542 84.1101 67.4969C84.3536 67.6312 84.7691 67.6983 85.3567 67.6983C85.9359 67.6983 86.3389 67.6312 86.5655 67.4969C86.8005 67.3542 86.9181 67.0981 86.9181 66.7288V60.7982H88.8824V66.7288C88.8824 68.3069 87.6987 69.096 85.3315 69.096Z" fill="#F1306D"/>
<path d="M136.538 210.486H17.8071C8.5386 210.486 1.78261 204.637 1.78261 198.267V93.2547C1.78261 86.8855 8.5386 81.0357 17.8071 81.0357H136.538C145.807 81.0357 152.563 86.8855 152.563 93.2547V198.267C152.563 204.637 145.807 210.486 136.538 210.486Z" fill="#8E9ADE" stroke="black" stroke-width="3.56523"/>
<path d="M9.98687 93.2098H14.2196C15.4759 93.2098 16.3843 93.3644 16.9448 93.6737C17.5053 93.9732 17.7856 94.4806 17.7856 95.1957V96.8482C17.7856 97.3991 17.5875 97.8339 17.1913 98.1529C16.8047 98.4621 16.2877 98.6602 15.6402 98.7472L18.3654 102.618H15.7562L13.2919 98.9211H12.2482V102.618H9.98687V93.2098ZM14.1906 97.4281C14.7222 97.4281 15.0846 97.3604 15.2778 97.2251C15.4711 97.0802 15.5677 96.8047 15.5677 96.3989V95.7321C15.5677 95.3842 15.4614 95.1474 15.2488 95.0218C15.0459 94.8865 14.6932 94.8188 14.1906 94.8188H12.2482V97.4281H14.1906ZM23.9169 102.763C23.395 102.763 22.9118 102.729 22.4673 102.661C22.0324 102.593 21.5782 102.477 21.1047 102.313C20.5925 102.139 20.1914 101.859 19.9015 101.472C19.6116 101.076 19.4667 100.598 19.4667 100.037V95.9205C19.4667 95.4566 19.5681 95.0411 19.7711 94.6739C19.9837 94.3066 20.2543 94.0167 20.5828 93.8041C20.8727 93.6205 21.2303 93.4659 21.6555 93.3403C22.0807 93.2146 22.4769 93.1373 22.8442 93.1083C23.1824 93.0793 23.54 93.0648 23.9169 93.0648C24.3614 93.0648 24.748 93.0842 25.0765 93.1228C25.4051 93.1518 25.7723 93.2195 26.1782 93.3258C26.6421 93.4611 27.0238 93.6253 27.3234 93.8186C27.6229 94.0119 27.8742 94.2825 28.0771 94.6304C28.2898 94.9879 28.3961 95.418 28.3961 95.9205V100.037C28.3961 100.559 28.2559 101.009 27.9757 101.385C27.7051 101.762 27.3282 102.047 26.845 102.241C25.9753 102.589 24.9992 102.763 23.9169 102.763ZM23.9459 101.153C24.2648 101.153 24.5305 101.144 24.7431 101.124C24.9654 101.095 25.1925 101.047 25.4244 100.98C25.6564 100.912 25.8303 100.801 25.9463 100.646C26.0719 100.482 26.1347 100.279 26.1347 100.037V95.906C26.1347 95.4615 25.9559 95.1474 25.5984 94.9638C25.2408 94.7705 24.6851 94.6739 23.9314 94.6739C23.1776 94.6739 22.6219 94.7657 22.2643 94.9493C21.9068 95.1329 21.728 95.4518 21.728 95.906V100.037C21.728 100.279 21.7908 100.482 21.9164 100.646C22.0421 100.801 22.2257 100.912 22.4673 100.98C22.6992 101.047 22.9215 101.095 23.1341 101.124C23.3564 101.144 23.6269 101.153 23.9459 101.153ZM30.2158 93.2098H37.3913V94.8188H32.4772V96.9787H36.9129V98.5877H32.4772V101.009H37.5362V102.618H30.2158V93.2098Z" fill="black"/>
<rect x="10.3091" y="110.358" width="129.307" height="10.0308" rx="5.01538" fill="#F1306D" stroke="black" stroke-width="2.67392"/>
<rect x="10.3106" y="110.326" width="42.6082" height="10.0962" rx="5.04808" fill="#04DF00"/>
<rect x="10.3106" y="110.326" width="42.6082" height="10.0962" rx="5.04808" stroke="black" stroke-width="2.67392"/>
<path d="M13.031 141.773C12.1322 141.773 11.0209 141.686 9.69696 141.512V139.787C11.3398 140.039 12.4608 140.164 13.06 140.164C14.3163 140.164 14.9444 139.84 14.9444 139.193V138.584C14.9444 138.275 14.8526 138.038 14.669 137.874C14.4951 137.71 14.1762 137.627 13.7123 137.627H12.6106C10.5425 137.627 9.50851 136.806 9.50851 135.163V134.467C9.50851 133.646 9.85158 133.042 10.5377 132.655C11.2238 132.269 12.311 132.076 13.7993 132.076C14.5724 132.076 15.5533 132.138 16.7419 132.264V133.946C15.2827 133.772 14.2776 133.685 13.7268 133.685C12.9633 133.685 12.4512 133.747 12.1902 133.873C11.91 134.008 11.7699 134.221 11.7699 134.511V135.178C11.7699 135.671 12.1854 135.917 13.0165 135.917H14.1472C15.2198 135.917 15.9978 136.115 16.481 136.511C16.9642 136.908 17.2058 137.511 17.2058 138.323V138.947C17.2058 140.068 16.8047 140.826 16.0026 141.222C15.6161 141.425 15.186 141.565 14.7125 141.643C14.2486 141.73 13.6881 141.773 13.031 141.773ZM18.7778 132.221H22.5467C23.4647 132.221 24.1895 132.283 24.721 132.409C25.2622 132.535 25.6536 132.757 25.8952 133.076C26.1465 133.385 26.2721 133.82 26.2721 134.38V136.163C26.2721 136.782 26.1368 137.265 25.8662 137.613C25.6053 137.961 25.1849 138.207 24.6051 138.352C24.0349 138.497 23.2618 138.57 22.2857 138.57H21.0391V141.628H18.7778V132.221ZM22.4742 137.019C23.0637 137.019 23.4792 136.951 23.7208 136.816C23.9624 136.671 24.0832 136.429 24.0832 136.091V134.583C24.0832 134.274 23.9673 134.071 23.7353 133.975C23.5131 133.878 23.083 133.83 22.4452 133.83H21.0391V137.019H22.4742ZM27.8659 132.221H35.0413V133.83H30.1273V135.989H34.563V137.598H30.1273V140.019H35.1863V141.628H27.8659V132.221ZM36.7135 132.221H43.8889V133.83H38.9748V135.989H43.4105V137.598H38.9748V140.019H44.0338V141.628H36.7135V132.221ZM45.561 132.221H49.5618C50.6635 132.221 51.5332 132.308 52.1711 132.481C52.8089 132.646 53.2776 132.936 53.5771 133.351C53.8767 133.767 54.0265 134.342 54.0265 135.076V138.903C54.0265 139.618 53.8864 140.174 53.6061 140.57C53.3259 140.957 52.8669 141.232 52.229 141.396C51.5912 141.551 50.707 141.628 49.5763 141.628H45.561V132.221ZM49.4748 140.019C50.0933 140.019 50.5572 139.995 50.8664 139.947C51.1853 139.889 51.4124 139.783 51.5477 139.628C51.6927 139.473 51.7652 139.232 51.7652 138.903V135.033C51.7652 134.588 51.5864 134.279 51.2288 134.105C50.8809 133.921 50.3204 133.83 49.5473 133.83H47.8223V140.019H49.4748Z" fill="black"/>
<rect x="10.3091" y="149.369" width="129.307" height="10.0308" rx="5.01538" fill="#F1306D" stroke="black" stroke-width="2.67392"/>
<rect x="10.3106" y="149.399" width="66.4917" height="10.0271" rx="5.01357" fill="#04DF00"/>
<rect x="10.3106" y="149.399" width="66.4917" height="10.0271" rx="5.01357" stroke="black" stroke-width="2.67392"/>
<path d="M12.4801 171.231H15.2343L18.6264 180.639H16.336L15.4953 178.16H12.0598L11.2335 180.639H9.00116L12.4801 171.231ZM15.0024 176.653L13.8138 173.116H13.7558L12.5671 176.653H15.0024ZM23.8299 180.784C23.4047 180.784 23.023 180.765 22.6847 180.726C22.3561 180.687 21.9938 180.615 21.5975 180.508C21.153 180.392 20.7858 180.243 20.4959 180.059C20.2059 179.866 19.9643 179.6 19.7711 179.262C19.5681 178.924 19.4667 178.523 19.4667 178.059V173.927C19.4667 172.033 20.9211 171.086 23.8299 171.086C24.574 171.086 25.5694 171.193 26.816 171.405V173.101C25.695 172.831 24.7093 172.695 23.8589 172.695C23.5013 172.695 23.2211 172.705 23.0181 172.724C22.8248 172.744 22.6219 172.792 22.4093 172.869C21.9551 173.024 21.728 173.367 21.728 173.898V177.899C21.728 178.75 22.5059 179.175 24.0618 179.175C24.7286 179.175 25.666 179.035 26.874 178.754V180.465C25.84 180.678 24.8253 180.784 23.8299 180.784ZM32.4792 180.784C32.054 180.784 31.6723 180.765 31.3341 180.726C31.0055 180.687 30.6431 180.615 30.2469 180.508C29.8023 180.392 29.4351 180.243 29.1452 180.059C28.8553 179.866 28.6137 179.6 28.4204 179.262C28.2175 178.924 28.116 178.523 28.116 178.059V173.927C28.116 172.033 29.5704 171.086 32.4792 171.086C33.2233 171.086 34.2187 171.193 35.4654 171.405V173.101C34.3443 172.831 33.3586 172.695 32.5082 172.695C32.1507 172.695 31.8704 172.705 31.6675 172.724C31.4742 172.744 31.2712 172.792 31.0586 172.869C30.6044 173.024 30.3773 173.367 30.3773 173.898V177.899C30.3773 178.75 31.1553 179.175 32.7112 179.175C33.378 179.175 34.3154 179.035 35.5233 178.754V180.465C34.4893 180.678 33.4746 180.784 32.4792 180.784ZM41.0126 180.784C38.297 180.784 36.9393 179.875 36.9393 178.059V171.231H39.2006V178.059C39.2006 178.484 39.3359 178.779 39.6065 178.943C39.8868 179.098 40.3651 179.175 41.0416 179.175C41.7084 179.175 42.1723 179.098 42.4332 178.943C42.7038 178.779 42.8391 178.484 42.8391 178.059V171.231H45.1004V178.059C45.1004 179.875 43.7378 180.784 41.0126 180.784ZM47.104 171.231H51.3368C52.5931 171.231 53.5015 171.386 54.062 171.695C54.6225 171.995 54.9027 172.502 54.9027 173.217V174.87C54.9027 175.42 54.7046 175.855 54.3084 176.174C53.9218 176.483 53.4048 176.682 52.7573 176.769L55.4825 180.639H52.8733L50.409 176.942H49.3653V180.639H47.104V171.231ZM51.3078 175.449C51.8393 175.449 52.2017 175.382 52.3949 175.246C52.5882 175.102 52.6849 174.826 52.6849 174.42V173.753C52.6849 173.406 52.5786 173.169 52.366 173.043C52.163 172.908 51.8103 172.84 51.3078 172.84H49.3653V175.449H51.3078ZM59.28 171.231H62.0342L65.4262 180.639H63.1359L62.2951 178.16H58.8596L58.0333 180.639H55.801L59.28 171.231ZM61.8023 176.653L60.6136 173.116H60.5556L59.367 176.653H61.8023ZM70.6297 180.784C70.2045 180.784 69.8228 180.765 69.4846 180.726C69.156 180.687 68.7936 180.615 68.3974 180.508C67.9528 180.392 67.5856 180.243 67.2957 180.059C67.0058 179.866 66.7642 179.6 66.5709 179.262C66.368 178.924 66.2665 178.523 66.2665 178.059V173.927C66.2665 172.033 67.7209 171.086 70.6297 171.086C71.3738 171.086 72.3692 171.193 73.6159 171.405V173.101C72.4949 172.831 71.5091 172.695 70.6587 172.695C70.3012 172.695 70.0209 172.705 69.818 172.724C69.6247 172.744 69.4217 172.792 69.2091 172.869C68.7549 173.024 68.5278 173.367 68.5278 173.898V177.899C68.5278 178.75 69.3058 179.175 70.8617 179.175C71.5285 179.175 72.4659 179.035 73.6738 178.754V180.465C72.6398 180.678 71.6251 180.784 70.6297 180.784ZM77.6265 176.87L74.22 171.231H76.7858L78.7717 174.913L80.7431 171.231H83.3234L79.8879 176.841V180.639H77.6265V176.87Z" fill="black"/>
<rect x="10.3091" y="188.379" width="129.307" height="10.0308" rx="5.01538" fill="#F1306D" stroke="black" stroke-width="2.67392"/>
<rect x="10.3106" y="188.403" width="34.67" height="10.0271" rx="5.01357" fill="#04DF00"/>
<rect x="10.3106" y="188.403" width="34.67" height="10.0271" rx="5.01357" stroke="black" stroke-width="2.67392"/>
<path d="M253.165 47.9752H250.647V46.5776H257.635V47.9752H255.129V54.7495H253.165V47.9752ZM258.765 46.5776H262.441C263.533 46.5776 264.322 46.7119 264.809 46.9805C265.296 47.2407 265.539 47.6814 265.539 48.3026V49.7381C265.539 50.2165 265.367 50.5943 265.023 50.8713C264.687 51.1399 264.238 51.312 263.675 51.3876L266.043 54.7495H263.776L261.636 51.5387H260.729V54.7495H258.765V46.5776ZM262.416 50.2417C262.878 50.2417 263.193 50.183 263.361 50.0654C263.528 49.9395 263.612 49.7003 263.612 49.3477V48.7685C263.612 48.4663 263.52 48.2607 263.335 48.1515C263.159 48.034 262.853 47.9752 262.416 47.9752H260.729V50.2417H262.416ZM269.341 46.5776H271.734L274.68 54.7495H272.691L271.96 52.5964H268.976L268.258 54.7495H266.319L269.341 46.5776ZM271.532 51.2868L270.5 48.2145H270.449L269.417 51.2868H271.532ZM275.586 46.5776H279.062C280.018 46.5776 280.774 46.6531 281.328 46.8042C281.882 46.9469 282.289 47.1988 282.549 47.5597C282.81 47.9207 282.94 48.4201 282.94 49.0581V52.3823C282.94 53.0035 282.818 53.4862 282.575 53.8303C282.331 54.1661 281.932 54.4053 281.378 54.548C280.824 54.6824 280.056 54.7495 279.074 54.7495H275.586V46.5776ZM278.986 53.3518C279.523 53.3518 279.926 53.3309 280.195 53.2889C280.472 53.2385 280.669 53.1462 280.787 53.0119C280.912 52.8776 280.975 52.6677 280.975 52.3823V49.0203C280.975 48.6342 280.82 48.3656 280.51 48.2145C280.207 48.055 279.72 47.9752 279.049 47.9752H277.551V53.3518H278.986ZM284.526 46.5776H290.759V47.9752H286.49V49.8514H290.343V51.2491H286.49V53.3518H290.885V54.7495H284.526V46.5776ZM292.211 46.5776H295.888C296.979 46.5776 297.768 46.7119 298.255 46.9805C298.742 47.2407 298.985 47.6814 298.985 48.3026V49.7381C298.985 50.2165 298.813 50.5943 298.469 50.8713C298.133 51.1399 297.684 51.312 297.122 51.3876L299.489 54.7495H297.222L295.082 51.5387H294.175V54.7495H292.211V46.5776ZM295.863 50.2417C296.324 50.2417 296.639 50.183 296.807 50.0654C296.975 49.9395 297.059 49.7003 297.059 49.3477V48.7685C297.059 48.4663 296.966 48.2607 296.782 48.1515C296.606 48.034 296.299 47.9752 295.863 47.9752H294.175V50.2417H295.863ZM225.7 69.8754C224.919 69.8754 223.954 69.7999 222.804 69.6488V68.1504C224.231 68.3686 225.205 68.4778 225.725 68.4778C226.816 68.4778 227.362 68.1966 227.362 67.6341V67.1053C227.362 66.8367 227.282 66.631 227.123 66.4883C226.972 66.3456 226.695 66.2742 226.292 66.2742H225.335C223.538 66.2742 222.64 65.5607 222.64 64.1337V63.5293C222.64 62.8158 222.938 62.2911 223.534 61.9553C224.13 61.6196 225.075 61.4517 226.367 61.4517C227.039 61.4517 227.891 61.5062 228.923 61.6154V63.076C227.656 62.9249 226.783 62.8493 226.304 62.8493C225.641 62.8493 225.196 62.9039 224.97 63.013C224.726 63.1305 224.605 63.3152 224.605 63.5671V64.1463C224.605 64.5744 224.966 64.7884 225.687 64.7884H226.67C227.601 64.7884 228.277 64.9605 228.697 65.3047C229.117 65.6489 229.326 66.1735 229.326 66.8786V67.4201C229.326 68.3938 228.978 69.0528 228.281 69.3969C227.946 69.5732 227.572 69.6949 227.161 69.7621C226.758 69.8377 226.271 69.8754 225.7 69.8754ZM230.692 61.5776H232.656V64.8514H236.131V61.5776H238.096V69.7495H236.131V66.2491H232.656V69.7495H230.692V61.5776ZM239.853 61.5776H241.817V69.7495H239.853V61.5776ZM245.467 62.9752H242.949V61.5776H249.937V62.9752H247.432V69.7495H245.467V62.9752ZM254.681 69.8754C254.312 69.8754 253.98 69.8586 253.686 69.8251C253.401 69.7915 253.086 69.7285 252.742 69.6362C252.356 69.5355 252.037 69.4053 251.785 69.2458C251.533 69.078 251.323 68.8471 251.155 68.5533C250.979 68.2595 250.891 67.9111 250.891 67.5082V63.9196C250.891 62.2743 252.154 61.4517 254.681 61.4517C255.327 61.4517 256.192 61.544 257.275 61.7287V63.2019C256.301 62.9669 255.445 62.8493 254.706 62.8493C254.395 62.8493 254.152 62.8577 253.976 62.8745C253.808 62.8913 253.632 62.9333 253.447 63.0004C253.052 63.1347 252.855 63.4327 252.855 63.8944V67.3697C252.855 68.1084 253.531 68.4778 254.882 68.4778C255.462 68.4778 256.276 68.356 257.325 68.1126V69.5984C256.427 69.7831 255.546 69.8754 254.681 69.8754ZM262.27 69.8754C261.816 69.8754 261.397 69.846 261.01 69.7873C260.633 69.7285 260.238 69.6278 259.827 69.4851C259.382 69.334 259.034 69.0906 258.782 68.7548C258.53 68.4106 258.404 67.9951 258.404 67.5082V63.9322C258.404 63.5293 258.492 63.1683 258.668 62.8493C258.853 62.5303 259.088 62.2785 259.374 62.0938C259.625 61.9343 259.936 61.8 260.305 61.6909C260.675 61.5818 261.019 61.5146 261.338 61.4894C261.632 61.4643 261.942 61.4517 262.27 61.4517C262.656 61.4517 262.991 61.4685 263.277 61.502C263.562 61.5272 263.881 61.586 264.234 61.6783C264.637 61.7958 264.968 61.9385 265.229 62.1064C265.489 62.2743 265.707 62.5094 265.883 62.8116C266.068 63.1221 266.16 63.4957 266.16 63.9322V67.5082C266.16 67.9615 266.039 68.3518 265.795 68.6792C265.56 69.0066 265.233 69.2542 264.813 69.4221C264.058 69.7243 263.21 69.8754 262.27 69.8754ZM262.295 68.4778C262.572 68.4778 262.803 68.4694 262.987 68.4526C263.18 68.4274 263.378 68.3854 263.579 68.3267C263.781 68.2679 263.932 68.1714 264.032 68.0371C264.142 67.8944 264.196 67.7181 264.196 67.5082V63.9196C264.196 63.5335 264.041 63.2607 263.73 63.1012C263.42 62.9333 262.937 62.8493 262.282 62.8493C261.627 62.8493 261.145 62.9291 260.834 63.0886C260.524 63.2481 260.368 63.5251 260.368 63.9196V67.5082C260.368 67.7181 260.423 67.8944 260.532 68.0371C260.641 68.1714 260.801 68.2679 261.01 68.3267C261.212 68.3854 261.405 68.4274 261.59 68.4526C261.783 68.4694 262.018 68.4778 262.295 68.4778ZM267.741 61.5776H269.705V69.7495H267.741V61.5776ZM271.467 61.5776H273.456L277.41 67.1556V61.5776H279.16V69.7495H277.171L273.217 64.0833V69.7495H271.467V61.5776ZM280.923 61.5776H283.718L285.733 67.4201L287.722 61.5776H290.354V69.7495H288.579V63.7056H288.541L286.476 69.7495H284.902L282.774 63.7056H282.723V69.7495H280.923V61.5776ZM294.278 61.5776H296.671L299.617 69.7495H297.628L296.897 67.5964H293.913L293.196 69.7495H291.256L294.278 61.5776ZM296.469 66.2868L295.437 63.2145H295.386L294.354 66.2868H296.469ZM303.168 69.8754C302.387 69.8754 301.422 69.7999 300.272 69.6488V68.1504C301.699 68.3686 302.672 68.4778 303.193 68.4778C304.284 68.4778 304.83 68.1966 304.83 67.6341V67.1053C304.83 66.8367 304.75 66.631 304.591 66.4883C304.439 66.3456 304.162 66.2742 303.759 66.2742H302.803C301.006 66.2742 300.108 65.5607 300.108 64.1337V63.5293C300.108 62.8158 300.406 62.2911 301.002 61.9553C301.598 61.6196 302.542 61.4517 303.835 61.4517C304.507 61.4517 305.359 61.5062 306.391 61.6154V63.076C305.124 62.9249 304.251 62.8493 303.772 62.8493C303.109 62.8493 302.664 62.9039 302.437 63.013C302.194 63.1305 302.072 63.3152 302.072 63.5671V64.1463C302.072 64.5744 302.433 64.7884 303.155 64.7884H304.137C305.069 64.7884 305.745 64.9605 306.164 65.3047C306.584 65.6489 306.794 66.1735 306.794 66.8786V67.4201C306.794 68.3938 306.446 69.0528 305.749 69.3969C305.413 69.5732 305.04 69.6949 304.628 69.7621C304.225 69.8377 303.738 69.8754 303.168 69.8754ZM310.048 62.9752H307.53V61.5776H314.518V62.9752H312.013V69.7495H310.048V62.9752ZM315.648 61.5776H321.881V62.9752H317.612V64.8514H321.465V66.2491H317.612V68.3518H322.007V69.7495H315.648V61.5776ZM323.333 61.5776H327.01C328.101 61.5776 328.89 61.7119 329.377 61.9805C329.864 62.2407 330.108 62.6814 330.108 63.3026V64.7381C330.108 65.2165 329.936 65.5943 329.591 65.8713C329.256 66.1399 328.807 66.312 328.244 66.3876L330.611 69.7495H328.345L326.204 66.5387H325.298V69.7495H323.333V61.5776ZM326.985 65.2417C327.447 65.2417 327.761 65.183 327.929 65.0654C328.097 64.9395 328.181 64.7003 328.181 64.3477V63.7685C328.181 63.4663 328.089 63.2607 327.904 63.1515C327.728 63.034 327.421 62.9752 326.985 62.9752H325.298V65.2417H326.985Z" fill="#05FF00"/>
<path d="M335.884 210.229H217.153C207.884 210.229 201.128 204.379 201.128 198.01V92.9973C201.128 86.628 207.884 80.7782 217.153 80.7782H335.884C345.153 80.7782 351.909 86.628 351.909 92.9973V198.01C351.909 204.379 345.153 210.229 335.884 210.229Z" fill="#8E9ADE" stroke="black" stroke-width="3.56523"/>
<path d="M209.333 92.9525H213.565C214.822 92.9525 215.73 93.1071 216.291 93.4163C216.851 93.7159 217.131 94.2233 217.131 94.9384V96.5909C217.131 97.1417 216.933 97.5766 216.537 97.8955C216.15 98.2048 215.633 98.4029 214.986 98.4899L217.711 102.36H215.102L212.638 98.6638H211.594V102.36H209.333V92.9525ZM213.536 97.1707C214.068 97.1707 214.43 97.1031 214.624 96.9678C214.817 96.8228 214.913 96.5474 214.913 96.1415V95.4747C214.913 95.1268 214.807 94.8901 214.595 94.7644C214.392 94.6291 214.039 94.5615 213.536 94.5615H211.594V97.1707H213.536ZM223.263 102.505C222.741 102.505 222.258 102.471 221.813 102.404C221.378 102.336 220.924 102.22 220.45 102.056C219.938 101.882 219.537 101.602 219.247 101.215C218.957 100.819 218.812 100.34 218.812 99.78V95.6632C218.812 95.1993 218.914 94.7838 219.117 94.4165C219.329 94.0493 219.6 93.7594 219.929 93.5468C220.218 93.3632 220.576 93.2086 221.001 93.0829C221.426 92.9573 221.823 92.88 222.19 92.851C222.528 92.822 222.886 92.8075 223.263 92.8075C223.707 92.8075 224.094 92.8268 224.422 92.8655C224.751 92.8945 225.118 92.9621 225.524 93.0684C225.988 93.2037 226.369 93.368 226.669 93.5613C226.969 93.7546 227.22 94.0252 227.423 94.3731C227.635 94.7306 227.742 95.1607 227.742 95.6632V99.78C227.742 100.302 227.602 100.751 227.321 101.128C227.051 101.505 226.674 101.79 226.191 101.983C225.321 102.331 224.345 102.505 223.263 102.505ZM223.292 100.896C223.61 100.896 223.876 100.886 224.089 100.867C224.311 100.838 224.538 100.79 224.77 100.722C225.002 100.655 225.176 100.543 225.292 100.389C225.418 100.225 225.48 100.022 225.48 99.78V95.6487C225.48 95.2041 225.302 94.8901 224.944 94.7065C224.587 94.5132 224.031 94.4165 223.277 94.4165C222.523 94.4165 221.968 94.5084 221.61 94.692C221.252 94.8756 221.074 95.1945 221.074 95.6487V99.78C221.074 100.022 221.137 100.225 221.262 100.389C221.388 100.543 221.571 100.655 221.813 100.722C222.045 100.79 222.267 100.838 222.48 100.867C222.702 100.886 222.973 100.896 223.292 100.896ZM229.562 92.9525H236.737V94.5615H231.823V96.7214H236.259V98.3304H231.823V100.751H236.882V102.36H229.562V92.9525Z" fill="black"/>
<rect x="209.655" y="110.101" width="129.307" height="10.0308" rx="5.01539" fill="#F1306D" stroke="black" stroke-width="2.67392"/>
<rect x="209.656" y="110.069" width="103.49" height="10.0962" rx="5.04808" fill="#04DF00"/>
<rect x="209.656" y="110.069" width="103.49" height="10.0962" rx="5.04808" stroke="black" stroke-width="2.67392"/>
<path d="M212.377 141.516C211.478 141.516 210.367 141.429 209.043 141.255V139.53C210.686 139.781 211.807 139.907 212.406 139.907C213.662 139.907 214.29 139.583 214.29 138.936V138.327C214.29 138.018 214.198 137.781 214.015 137.617C213.841 137.452 213.522 137.37 213.058 137.37H211.956C209.888 137.37 208.854 136.549 208.854 134.906V134.21C208.854 133.389 209.197 132.785 209.883 132.398C210.57 132.012 211.657 131.818 213.145 131.818C213.918 131.818 214.899 131.881 216.088 132.007V133.688C214.628 133.514 213.623 133.427 213.072 133.427C212.309 133.427 211.797 133.49 211.536 133.616C211.256 133.751 211.116 133.964 211.116 134.254V134.92C211.116 135.413 211.531 135.66 212.362 135.66H213.493C214.566 135.66 215.343 135.858 215.827 136.254C216.31 136.65 216.551 137.254 216.551 138.066V138.689C216.551 139.81 216.15 140.569 215.348 140.965C214.962 141.168 214.532 141.308 214.058 141.385C213.594 141.472 213.034 141.516 212.377 141.516ZM218.123 131.963H221.892C222.81 131.963 223.535 132.026 224.067 132.152C224.608 132.277 224.999 132.5 225.241 132.818C225.492 133.128 225.618 133.563 225.618 134.123V135.906C225.618 136.525 225.482 137.008 225.212 137.356C224.951 137.704 224.531 137.95 223.951 138.095C223.381 138.24 222.607 138.312 221.631 138.312H220.385V141.371H218.123V131.963ZM221.82 136.761C222.409 136.761 222.825 136.694 223.067 136.558C223.308 136.413 223.429 136.172 223.429 135.834V134.326C223.429 134.017 223.313 133.814 223.081 133.717C222.859 133.621 222.429 133.572 221.791 133.572H220.385V136.761H221.82ZM227.212 131.963H234.387V133.572H229.473V135.732H233.909V137.341H229.473V139.762H234.532V141.371H227.212V131.963ZM236.059 131.963H243.235V133.572H238.321V135.732H242.756V137.341H238.321V139.762H243.38V141.371H236.059V131.963ZM244.907 131.963H248.908C250.009 131.963 250.879 132.05 251.517 132.224C252.155 132.388 252.623 132.678 252.923 133.094C253.222 133.509 253.372 134.084 253.372 134.819V138.646C253.372 139.361 253.232 139.917 252.952 140.313C252.672 140.699 252.213 140.975 251.575 141.139C250.937 141.294 250.053 141.371 248.922 141.371H244.907V131.963ZM248.821 139.762C249.439 139.762 249.903 139.738 250.212 139.689C250.531 139.631 250.758 139.525 250.893 139.371C251.038 139.216 251.111 138.974 251.111 138.646V134.775C251.111 134.331 250.932 134.022 250.575 133.848C250.227 133.664 249.666 133.572 248.893 133.572H247.168V139.762H248.821Z" fill="black"/>
<rect x="209.655" y="149.111" width="129.307" height="10.0308" rx="5.01539" fill="#F1306D" stroke="black" stroke-width="2.67392"/>
<rect x="209.656" y="149.142" width="113.983" height="10.0271" rx="5.01357" fill="#04DF00"/>
<rect x="209.656" y="149.142" width="113.983" height="10.0271" rx="5.01357" stroke="black" stroke-width="2.67392"/>
<path d="M211.826 170.974H214.58L217.972 180.382H215.682L214.841 177.903H211.405L210.579 180.382H208.347L211.826 170.974ZM214.348 176.395L213.159 172.858H213.101L211.913 176.395H214.348ZM223.176 180.527C222.75 180.527 222.369 180.507 222.03 180.469C221.702 180.43 221.339 180.358 220.943 180.251C220.499 180.135 220.131 179.985 219.842 179.802C219.552 179.609 219.31 179.343 219.117 179.005C218.914 178.666 218.812 178.265 218.812 177.801V173.67C218.812 171.776 220.267 170.829 223.176 170.829C223.92 170.829 224.915 170.935 226.162 171.148V172.844C225.041 172.573 224.055 172.438 223.205 172.438C222.847 172.438 222.567 172.448 222.364 172.467C222.171 172.486 221.968 172.535 221.755 172.612C221.301 172.767 221.074 173.11 221.074 173.641V177.642C221.074 178.492 221.852 178.918 223.408 178.918C224.074 178.918 225.012 178.778 226.22 178.497V180.208C225.186 180.42 224.171 180.527 223.176 180.527ZM231.825 180.527C231.4 180.527 231.018 180.507 230.68 180.469C230.351 180.43 229.989 180.358 229.593 180.251C229.148 180.135 228.781 179.985 228.491 179.802C228.201 179.609 227.959 179.343 227.766 179.005C227.563 178.666 227.462 178.265 227.462 177.801V173.67C227.462 171.776 228.916 170.829 231.825 170.829C232.569 170.829 233.564 170.935 234.811 171.148V172.844C233.69 172.573 232.704 172.438 231.854 172.438C231.496 172.438 231.216 172.448 231.013 172.467C230.82 172.486 230.617 172.535 230.404 172.612C229.95 172.767 229.723 173.11 229.723 173.641V177.642C229.723 178.492 230.501 178.918 232.057 178.918C232.724 178.918 233.661 178.778 234.869 178.497V180.208C233.835 180.42 232.82 180.527 231.825 180.527ZM240.358 180.527C237.643 180.527 236.285 179.618 236.285 177.801V170.974H238.546V177.801C238.546 178.227 238.682 178.521 238.952 178.686C239.232 178.84 239.711 178.918 240.387 178.918C241.054 178.918 241.518 178.84 241.779 178.686C242.049 178.521 242.185 178.227 242.185 177.801V170.974H244.446V177.801C244.446 179.618 243.083 180.527 240.358 180.527ZM246.45 170.974H250.682C251.939 170.974 252.847 171.129 253.408 171.438C253.968 171.737 254.248 172.245 254.248 172.96V174.612C254.248 175.163 254.05 175.598 253.654 175.917C253.268 176.226 252.751 176.424 252.103 176.511L254.828 180.382H252.219L249.755 176.685H248.711V180.382H246.45V170.974ZM250.653 175.192C251.185 175.192 251.547 175.125 251.741 174.989C251.934 174.844 252.031 174.569 252.031 174.163V173.496C252.031 173.148 251.924 172.912 251.712 172.786C251.509 172.651 251.156 172.583 250.653 172.583H248.711V175.192H250.653ZM258.626 170.974H261.38L264.772 180.382H262.482L261.641 177.903H258.205L257.379 180.382H255.147L258.626 170.974ZM261.148 176.395L259.959 172.858H259.901L258.713 176.395H261.148ZM269.975 180.527C269.55 180.527 269.168 180.507 268.83 180.469C268.502 180.43 268.139 180.358 267.743 180.251C267.299 180.135 266.931 179.985 266.641 179.802C266.351 179.609 266.11 179.343 265.917 179.005C265.714 178.666 265.612 178.265 265.612 177.801V173.67C265.612 171.776 267.067 170.829 269.975 170.829C270.72 170.829 271.715 170.935 272.962 171.148V172.844C271.841 172.573 270.855 172.438 270.004 172.438C269.647 172.438 269.367 172.448 269.164 172.467C268.97 172.486 268.767 172.535 268.555 172.612C268.101 172.767 267.874 173.11 267.874 173.641V177.642C267.874 178.492 268.651 178.918 270.207 178.918C270.874 178.918 271.812 178.778 273.02 178.497V180.208C271.986 180.42 270.971 180.527 269.975 180.527ZM276.972 176.613L273.566 170.974H276.131L278.117 174.656L280.089 170.974H282.669L279.234 176.584V180.382H276.972V176.613Z" fill="black"/>
<rect x="209.655" y="188.122" width="129.307" height="10.0308" rx="5.01539" fill="#F1306D" stroke="black" stroke-width="2.67392"/>
<rect x="209.656" y="188.146" width="122.749" height="10.0271" rx="5.01357" fill="#04DF00"/>
<rect x="209.656" y="188.146" width="122.749" height="10.0271" rx="5.01357" stroke="black" stroke-width="2.67392"/>
<path d="M203.461 145.281C203.461 160.987 190.729 173.719 175.023 173.719C159.317 173.719 146.585 160.987 146.585 145.281C146.585 129.575 159.317 116.843 175.023 116.843C190.729 116.843 203.461 129.575 203.461 145.281Z" fill="#C73FFF" stroke="black" stroke-width="3.56341"/>
<path d="M161.802 139.286H165.074L168.677 150.033H168.76L172.363 139.286H175.553L170.583 152.725H166.627L161.802 139.286ZM181.352 152.932C180.068 152.932 178.481 152.808 176.589 152.56V150.095C178.936 150.454 180.538 150.634 181.394 150.634C183.188 150.634 184.086 150.171 184.086 149.246V148.376C184.086 147.935 183.954 147.596 183.692 147.362C183.444 147.127 182.988 147.01 182.325 147.01H180.752C177.797 147.01 176.32 145.836 176.32 143.489V142.495C176.32 141.322 176.81 140.459 177.79 139.907C178.771 139.355 180.324 139.078 182.45 139.078C183.554 139.078 184.955 139.168 186.653 139.348V141.75C184.569 141.501 183.133 141.377 182.346 141.377C181.255 141.377 180.524 141.467 180.151 141.646C179.751 141.84 179.551 142.143 179.551 142.557V143.51C179.551 144.214 180.144 144.566 181.331 144.566H182.947C184.479 144.566 185.59 144.849 186.281 145.415C186.971 145.981 187.316 146.844 187.316 148.004V148.894C187.316 150.496 186.743 151.579 185.597 152.145C185.045 152.435 184.431 152.635 183.754 152.746C183.092 152.87 182.291 152.932 181.352 152.932Z" fill="black"/>
<rect x="84.22" y="219.22" width="183.56" height="43.56" rx="7.78" fill="#820FB9"/>
<path d="M139.051 238.591L136.182 238.591C136.101 238.121 135.95 237.704 135.73 237.341C135.51 236.973 135.236 236.661 134.909 236.405C134.582 236.149 134.209 235.958 133.789 235.83C133.375 235.697 132.928 235.63 132.447 235.63C131.593 235.63 130.836 235.845 130.176 236.275C129.517 236.699 129 237.323 128.627 238.146C128.254 238.964 128.067 239.964 128.067 241.145C128.067 242.347 128.254 243.36 128.627 244.183C129.005 245.001 129.522 245.62 130.176 246.039C130.836 246.453 131.59 246.661 132.439 246.661C132.91 246.661 133.35 246.599 133.759 246.476C134.173 246.349 134.544 246.162 134.871 245.916C135.203 245.671 135.482 245.369 135.707 245.011C135.937 244.653 136.096 244.244 136.182 243.784L139.051 243.799C138.944 244.546 138.711 245.247 138.353 245.901C138 246.556 137.538 247.134 136.965 247.635C136.392 248.131 135.722 248.519 134.955 248.801C134.188 249.077 133.337 249.215 132.401 249.215C131.02 249.215 129.788 248.895 128.704 248.256C127.62 247.617 126.766 246.694 126.142 245.487C125.518 244.28 125.206 242.833 125.206 241.145C125.206 239.453 125.521 238.006 126.15 236.804C126.778 235.597 127.635 234.674 128.719 234.035C129.803 233.396 131.03 233.076 132.401 233.076C133.275 233.076 134.088 233.199 134.84 233.444C135.592 233.69 136.262 234.05 136.85 234.526C137.438 234.996 137.921 235.574 138.3 236.259C138.683 236.939 138.934 237.717 139.051 238.591ZM155.694 241.145C155.694 242.838 155.377 244.288 154.743 245.495C154.114 246.696 153.255 247.617 152.166 248.256C151.082 248.895 149.852 249.215 148.476 249.215C147.101 249.215 145.868 248.895 144.779 248.256C143.695 247.612 142.836 246.689 142.202 245.487C141.573 244.28 141.258 242.833 141.258 241.145C141.258 239.453 141.573 238.006 142.202 236.804C142.836 235.597 143.695 234.674 144.779 234.035C145.868 233.396 147.101 233.076 148.476 233.076C149.852 233.076 151.082 233.396 152.166 234.035C153.255 234.674 154.114 235.597 154.743 236.804C155.377 238.006 155.694 239.453 155.694 241.145ZM152.833 241.145C152.833 239.954 152.646 238.949 152.273 238.131C151.905 237.308 151.394 236.686 150.739 236.267C150.085 235.843 149.33 235.63 148.476 235.63C147.622 235.63 146.868 235.843 146.213 236.267C145.559 236.686 145.045 237.308 144.672 238.131C144.304 238.949 144.119 239.954 144.119 241.145C144.119 242.337 144.304 243.344 144.672 244.168C145.045 244.986 145.559 245.607 146.213 246.032C146.868 246.451 147.622 246.661 148.476 246.661C149.33 246.661 150.085 246.451 150.739 246.032C151.394 245.607 151.905 244.986 152.273 244.168C152.646 243.344 152.833 242.337 152.833 241.145ZM158.385 249L158.385 233.291L164.275 233.291C165.482 233.291 166.495 233.516 167.313 233.966C168.136 234.416 168.758 235.035 169.177 235.822C169.601 236.605 169.814 237.494 169.814 238.491C169.814 239.499 169.601 240.394 169.177 241.176C168.752 241.959 168.126 242.575 167.298 243.025C166.469 243.47 165.449 243.692 164.237 243.692L160.333 243.692L160.333 241.353L163.854 241.353C164.559 241.353 165.137 241.23 165.587 240.984C166.037 240.739 166.37 240.401 166.584 239.972C166.804 239.542 166.914 239.049 166.914 238.491C166.914 237.934 166.804 237.443 166.584 237.019C166.37 236.594 166.035 236.264 165.579 236.029C165.129 235.789 164.549 235.669 163.838 235.669L161.23 235.669L161.23 249L158.385 249ZM171.212 233.291L174.425 233.291L178.268 240.24L178.422 240.24L182.265 233.291L185.479 233.291L179.764 243.14L179.764 249L176.926 249L176.926 243.14L171.212 233.291Z" fill="white"/>
<path d="M222.667 229H209.333C208.597 229 208 229.597 208 230.333L208 245H222.667C223.403 245 224 244.403 224 243.667L224 230.333C224 229.597 223.403 229 222.667 229Z" fill="white" stroke="#04DF00" stroke-width="2" stroke-linecap="round" stroke-linejoin="round"/>
<path d="M201.333 253L214.667 253C215.403 253 216 252.403 216 251.667L216 238.333C216 237.597 215.403 237 214.667 237L201.333 237C200.597 237 200 237.597 200 238.333L200 251.667C200 252.403 200.597 253 201.333 253Z" fill="white" stroke="#04DF00" stroke-width="2" stroke-linecap="round" stroke-linejoin="round"/>
<rect x="84.22" y="219.22" width="183.56" height="43.56" rx="7.78" stroke="black" stroke-width="3.56"/>
</svg>
