<svg width="70" height="70" viewBox="0 0 70 70" fill="none" xmlns="http://www.w3.org/2000/svg">
<circle cx="35" cy="35" r="35" fill="url(#paint0_radial_205_1885)"/>
<circle cx="35" cy="35" r="29.5" stroke="white"/>
<circle opacity="0.6" cx="35" cy="35" r="23.5" stroke="white"/>
<circle opacity="0.27" cx="35" cy="35" r="16.5" stroke="white"/>
<path d="M25.0067 35.8013L25 36.712C25.0067 41.1048 28.0804 44.7879 32.2388 45.8325C32.3259 45.8392 32.4129 45.866 32.4933 45.8928C32.8884 46.0267 33.1696 46.3548 33.3036 46.7499V50.6807C33.3036 51.4106 33.8996 51.9999 34.6429 51.9999H34.6496C35.3929 51.9999 35.9821 51.4106 35.9821 50.6807V46.7432C36.1161 46.3481 36.3906 46.0267 36.7857 45.8928C36.8661 45.866 36.9531 45.8392 37.0469 45.8325C41.2054 44.7879 44.2857 41.1048 44.2857 36.712V35.8013C44.2857 35.1048 43.6897 34.5356 42.9799 34.5356C42.2701 34.5356 41.6741 35.0981 41.6741 35.8013V36.712C41.6741 38.6205 40.904 40.3348 39.625 41.587C38.3393 42.8325 36.5915 43.6093 34.6362 43.6093C32.6808 43.6093 30.9464 42.8392 29.6674 41.587C28.3884 40.3348 27.6116 38.6138 27.6116 36.712V35.8013C27.6116 35.1048 27.0223 34.5356 26.3058 34.5356C25.596 34.5356 25.0067 35.1048 25.0067 35.8013Z" fill="white"/>
<path d="M29.4866 27.0692V36.6987C29.4866 39.4978 31.8102 41.7679 34.6763 41.7679C37.5424 41.7679 39.866 39.4978 39.866 36.6987V27.0692C39.866 24.2701 37.5424 22 34.6763 22C31.8102 22 29.4866 24.2701 29.4866 27.0692Z" fill="white"/>
<defs>
<radialGradient id="paint0_radial_205_1885" cx="0" cy="0" r="1" gradientUnits="userSpaceOnUse" gradientTransform="translate(35 35) rotate(90) scale(35)">
<stop stop-color="#4765FF"/>
<stop offset="1" stop-color="#9745FF"/>
</radialGradient>
</defs>
</svg>
