<svg width="47" height="43" viewBox="0 0 47 43" fill="none" xmlns="http://www.w3.org/2000/svg">
<path d="M33 28C34.3842 28 35.7257 27.8123 37 27.4605V30C37 36.6274 31.6274 42 25 42H13C6.3726 42 1 36.6274 1 30V18C1 11.3726 6.3726 6 13 6H19.7304C18.6256 8.09021 18 10.473 18 13C18 21.2843 24.7157 28 33 28Z" stroke="#7A7A7A" stroke-width="2"/>
<circle cx="35" cy="12" r="11" stroke="#FFBF5F" stroke-width="2"/>
<path d="M34.5353 16.9996V9.56365L32.7803 10.6426V8.69265L34.5353 7.63965H36.3423V16.9996H34.5353Z" fill="#FFBF5F"/>
</svg>
