<svg width="21" height="20" viewBox="0 0 21 20" fill="none" xmlns="http://www.w3.org/2000/svg">
<path d="M15 4L6 10L15 16" stroke="white"/>
<circle cx="6" cy="10" r="3" fill="white"/>
<circle cx="15" cy="4" r="3" fill="white"/>
<circle cx="15" cy="15" r="3" fill="white"/>
</svg>
