<svg width="70" height="70" viewBox="0 0 70 70" fill="none" xmlns="http://www.w3.org/2000/svg">
<circle cx="35" cy="35" r="35" fill="url(#paint0_linear_205_1874)"/>
<path d="M51.2736 47.2381H18.1549C17.0534 47.2367 15.9974 46.7985 15.2185 46.0196C14.4396 45.2407 14.0014 44.1847 14 43.0832V25.1549C14.0014 24.0534 14.4396 22.9974 15.2185 22.2185C15.9974 21.4396 17.0534 21.0014 18.1549 21H51.2736C52.3752 21.0014 53.4312 21.4396 54.2101 22.2185C54.989 22.9974 55.4272 24.0534 55.4286 25.1549V43.0832C55.4272 44.1847 54.989 45.2407 54.2101 46.0196C53.4312 46.7985 52.3752 47.2367 51.2736 47.2381Z" fill="#252525"/>
<path d="M34.0489 28.9271C34.3483 28.0057 35.6517 28.0057 35.9511 28.9271L36.7961 31.5279C36.93 31.9399 37.3139 32.2188 37.7472 32.2188H40.4818C41.4505 32.2188 41.8533 33.4585 41.0696 34.0279L38.8572 35.6353C38.5067 35.8899 38.3601 36.3413 38.494 36.7533L39.339 39.3541C39.6384 40.2754 38.5839 41.0415 37.8002 40.4721L35.5878 38.8647C35.2373 38.6101 34.7627 38.6101 34.4122 38.8647L32.1998 40.4721C31.4161 41.0415 30.3616 40.2754 30.661 39.3541L31.506 36.7533C31.6399 36.3413 31.4933 35.8899 31.1428 35.6353L28.9304 34.0279C28.1467 33.4585 28.5495 32.2188 29.5182 32.2188H32.2528C32.6861 32.2188 33.07 31.9399 33.2039 31.5279L34.0489 28.9271Z" fill="white"/>
<path d="M23.6666 50H45.7619" stroke="#252525" stroke-width="2" stroke-miterlimit="10" stroke-linecap="round"/>
<defs>
<linearGradient id="paint0_linear_205_1874" x1="35" y1="0" x2="35" y2="70" gradientUnits="userSpaceOnUse">
<stop stop-color="#47FFD3"/>
<stop offset="1" stop-color="#2CCCFF" stop-opacity="0.79"/>
</linearGradient>
</defs>
</svg>
