<svg width="432" height="270" viewBox="0 0 432 270" fill="none" xmlns="http://www.w3.org/2000/svg">
<path opacity="0.5" d="M242.366 176.876C242.443 176.632 242.53 176.385 242.627 176.134C242.724 175.883 242.821 175.668 242.915 175.487C243.186 174.972 243.533 174.586 243.958 174.329C244.395 174.08 244.862 173.889 245.357 173.759C245.866 173.635 246.364 173.514 246.852 173.398C247.353 173.288 247.805 173.125 248.207 172.91C248.631 172.689 248.963 172.348 249.204 171.889C249.503 171.318 249.528 170.799 249.279 170.331C249.05 169.856 248.641 169.464 248.053 169.155C247.678 168.959 247.241 168.8 246.741 168.68C246.248 168.546 245.741 168.44 245.219 168.361L245.5 166.752C246.954 166.875 248.256 167.239 249.407 167.842C250.076 168.193 250.627 168.606 251.06 169.082C251.506 169.564 251.77 170.102 251.852 170.695C251.954 171.281 251.822 171.922 251.457 172.618C251.114 173.272 250.688 173.759 250.18 174.078C249.685 174.404 249.148 174.646 248.57 174.805C248.006 174.97 247.446 175.111 246.89 175.228C246.347 175.352 245.847 175.524 245.39 175.746C244.953 175.961 244.611 176.305 244.362 176.778C244.319 176.861 244.253 176.987 244.165 177.154C244.098 177.314 244.035 177.467 243.975 177.613L242.366 176.876ZM240.161 180.592C240.366 180.202 240.647 179.959 241.004 179.863C241.369 179.752 241.726 179.788 242.074 179.971C242.435 180.16 242.661 180.429 242.751 180.778C242.861 181.12 242.822 181.472 242.632 181.834C242.42 182.238 242.125 182.491 241.747 182.595C241.389 182.691 241.043 182.652 240.709 182.476C240.347 182.287 240.111 182.021 240.001 181.679C239.911 181.33 239.964 180.968 240.161 180.592Z" fill="#D3A562"/>
<path opacity="0.5" d="M193.016 150.961C192.828 150.787 192.642 150.603 192.456 150.408C192.271 150.213 192.117 150.034 191.994 149.871C191.644 149.407 191.443 148.928 191.392 148.434C191.354 147.932 191.381 147.429 191.474 146.925C191.579 146.412 191.683 145.911 191.785 145.419C191.9 144.919 191.946 144.441 191.924 143.986C191.904 143.508 191.738 143.062 191.426 142.648C191.037 142.134 190.578 141.89 190.049 141.915C189.522 141.919 188.993 142.121 188.462 142.522C188.125 142.777 187.795 143.105 187.473 143.506C187.141 143.894 186.828 144.307 186.534 144.745L185.199 143.804C185.931 142.542 186.816 141.52 187.853 140.737C188.456 140.282 189.065 139.96 189.68 139.771C190.306 139.574 190.905 139.565 191.476 139.744C192.05 139.902 192.573 140.295 193.047 140.922C193.492 141.512 193.75 142.104 193.822 142.7C193.905 143.287 193.895 143.876 193.792 144.466C193.7 145.047 193.589 145.614 193.457 146.167C193.337 146.71 193.28 147.236 193.285 147.744C193.293 148.231 193.457 148.687 193.779 149.114C193.836 149.189 193.921 149.302 194.035 149.452C194.151 149.581 194.263 149.704 194.37 149.82L193.016 150.961ZM195.435 154.541C195.169 154.19 195.07 153.832 195.135 153.467C195.191 153.09 195.376 152.783 195.689 152.546C196.015 152.301 196.355 152.212 196.709 152.279C197.065 152.325 197.367 152.511 197.613 152.837C197.888 153.201 197.991 153.576 197.923 153.962C197.857 154.327 197.674 154.623 197.372 154.851C197.047 155.096 196.706 155.196 196.349 155.15C195.995 155.083 195.69 154.88 195.435 154.541Z" fill="#D3A562"/>
<path d="M110 203.911H85.3532V239H76.0632V203.911H9.32714L8 196.93L74.3569 106L85.3532 107.887V196.176H110V203.911ZM18.4275 196.176H76.2528V116.565L18.4275 196.176Z" fill="#322E29"/>
<path d="M432 203.911H407.353V239H398.063V203.911H331.327L330 196.93L396.357 106L407.353 107.887V196.176H432V203.911ZM340.428 196.176H398.253V116.565L340.428 196.176Z" fill="#322E29"/>
<path d="M288 172C288 209.003 258.003 239 221 239C183.997 239 154 209.003 154 172C154 134.997 183.997 105 221 105C258.003 105 288 134.997 288 172ZM163.272 172C163.272 203.882 189.118 229.728 221 229.728C252.882 229.728 278.728 203.882 278.728 172C278.728 140.118 252.882 114.272 221 114.272C189.118 114.272 163.272 140.118 163.272 172Z" fill="#BC883D"/>
<rect x="246" y="226.5" width="9" height="49.4371" transform="rotate(-30 246 226.5)" fill="#BC883D"/>
<g opacity="0.5">
<g clip-path="url(#clip0_291_18159)">
<path d="M34.1766 56.7667L33.3687 57.5747C32.7085 58.2349 31.8307 58.5985 30.897 58.5985C29.9633 58.5985 29.0856 58.2349 28.4254 57.5747C27.7652 56.9145 27.4016 56.0367 27.4016 55.1031C27.4016 54.1694 27.7652 53.2916 28.4254 52.6314L29.2334 51.8234L24.41 47L0 71.41L4.82336 76.2333L5.63139 75.4253C6.29157 74.7651 7.16937 74.4015 8.10309 74.4015C9.0368 74.4015 9.91445 74.7651 10.5747 75.4253C11.2349 76.0855 11.5985 76.9633 11.5985 77.8969C11.5985 78.8306 11.2349 79.7084 10.5747 80.3686L9.76668 81.1766L14.59 86L39 61.59L34.1766 56.7667ZM12.9195 81.0973C13.5469 80.1571 13.884 79.0529 13.884 77.8969C13.884 76.3528 13.2827 74.9011 12.1908 73.8092C11.0989 72.7173 9.64717 72.116 8.10309 72.116C6.9471 72.116 5.84292 72.4531 4.90273 73.0805L3.23213 71.41L24.41 50.2321L26.0805 51.9027C25.4531 52.8429 25.116 53.9471 25.116 55.1031C25.116 56.6472 25.7173 58.0989 26.8092 59.1908C27.9011 60.2827 29.3528 60.884 30.8969 60.884C32.0529 60.884 33.1571 60.5469 34.0973 59.9195L35.7679 61.59L14.59 82.7679L12.9195 81.0973Z" fill="#888C94"/>
<path d="M22.7721 61.6056L21.1561 63.2217L22.7786 64.8442L24.3946 63.2281L22.7721 61.6056Z" fill="#888C94"/>
<path d="M19.5275 58.3595L17.9115 59.9756L19.534 61.5981L21.15 59.9821L19.5275 58.3595Z" fill="#888C94"/>
<path d="M26.0174 64.8508L24.4014 66.4668L26.0239 68.0893L27.6399 66.4733L26.0174 64.8508Z" fill="#888C94"/>
</g>
<g clip-path="url(#clip1_291_18159)">
<path d="M151.806 237.518L150.936 238.388C150.225 239.099 149.279 239.491 148.274 239.491C147.268 239.491 146.323 239.099 145.612 238.388C144.901 237.677 144.509 236.732 144.509 235.726C144.509 234.721 144.901 233.776 145.612 233.065L146.482 232.194L141.288 227L115 253.288L120.194 258.482L121.065 257.612C121.776 256.901 122.721 256.509 123.726 256.509C124.732 256.509 125.677 256.901 126.388 257.612C127.099 258.323 127.491 259.268 127.491 260.274C127.491 261.279 127.099 262.224 126.388 262.935L125.518 263.806L130.712 269L157 242.712L151.806 237.518ZM128.913 263.72C129.589 262.708 129.952 261.519 129.952 260.274C129.952 258.611 129.304 257.047 128.129 255.871C126.953 254.696 125.389 254.048 123.726 254.048C122.481 254.048 121.292 254.411 120.28 255.087L118.481 253.288L141.288 230.481L143.087 232.28C142.411 233.292 142.048 234.481 142.048 235.726C142.048 237.389 142.696 238.953 143.871 240.129C145.047 241.304 146.611 241.952 148.274 241.952C149.519 241.952 150.708 241.589 151.72 240.913L153.519 242.712L130.712 265.519L128.913 263.72Z" fill="#888C94"/>
<path d="M139.524 242.729L137.783 244.469L139.531 246.217L141.271 244.476L139.524 242.729Z" fill="#888C94"/>
<path d="M136.03 239.233L134.289 240.974L136.037 242.721L137.777 240.981L136.03 239.233Z" fill="#888C94"/>
<path d="M143.019 246.224L141.278 247.964L143.026 249.711L144.766 247.971L143.019 246.224Z" fill="#888C94"/>
</g>
<g clip-path="url(#clip2_291_18159)">
<path d="M122.591 44.9506L122.985 45.6323C123.307 46.1892 123.392 46.8381 123.226 47.4594C123.059 48.0806 122.661 48.5998 122.104 48.9214C121.547 49.2429 120.898 49.3283 120.277 49.1619C119.656 48.9954 119.136 48.597 118.815 48.0401L118.421 47.3584L114.352 49.7078L126.241 70.3011L130.311 67.9517L129.917 67.2701C129.596 66.7131 129.51 66.0642 129.677 65.443C129.843 64.8217 130.241 64.3026 130.798 63.981C131.355 63.6594 132.004 63.574 132.625 63.7404C133.247 63.9069 133.766 64.3053 134.087 64.8623L134.481 65.544L138.55 63.1946L126.661 42.6013L122.591 44.9506ZM134.99 63.432C134.477 62.847 133.802 62.4258 133.033 62.2197C132.005 61.9444 130.932 62.0857 130.011 62.6176C129.09 63.1494 128.431 64.0081 128.156 65.0355C127.95 65.8046 127.977 66.5994 128.227 67.3368L126.818 68.1506L116.502 50.284L117.912 49.4703C118.425 50.0554 119.1 50.4766 119.869 50.6826C120.897 50.9579 121.97 50.8167 122.891 50.2848C123.812 49.753 124.471 48.8943 124.746 47.8669C124.952 47.0977 124.925 46.303 124.675 45.5655L126.084 44.7518L136.4 62.6184L134.99 63.432Z" fill="#888C94"/>
<path d="M123.778 53.4013L124.565 54.7646L125.934 53.9744L125.147 52.611L123.778 53.4013Z" fill="#888C94"/>
<path d="M121.04 54.9814L121.827 56.3447L123.196 55.5544L122.408 54.1911L121.04 54.9814Z" fill="#888C94"/>
<path d="M126.516 51.8207L127.303 53.1841L128.671 52.3938L127.884 51.0304L126.516 51.8207Z" fill="#888C94"/>
</g>
<g clip-path="url(#clip3_291_18159)">
<path d="M318.139 236.571L317.677 236.571C317.299 236.571 316.944 236.423 316.677 236.156C316.41 235.889 316.263 235.534 316.263 235.156C316.263 234.779 316.41 234.424 316.677 234.157C316.944 233.889 317.299 233.742 317.677 233.742L318.139 233.742L318.139 230.983H304.174L304.174 233.742L304.636 233.742C305.014 233.742 305.369 233.889 305.636 234.157C305.903 234.424 306.05 234.779 306.05 235.156C306.05 235.534 305.903 235.889 305.636 236.156C305.369 236.423 305.014 236.571 304.636 236.571L304.174 236.571L304.174 239.33H318.139L318.139 236.571ZM305.098 237.45C305.547 237.36 305.959 237.141 306.29 236.81C306.731 236.368 306.975 235.781 306.975 235.156C306.975 234.532 306.731 233.944 306.29 233.503C305.959 233.172 305.547 232.953 305.098 232.863L305.098 231.907H317.215L317.215 232.863C316.766 232.953 316.354 233.172 316.023 233.503C315.581 233.944 315.338 234.532 315.338 235.156C315.338 235.781 315.581 236.368 316.023 236.81C316.354 237.141 316.766 237.36 317.215 237.45L317.215 238.406H305.098L305.098 237.45Z" fill="#888C94"/>
<path d="M313.493 234.692L312.568 234.692L312.568 235.621L313.493 235.621L313.493 234.692Z" fill="#888C94"/>
<path d="M313.493 232.836L312.568 232.836L312.568 233.764L313.493 233.764L313.493 232.836Z" fill="#888C94"/>
<path d="M313.493 236.549L312.568 236.549L312.568 237.478L313.493 237.478L313.493 236.549Z" fill="#888C94"/>
</g>
<g clip-path="url(#clip4_291_18159)">
<path d="M372.725 48.7129L372.168 48.713C371.712 48.713 371.284 48.5356 370.962 48.2135C370.64 47.8914 370.462 47.4632 370.462 47.0077C370.462 46.5522 370.64 46.124 370.962 45.8019C371.284 45.4799 371.712 45.3025 372.168 45.3024L372.725 45.3024L372.725 41.9747H355.884L355.884 45.3024L356.442 45.3024C356.897 45.3024 357.325 45.4798 357.647 45.8019C357.97 46.124 358.147 46.5522 358.147 47.0077C358.147 47.4631 357.97 47.8914 357.647 48.2134C357.325 48.5355 356.897 48.7129 356.442 48.7129L355.884 48.7129L355.884 52.0407H372.725L372.725 48.7129ZM356.999 49.7731C357.54 49.6653 358.037 49.4006 358.436 49.0019C358.969 48.4692 359.262 47.761 359.262 47.0077C359.262 46.2544 358.969 45.5461 358.436 45.0135C358.037 44.6147 357.54 44.3501 356.999 44.2422L356.999 43.0896H371.61L371.61 44.2422C371.069 44.3501 370.572 44.6147 370.173 45.0135C369.641 45.5462 369.347 46.2544 369.347 47.0077C369.347 47.761 369.641 48.4692 370.173 49.0019C370.572 49.4006 371.069 49.6653 371.61 49.7731L371.61 50.9257H356.999L356.999 49.7731Z" fill="#888C94"/>
<path d="M367.122 46.4482L366.007 46.4482L366.007 47.5676L367.122 47.5676L367.122 46.4482Z" fill="#888C94"/>
<path d="M367.122 44.209L366.007 44.209L366.007 45.3284L367.122 45.3284L367.122 44.209Z" fill="#888C94"/>
<path d="M367.122 48.687L366.007 48.687L366.007 49.8064L367.122 49.8064L367.122 48.687Z" fill="#888C94"/>
</g>
<path d="M274.292 55.3049C274.598 54.8706 274.927 54.4361 275.279 54.0012C275.63 53.5664 275.957 53.1998 276.259 52.9015C277.12 52.0524 278.052 51.5082 279.055 51.2687C280.081 51.0517 281.125 50.9703 282.188 51.0245C283.274 51.1011 284.336 51.178 285.376 51.2551C286.438 51.3547 287.436 51.3191 288.369 51.1486C289.348 50.9774 290.221 50.5132 290.989 49.7559C291.943 48.815 292.321 47.8023 292.124 46.7178C291.971 45.6327 291.41 44.5981 290.439 43.6142C289.822 42.988 289.056 42.3977 288.142 41.8433C287.251 41.266 286.314 40.7345 285.33 40.249L286.906 37.2392C289.706 38.4034 292.055 39.9471 293.952 41.8703C295.055 42.9884 295.885 44.1554 296.441 45.3712C297.02 46.6093 297.202 47.8413 296.988 49.067C296.819 50.2922 296.153 51.4784 294.99 52.6258C293.897 53.7044 292.745 54.3986 291.536 54.7087C290.35 55.041 289.134 55.1813 287.889 55.1294C286.667 55.0999 285.468 55.0248 284.293 54.904C283.141 54.8057 282.041 54.8312 280.995 54.9806C279.994 55.1294 279.099 55.5939 278.308 56.3741C278.168 56.5118 277.959 56.7183 277.679 56.9937C277.445 57.2685 277.223 57.5318 277.013 57.7836L274.292 55.3049ZM267.575 61.2686C268.226 60.626 268.937 60.3225 269.706 60.3578C270.499 60.3703 271.182 60.6672 271.755 61.2486C272.351 61.8524 272.627 62.5283 272.584 63.2762C272.587 64.0235 272.286 64.6955 271.681 65.2922C271.006 65.9577 270.262 66.273 269.447 66.2382C268.678 66.2029 268.017 65.9056 267.466 65.3466C266.871 64.7428 266.571 64.0672 266.569 63.3199C266.611 62.5719 266.947 61.8882 267.575 61.2686Z" fill="#888C94"/>
<path d="M157.176 9.43124C157.015 9.31913 156.853 9.19863 156.691 9.06975C156.53 8.94088 156.393 8.82088 156.282 8.70976C155.966 8.3935 155.762 8.05014 155.671 7.67968C155.588 7.30101 155.555 6.91496 155.573 6.52152C155.598 6.11986 155.624 5.72658 155.65 5.34169C155.684 4.94858 155.668 4.57962 155.603 4.2348C155.537 3.87323 155.363 3.55141 155.081 3.26934C154.731 2.91888 154.355 2.78158 153.954 2.85743C153.553 2.91652 153.172 3.12681 152.811 3.48831C152.581 3.71835 152.364 4.00312 152.161 4.34262C151.95 4.67357 151.756 5.02162 151.579 5.38677L150.462 4.81167C150.885 3.77275 151.45 2.90002 152.157 2.19346C152.567 1.78267 152.997 1.4728 153.445 1.26383C153.902 1.04665 154.357 0.976072 154.811 1.05209C155.265 1.11134 155.705 1.35465 156.132 1.78204C156.534 2.18377 156.794 2.60784 156.912 3.05422C157.038 3.4924 157.093 3.94173 157.077 4.40222C157.069 4.8545 157.044 5.29807 157.002 5.73292C156.969 6.15956 156.981 6.56616 157.039 6.95271C157.097 7.3225 157.271 7.65271 157.561 7.94332C157.613 7.99461 157.69 8.07154 157.792 8.17411C157.894 8.25992 157.992 8.34145 158.086 8.41871L157.176 9.43124ZM159.399 11.9008C159.16 11.6615 159.046 11.3995 159.057 11.1148C159.06 10.8216 159.168 10.5682 159.381 10.3546C159.603 10.1328 159.852 10.0288 160.129 10.0427C160.406 10.0398 160.655 10.1494 160.877 10.3717C161.125 10.6196 161.244 10.8942 161.233 11.1956C161.222 11.4803 161.113 11.7253 160.908 11.9307C160.686 12.1525 160.437 12.2649 160.161 12.2678C159.884 12.2539 159.63 12.1316 159.399 11.9008Z" fill="#888C94"/>
</g>
<defs>
<clipPath id="clip0_291_18159">
<rect width="39" height="39" fill="white" transform="translate(0 47)"/>
</clipPath>
<clipPath id="clip1_291_18159">
<rect width="42" height="42" fill="white" transform="translate(115 227)"/>
</clipPath>
<clipPath id="clip2_291_18159">
<rect width="26.8645" height="26.8645" fill="white" transform="translate(110 65.9492) rotate(-75)"/>
</clipPath>
<clipPath id="clip3_291_18159">
<rect width="15.7776" height="15.7776" fill="white" transform="translate(311.156 224) rotate(45)"/>
</clipPath>
<clipPath id="clip4_291_18159">
<rect width="19.0261" height="19.0261" fill="white" transform="translate(364.305 33.5542) rotate(45)"/>
</clipPath>
</defs>
</svg>
