<svg width="610" height="700" viewBox="0 0 610 700" fill="none" xmlns="http://www.w3.org/2000/svg">
<path d="M346 213.329V167.041V105.658V0H230.006V105.658H115.003V148.928V213.329H0V321H115.003H230.006V213.329H346Z" fill="white"/>
<path fill-rule="evenodd" clip-rule="evenodd" d="M379.339 599.366L418.624 609.585C425.771 611.444 430.057 618.744 428.198 625.891L417.979 665.176C416.12 672.322 408.82 676.609 401.673 674.75L393.667 672.667L388.219 693.613L377.555 668.476L362.388 664.53C355.242 662.672 350.955 655.371 352.814 648.225L363.034 608.94C364.892 601.793 372.193 597.507 379.339 599.366Z" fill="white"/>
<path fill-rule="evenodd" clip-rule="evenodd" d="M344.641 267.335L416.415 252.038C429.472 249.256 442.312 257.584 445.094 270.641L460.391 342.415C463.174 355.472 454.846 368.312 441.789 371.094L370.015 386.391C356.958 389.174 344.118 380.845 341.335 367.789L326.038 296.014C323.256 282.958 331.584 270.118 344.641 267.335ZM368.787 281.145L386.32 332.305L406.234 326.347L392.788 273.964L368.787 281.145ZM389.793 353.276C391.694 359.632 398.787 362.927 405.71 360.856C412.568 358.804 416.685 352.156 414.783 345.799C412.9 339.506 405.808 336.211 398.951 338.263C392.027 340.334 387.91 346.983 389.793 353.276Z" fill="white"/>
<path fill-rule="evenodd" clip-rule="evenodd" d="M531.296 438.944L590.299 450.918C601.032 453.096 607.968 463.563 605.789 474.296L593.816 533.299C591.637 544.032 581.171 550.968 570.438 548.789L511.434 536.816C500.701 534.637 493.766 524.171 495.944 513.438L507.918 454.434C510.096 443.701 520.563 436.766 531.296 438.944ZM536.25 496.951L535.384 498.693L550.662 507.425L551.361 506.202C553.506 502.45 556.493 501.528 565.084 502.02C574.308 502.537 580.133 500.162 583.675 493.964L583.723 493.88C589.506 483.761 583.623 471.506 568.832 463.054C553.212 454.126 539.794 456.19 533.551 466.66L533.358 466.998L549.223 476.064L549.391 475.769C551.634 472.185 556.47 471.201 561.156 473.879C565.696 476.474 567.641 480.662 565.689 484.077L565.641 484.161C563.569 487.787 560.825 488.623 552.258 488.202C543.546 487.697 539.083 490.293 536.25 496.951ZM526.645 511.037C524.212 515.295 526.409 520.969 531.534 523.898C536.611 526.8 542.663 525.84 545.097 521.582C547.506 517.366 545.261 511.664 540.184 508.763C535.058 505.834 529.055 506.821 526.645 511.037Z" fill="white"/>
<path fill-rule="evenodd" clip-rule="evenodd" d="M145.8 430.086L248.284 430.807C266.927 430.938 281.933 446.157 281.802 464.8L281.081 567.284C280.95 585.927 265.731 600.933 247.088 600.802L144.604 600.081C125.961 599.95 110.954 584.731 111.085 566.088L111.806 463.604C111.938 444.961 127.157 429.954 145.8 430.086ZM148.598 502.964L135.731 515.017L180.125 563.902L257.413 479.443L244.717 467.211L180.381 527.474L148.598 502.964Z" fill="white"/>
</svg>
