<svg width="24" height="24" viewBox="0 0 24 24" xmlns="http://www.w3.org/2000/svg">
<path fill-rule="evenodd" clip-rule="evenodd" d="M18.196 5.89446H19.6432C20.0428 5.89446 20.3668 6.21846 20.3668 6.6181C20.3668 7.01774 20.0428 7.3417 19.6432 7.3417H18.8806L18.2709 18.3158C18.2068 19.4663 17.255 20.3668 16.1026 20.3668H7.26433C6.11192 20.3668 5.1601 19.4663 5.09606 18.3157L4.48639 7.3417H3.72361C3.32397 7.3417 3 7.01774 3 6.6181C3 6.21846 3.32397 5.89446 3.72361 5.89446H5.17085H5.17089H5.17092H7.50024L7.73809 4.94267C8.02328 3.80081 9.04925 3 10.226 3H13.1408C14.3175 3 15.3435 3.80081 15.6287 4.94261L15.8665 5.89446H18.196H18.196ZM10.2261 4.44721C9.71332 4.44721 9.26643 4.79604 9.14219 5.29344L8.99199 5.89446H14.3748L14.2246 5.29337C14.1004 4.79604 13.6535 4.44721 13.1408 4.44721H10.2261ZM16.8259 18.2354C16.8045 18.6191 16.4869 18.9196 16.1026 18.9196H7.26433C6.88002 18.9196 6.5624 18.6191 6.54103 18.2353L5.93587 7.3417H8.06534H15.3015H17.4311L16.8259 18.2354ZM8.06534 9.51255C8.06534 9.11291 8.38931 8.78895 8.78895 8.78895C9.18859 8.78895 9.51255 9.11291 9.51255 9.51255V16.7487C9.51255 17.1484 9.18859 17.4723 8.78895 17.4723C8.38931 17.4723 8.06534 17.1484 8.06534 16.7487V9.51255ZM11.6834 8.78895C11.2838 8.78895 10.9598 9.11291 10.9598 9.51255V16.7487C10.9598 17.1484 11.2838 17.4723 11.6834 17.4723C12.083 17.4723 12.407 17.1484 12.407 16.7487V9.51255C12.407 9.11291 12.083 8.78895 11.6834 8.78895ZM13.8543 9.51255C13.8543 9.11291 14.1782 8.78895 14.5779 8.78895C14.9775 8.78895 15.3015 9.11291 15.3015 9.51255V16.7487C15.3015 17.1484 14.9775 17.4723 14.5779 17.4723C14.1782 17.4723 13.8543 17.1484 13.8543 16.7487V9.51255Z"/>
</svg>
