<svg width="64.000000" height="64.000000" viewBox="0 0 64 64" fill="none" xmlns="http://www.w3.org/2000/svg" xmlns:xlink="http://www.w3.org/1999/xlink">
	<desc>
			Created with Pixso.
	</desc>
	<defs>
		<clipPath id="clip2847_4786">
			<rect id="Frame" width="41.000000" height="32.000000" transform="translate(11.500000 16.000000)" fill="white" fill-opacity="0"/>
		</clipPath>
	</defs>
	<rect id="Frame" width="41.000000" height="32.000000" transform="translate(11.500000 16.000000)" fill="#FFFFFF" fill-opacity="0"/>
	<g clip-path="url(#clip2847_4786)">
		<path id="Vector" d="M37.52 47.98L47.91 47.98L47.91 38.16L37.52 38.16L37.52 47.98ZM42.7 46.24C40.27 46.24 39.33 44.6 39.33 43.16C39.32 42.71 39.41 42.27 39.58 41.86C39.75 41.45 40 41.08 40.32 40.78C40.64 40.48 41.02 40.25 41.43 40.11C41.84 39.97 42.27 39.92 42.7 39.96C44.97 39.96 46.07 41.52 46.07 43.11C46.07 43.73 45.79 46.24 42.7 46.24Z" fill="#0A0B18" fill-opacity="1.000000" fill-rule="nonzero"/>
		<path id="Vector" d="M19.86 16L16.99 23.27L14.13 16L11.5 16L15.82 25.85L18.14 25.85L22.43 16L19.86 16Z" fill="#0A0B18" fill-opacity="1.000000" fill-rule="nonzero"/>
		<path id="Vector" d="M33.81 25.85C33.81 25.35 33.86 18.28 33.86 18.28L30.78 25.85L28.61 25.85L25.51 18.28C25.51 18.28 25.56 25.48 25.56 25.85L23.29 25.85L23.29 16L26.76 16L29.72 23.22L32.65 16L36.07 16L36.07 25.85L33.81 25.85Z" fill="#0A0B18" fill-opacity="1.000000" fill-rule="nonzero"/>
		<path id="Vector" d="M17.8 33.87C18.37 35.1 19.85 35.39 21.02 35.39C21.48 35.39 23.38 35.33 23.38 34.1C23.38 33.3 22.47 33.16 21.3 32.98C20.12 32.88 18.96 32.61 17.85 32.19C17.41 32 17.03 31.68 16.77 31.27C16.5 30.86 16.36 30.38 16.35 29.89C16.35 27.72 18.44 26.83 20.79 26.83C23.56 26.83 25 27.79 25.75 29.17L23.51 29.75C23 28.75 21.69 28.58 20.72 28.58C20.28 28.58 18.65 28.58 18.65 29.71C18.65 30.21 18.99 30.42 19.4 30.58C20.08 30.78 21.77 31.04 22.45 31.17C23.69 31.39 25.65 31.77 25.65 33.95C25.65 36.64 23.24 37.23 20.83 37.23C18.06 37.23 16.62 36.27 15.65 34.47L17.8 33.87Z" fill="#0A0B18" fill-opacity="1.000000" fill-rule="nonzero"/>
		<path id="Vector" d="M33.01 28.9L33.01 36.88L30.61 36.88L30.61 28.9L27.1 28.9L27.1 27.11L36.51 27.11L36.51 28.9L33.01 28.9Z" fill="#0A0B18" fill-opacity="1.000000" fill-rule="nonzero"/>
		<path id="Vector" d="M47.87 19.28L47.87 16L44.41 16L40.95 16L40.95 17.72L40.95 19.28L40.95 19.29L37.49 19.29L37.49 19.78L37.49 22.58L37.49 25.86L40.95 25.86L40.95 22.58L44.41 22.58L44.41 19.28L47.87 19.28Z" fill="#0A0B18" fill-opacity="1.000000" fill-rule="nonzero"/>
		<path id="Vector" d="M49.17 33.7L52.5 33.7L52.5 36.86L49.17 36.86L49.17 33.7Z" fill="#0A0B18" fill-opacity="1.000000" fill-rule="evenodd"/>
		<path id="Vector" d="M47.87 33.62L47.87 32.21L47.87 30.34L47.87 27.11L44.41 27.11L44.41 30.34L40.95 30.34L40.95 31.66L40.95 33.62L40.95 33.63L37.49 33.63L37.49 36.91L40.95 36.91L44.41 36.91L44.41 33.62L47.87 33.62Z" fill="#0A0B18" fill-opacity="1.000000" fill-rule="nonzero"/>
		<path id="Vector" d="M21.85 38.19C23.06 38.19 24.3 38.33 24.97 39.51C25.26 40.04 25.41 40.64 25.39 41.25C25.42 41.97 25.19 42.68 24.76 43.25C23.92 44.2 22.97 44.3 21.59 44.3L18.27 44.3L18.27 47.99L15.93 47.99L15.93 38.19L21.85 38.19ZM18.27 42.58L21.2 42.58C21.59 42.6 21.98 42.55 22.36 42.44C22.58 42.34 22.76 42.17 22.87 41.96C22.99 41.74 23.04 41.5 23.02 41.26C23.04 41.08 23.02 40.9 22.96 40.73C22.91 40.56 22.82 40.41 22.7 40.28C22.58 40.15 22.44 40.04 22.28 39.98C22.12 39.91 21.94 39.88 21.77 39.88L18.27 39.88L18.27 42.58Z" fill="#0A0B18" fill-opacity="1.000000" fill-rule="nonzero"/>
		<path id="Vector" d="M33.9 47.95L31.37 44.01L28.64 44.01L28.64 47.95L26.27 47.95L26.27 38.15L32.82 38.15C33.35 38.12 33.88 38.18 34.4 38.33C34.97 38.5 35.46 38.87 35.81 39.37C36.15 39.87 36.32 40.47 36.29 41.08C36.3 41.52 36.21 41.96 36.04 42.37C35.83 42.8 35.51 43.16 35.12 43.42C34.73 43.68 34.28 43.83 33.81 43.85L36.71 47.95L33.9 47.95ZM28.64 42.27L32.55 42.27C33 42.27 33.87 42.16 33.87 41.11C33.87 40.06 33.12 39.87 32.46 39.87L28.64 39.87L28.64 42.27Z" fill="#0A0B18" fill-opacity="1.000000" fill-rule="nonzero"/>
	</g>
</svg>
