<svg width="20" height="20" viewBox="0 0 20 20" fill="none" xmlns="http://www.w3.org/2000/svg">
<path d="M14.6667 10.6667H10.6667V14.6667H9.33333V10.6667H5.33333V9.33334H9.33333V5.33334H10.6667V9.33334H14.6667V10.6667Z" fill="#999999"/>
</svg>
