<svg width="17" height="16" viewBox="0 0 17 16" fill="none" xmlns="http://www.w3.org/2000/svg">
<path d="M6.36339 10.5834L3.58339 7.80336L2.63672 8.74336L6.36339 12.47L14.3634 4.47003L13.4234 3.53003L6.36339 10.5834Z" fill="#ffffff"/>
</svg>
