<svg width="24" height="24" viewBox="0 0 24 24" fill="none" xmlns="http://www.w3.org/2000/svg">
<path d="M3.99999 6.29058L10.8915 12.4267C11.5233 12.9893 12.4764 12.9893 13.1082 12.4267L19.9997 6.29058M3.6665 7.24983C3.6665 5.40888 5.15889 3.9165 6.99984 3.9165H16.9998C18.8408 3.9165 20.3332 5.40888 20.3332 7.24983V15.5832C20.3332 17.4241 18.8408 18.9165 16.9998 18.9165H6.99984C5.15889 18.9165 3.6665 17.4241 3.6665 15.5832V7.24983Z" stroke-width="2"/>
</svg>
