<svg width="12" height="12" viewBox="0 0 12 12" fill="none" xmlns="http://www.w3.org/2000/svg">
<path d="M8.295 7.8525L6 5.5625L3.705 7.8525L3 7.1475L6 4.1475L9 7.1475L8.295 7.8525Z" fill="#666666"/>
</svg>
