<svg width="10" height="10" viewBox="0 0 10 10" xmlns="http://www.w3.org/2000/svg">
<path fill-rule="evenodd" clip-rule="evenodd" d="M0 0H2V2H0V0ZM0 4H2V6H0V4ZM2 8H0V10H2V8ZM4 0H6V2H4V0ZM6 4H4V6H6V4ZM4 8H6V10H4V8ZM10 0H8V2H10V0ZM8 4H10V6H8V4ZM10 8H8V10H10V8Z"/>
</svg>
