<svg width="16" height="16" viewBox="0 0 16 16" xmlns="http://www.w3.org/2000/svg">
<rect width="16" height="16" rx="8"/>
<path d="M7.53453 8.175C7.91953 7.48 8.65953 7.07 9.08953 6.455C9.54453 5.81 9.28953 4.605 7.99953 4.605C7.15453 4.605 6.73953 5.245 6.56453 5.775L5.26953 5.23C5.62453 4.165 6.58953 3.25 7.99453 3.25C9.16953 3.25 9.97453 3.785 10.3845 4.455C10.7345 5.03 10.9395 6.105 10.3995 6.905C9.79953 7.79 9.22453 8.06 8.91453 8.63C8.78953 8.86 8.73953 9.01 8.73953 9.75H7.29453C7.28953 9.36 7.22953 8.725 7.53453 8.175ZM8.99953 11.75C8.99953 12.3 8.54953 12.75 7.99953 12.75C7.44953 12.75 6.99953 12.3 6.99953 11.75C6.99953 11.2 7.44953 10.75 7.99953 10.75C8.54953 10.75 8.99953 11.2 8.99953 11.75Z" fill="white"/>
</svg>
