<svg width="25" height="24" viewBox="0 0 25 24" fill="none" xmlns="http://www.w3.org/2000/svg">
<path d="M21.5 12H7.5" stroke-width="1.25" stroke-linecap="round" stroke-linejoin="round"/>
<path d="M21.5 6H3.5" stroke-width="1.25" stroke-linecap="round" stroke-linejoin="round"/>
<path d="M21.5 18H11.5" stroke-width="1.25" stroke-linecap="round" stroke-linejoin="round"/>
</svg>
