<svg width="16" height="16" viewBox="0 0 16 16" fill="none" xmlns="http://www.w3.org/2000/svg">
<path d="M8 3.99935C8 4.35297 8.14048 4.69211 8.39052 4.94216C8.64057 5.19221 8.97971 5.33268 9.33333 5.33268C9.68696 5.33268 10.0261 5.19221 10.2761 4.94216C10.5262 4.69211 10.6667 4.35297 10.6667 3.99935C10.6667 3.64573 10.5262 3.30659 10.2761 3.05654C10.0261 2.80649 9.68696 2.66602 9.33333 2.66602C8.97971 2.66602 8.64057 2.80649 8.39052 3.05654C8.14048 3.30659 8 3.64573 8 3.99935Z" stroke="#0176F6" stroke-width="1.25" stroke-linecap="round" stroke-linejoin="round"/>
<path d="M2.66602 4H7.99935" stroke="#0176F6" stroke-width="1.25" stroke-linecap="round" stroke-linejoin="round"/>
<path d="M10.666 4H13.3327" stroke="#0176F6" stroke-width="1.25" stroke-linecap="round" stroke-linejoin="round"/>
<path d="M4 7.99935C4 8.35297 4.14048 8.69211 4.39052 8.94216C4.64057 9.19221 4.97971 9.33268 5.33333 9.33268C5.68696 9.33268 6.02609 9.19221 6.27614 8.94216C6.52619 8.69211 6.66667 8.35297 6.66667 7.99935C6.66667 7.64573 6.52619 7.30659 6.27614 7.05654C6.02609 6.80649 5.68696 6.66602 5.33333 6.66602C4.97971 6.66602 4.64057 6.80649 4.39052 7.05654C4.14048 7.30659 4 7.64573 4 7.99935Z" stroke="#0176F6" stroke-width="1.25" stroke-linecap="round" stroke-linejoin="round"/>
<path d="M2.66602 8H3.99935" stroke="#0176F6" stroke-width="1.25" stroke-linecap="round" stroke-linejoin="round"/>
<path d="M6.66602 8H13.3327" stroke="#0176F6" stroke-width="1.25" stroke-linecap="round" stroke-linejoin="round"/>
<path d="M10 11.9993C10 12.353 10.1405 12.6921 10.3905 12.9422C10.6406 13.1922 10.9797 13.3327 11.3333 13.3327C11.687 13.3327 12.0261 13.1922 12.2761 12.9422C12.5262 12.6921 12.6667 12.353 12.6667 11.9993C12.6667 11.6457 12.5262 11.3066 12.2761 11.0565C12.0261 10.8065 11.687 10.666 11.3333 10.666C10.9797 10.666 10.6406 10.8065 10.3905 11.0565C10.1405 11.3066 10 11.6457 10 11.9993Z" stroke="#0176F6" stroke-width="1.25" stroke-linecap="round" stroke-linejoin="round"/>
<path d="M2.66602 12H9.99935" stroke="#0176F6" stroke-width="1.25" stroke-linecap="round" stroke-linejoin="round"/>
<path d="M12.666 12H13.3327" stroke="#0176F6" stroke-width="1.25" stroke-linecap="round" stroke-linejoin="round"/>
</svg>
