<svg width="24" height="24" viewBox="0 0 24 24" fill="none" xmlns="http://www.w3.org/2000/svg"><path d="M10 20.7771C9.12963 20.5797 8.2937 20.2531 7.52002 19.8081" stroke-width="1.25" stroke-linecap="round" stroke-linejoin="round"/>
<path d="M14 3.22314C15.9882 3.67722 17.7632 4.79284 19.0347 6.38735C20.3061 7.98187 20.9984 9.9608 20.9984 12.0001C20.9984 14.0395 20.3061 16.0184 19.0347 17.6129C17.7632 19.2075 15.9882 20.3231 14 20.7771" stroke-width="1.25" stroke-linecap="round" stroke-linejoin="round"/>
<path d="M4.57905 17.093C4.03356 16.3004 3.61925 15.4252 3.35205 14.501" stroke-width="1.25" stroke-linecap="round" stroke-linejoin="round"/>
<path d="M3.12402 10.5C3.28402 9.55002 3.59202 8.65002 4.02402 7.82502L4.19302 7.52002" stroke-width="1.25" stroke-linecap="round" stroke-linejoin="round"/>
<path d="M6.90698 4.57914C7.84264 3.93504 8.8923 3.47486 9.99998 3.22314" stroke-width="1.25" stroke-linecap="round" stroke-linejoin="round"/>
<path d="M12 8V12L15 15" stroke-width="1.25" stroke-linecap="round" stroke-linejoin="round"/>
</svg>
