<svg width="30" height="30" viewBox="0 0 30 30" fill="none" xmlns="http://www.w3.org/2000/svg">
<path d="M15 26.25C16.4774 26.25 17.9403 25.959 19.3052 25.3936C20.6701 24.8283 21.9103 23.9996 22.955 22.955C23.9996 21.9103 24.8283 20.6701 25.3936 19.3052C25.959 17.9403 26.25 16.4774 26.25 15C26.25 13.5226 25.959 12.0597 25.3936 10.6948C24.8283 9.3299 23.9996 8.08971 22.9549 7.04505C21.9103 6.00039 20.6701 5.17172 19.3052 4.60635C17.9403 4.04099 16.4774 3.75 15 3.75C12.0163 3.75 9.15483 4.93527 7.04505 7.04505C4.93526 9.15483 3.75 12.0163 3.75 15C3.75 17.9837 4.93526 20.8452 7.04505 22.955C9.15483 25.0647 12.0163 26.25 15 26.25Z" stroke="#E5E5E5" stroke-width="1.25" stroke-linecap="round" stroke-linejoin="round"/>
<path d="M15 19L19 15" stroke="#A6A6A6" stroke-width="1.25" stroke-linecap="round" stroke-linejoin="round"/>
<path d="M11 15L19 15" stroke="#A6A6A6" stroke-width="1.25" stroke-linecap="round" stroke-linejoin="round"/>
<path d="M15 11L19 15" stroke="#A6A6A6" stroke-width="1.25" stroke-linecap="round" stroke-linejoin="round"/>
</svg>
