<svg width="197" height="188" viewBox="0 0 197 188" fill="none" xmlns="http://www.w3.org/2000/svg">
<path d="M0 104.127L0.151615 170.304L161.736 77.0054L161.639 15.2795L0 104.127Z" fill="url(#paint0_linear_186_15948)"/>
<path d="M17.2817 124.013L17.4058 180.667L178.99 87.369L178.521 34.6836L17.2817 124.013Z" fill="url(#paint1_linear_186_15948)"/>
<path d="M34.9069 142.906L34.645 187.502L196.243 94.2037L196.147 60.9084L34.9069 142.906Z" fill="url(#paint2_linear_186_15948)"/>
<path d="M0 86.1047L0.151615 163.472L161.736 70.1875L161.639 8.46164L159.462 0L147.569 25.0266L129.571 20.4375L104.31 33.4193L94.9936 56.93L76.4717 59.9894L63.0075 80.2753L50.6871 57.7844L41.688 67.2659L34.2875 78.5526L22.8629 77.3261L14.167 82.811L0 86.1047Z" fill="url(#paint3_linear_186_15948)"/>
<path d="M17.2817 104.117L17.4058 173.85L178.99 80.5512L178.935 37.6091L178.521 27.852L171.534 32.4135L168.475 25.1509L163.459 36.1758L150.807 41.33L144.441 46.3463L138.239 50.7425L133.181 49.0061L123.08 54.8355L115.018 60.6649L107.631 68.4238L101.926 72.8751H99.8998L94.8559 76.9405L93.8361 75.2179L81.75 86.8354L78.7182 87.428L71.6484 82.2325L65.9844 92.5959L60.5684 100.217L51.4866 107.797L39.3592 105.509L32.2757 101.471L24.4893 118.987L17.2817 104.117Z" fill="url(#paint4_linear_186_15948)"/>
<path d="M80.2062 97.8045L73.1778 115.417L66.9625 117.649L62.5939 112.151L49.9841 127.654L44.954 139.038L41.8945 129.184L34.9075 132.34L34.5492 149.236L34.6457 186.28L196.244 92.9949L196.147 54.0769L186.941 48.2336L180.175 59.5618L172.016 48.6609L159.958 71.1517L150.876 72.5161L140.802 73.7012L135.786 84.0785L130.687 80.3024L127.655 83.982L115.527 83.224L114.535 87.6753L109.477 88.6538L107.465 91.7546L101.76 93.1327L94.3457 91.5892L87.8272 103.11L80.2062 97.8045Z" fill="url(#paint5_linear_186_15948)"/>
<path d="M172.016 49.5992C172.195 49.5992 172.388 49.544 172.54 49.4338C172.967 49.1444 173.077 48.5656 172.788 48.1384L164.23 35.6526C164.133 35.5148 164.009 35.4046 163.858 35.3357L129.97 19.5838C129.501 19.3633 128.95 19.57 128.729 20.0386C128.509 20.5071 128.716 21.0584 129.184 21.2789L162.838 36.9205L171.258 49.1995C171.437 49.4614 171.727 49.5992 172.016 49.5992Z" fill="white"/>
<path d="M140.801 74.64C141.146 74.64 141.477 74.4471 141.642 74.1301C141.876 73.6753 141.683 73.1103 141.229 72.876L115.444 59.839C115.32 59.7701 115.182 59.7426 115.044 59.7426L76.4984 59.0673C76.016 59.0122 75.5612 59.4669 75.5475 59.9906C75.5337 60.5005 75.9471 60.9277 76.4708 60.9415L114.81 61.6168L140.415 74.5573C140.526 74.5987 140.663 74.64 140.801 74.64Z" fill="white"/>
<path d="M62.5945 113.074C62.9803 113.074 63.3386 112.84 63.4764 112.454C63.6418 111.972 63.3938 111.434 62.9114 111.269L33.2682 100.836L35.2113 78.6488C35.2526 78.1389 34.8805 77.6841 34.3568 77.6427C33.8469 77.629 33.3922 77.9735 33.3508 78.4972L31.3388 101.401C31.2974 101.829 31.5593 102.228 31.9589 102.366L62.2775 113.047C62.3877 113.06 62.498 113.074 62.5945 113.074Z" fill="white"/>
<g opacity="0.7">
<path d="M168.53 33.1697C168.543 36.3394 166.297 40.2257 163.527 41.8243C160.771 43.4091 158.511 42.1275 158.497 38.9578C158.483 35.7744 160.729 31.8881 163.486 30.2895C166.256 28.7046 168.516 29.9863 168.53 33.1697ZM163.513 40.3084C165.553 39.1232 167.207 36.2705 167.193 33.9415C167.193 31.5987 165.525 30.6616 163.486 31.8468C161.46 33.0182 159.806 35.8708 159.806 38.2136C159.82 40.5289 161.487 41.4798 163.513 40.3084Z" fill="white"/>
</g>
<g opacity="0.7">
<path d="M134.587 17.6123C134.6 20.782 132.354 24.6683 129.584 26.2669C126.828 27.8518 124.568 26.5701 124.554 23.4004C124.54 20.217 126.786 16.3307 129.543 14.7459C132.313 13.1472 134.573 14.4289 134.587 17.6123ZM129.57 24.751C131.61 23.5658 133.264 20.7131 133.25 18.3841C133.25 16.0413 131.582 15.1042 129.543 16.2894C127.517 17.4608 125.863 20.3134 125.863 22.6562C125.877 24.9715 127.544 25.9224 129.57 24.751Z" fill="white"/>
</g>
<g opacity="0.7">
<path d="M145.929 70.6565C145.943 73.8262 143.697 77.7125 140.927 79.3111C138.17 80.8959 135.91 79.6143 135.896 76.4446C135.883 73.2612 138.129 69.3749 140.885 67.79C143.655 66.1914 145.915 67.4731 145.929 70.6565ZM140.913 77.7952C142.952 76.61 144.606 73.7573 144.592 71.4283C144.592 69.0855 142.925 68.1484 140.885 69.3335C138.859 70.5049 137.206 73.3576 137.206 75.7004C137.219 78.0157 138.887 78.9528 140.913 77.7952Z" fill="white"/>
</g>
<g opacity="0.7">
<path d="M119.924 57.7559C119.938 60.9256 117.692 64.8119 114.922 66.4105C112.165 67.9953 109.905 66.7137 109.892 63.544C109.878 60.3605 112.124 56.4742 114.88 54.8894C117.664 53.2908 119.924 54.5725 119.924 57.7559ZM114.922 64.8945C116.961 63.7094 118.615 60.8567 118.601 58.5277C118.601 56.1849 116.934 55.2477 114.894 56.4329C112.868 57.6043 111.215 60.457 111.215 62.7998C111.228 65.115 112.896 66.0659 114.922 64.8945Z" fill="white"/>
</g>
<g opacity="0.7">
<path d="M81.4324 57.1509C81.4462 60.3205 79.1861 64.2068 76.4298 65.8054C73.6736 67.3903 71.4135 66.1086 71.3997 62.939C71.3859 59.7555 73.6323 55.8692 76.3885 54.2844C79.1585 52.672 81.4186 53.9674 81.4324 57.1509ZM76.4161 64.2757C78.4557 63.0905 80.1094 60.2378 80.0956 57.9088C80.0819 55.566 78.4281 54.6289 76.3885 55.8141C74.3627 56.9855 72.7089 59.8382 72.7227 62.181C72.7227 64.4962 74.3903 65.4471 76.4161 64.2757Z" fill="white"/>
</g>
<g opacity="0.7">
<path d="M67.8583 109.023C67.8721 112.193 65.612 116.079 62.8558 117.678C60.0996 119.263 57.8394 117.981 57.8256 114.812C57.8118 111.628 60.0582 107.742 62.8144 106.157C65.5845 104.558 67.8583 105.84 67.8583 109.023ZM62.8558 116.162C64.8954 114.977 66.5491 112.124 66.5353 109.795C66.5216 107.452 64.8678 106.515 62.8282 107.7C60.8024 108.872 59.1486 111.725 59.1624 114.067C59.1624 116.383 60.83 117.334 62.8558 116.162Z" fill="white"/>
</g>
<g opacity="0.7">
<path d="M37.2641 98.5215C37.2779 101.691 35.0177 105.577 32.2615 107.176C29.5053 108.761 27.2452 107.479 27.2314 104.31C27.2176 101.126 29.4639 97.2398 32.2202 95.655C35.004 94.0426 37.2641 95.338 37.2641 98.5215ZM32.2615 105.646C34.3011 104.461 35.9549 101.608 35.9411 99.2794C35.9273 96.9366 34.2736 95.9995 32.234 97.1847C30.2081 98.3561 28.5544 101.209 28.5682 103.552C28.5682 105.867 30.2357 106.818 32.2615 105.646Z" fill="white"/>
</g>
<g opacity="0.7">
<path d="M39.0551 75.521C39.0689 78.6907 36.8088 82.577 34.0525 84.1756C31.2963 85.7604 29.0362 84.4788 29.0224 81.3091C29.0086 78.1257 31.2549 74.2394 34.0112 72.6546C36.7812 71.0559 39.0413 72.3376 39.0551 75.521ZM34.0525 82.6597C36.0921 81.4745 37.7459 78.6218 37.7321 76.2928C37.7183 73.95 36.0646 73.0129 34.025 74.198C31.9991 75.3694 30.3454 78.2221 30.3592 80.5649C30.3592 82.8802 32.0129 83.8311 34.0525 82.6597Z" fill="white"/>
</g>
<g opacity="0.7">
<path d="M177.171 45.8072C177.185 48.9768 174.938 52.8631 172.168 54.4617C169.412 56.0466 167.152 54.7649 167.138 51.5953C167.124 48.4118 169.371 44.5255 172.127 42.9407C174.897 41.3421 177.157 42.6237 177.171 45.8072ZM172.155 52.932C174.194 51.7469 175.848 48.8942 175.834 46.5651C175.834 44.2223 174.167 43.2852 172.127 44.4704C170.101 45.6418 168.447 48.4945 168.447 50.8373C168.475 53.1663 170.129 54.1034 172.155 52.932Z" fill="white"/>
</g>
<defs>
<linearGradient id="paint0_linear_186_15948" x1="91.5717" y1="111.921" x2="81.5298" y2="93.931" gradientUnits="userSpaceOnUse">
<stop stop-color="white"/>
<stop offset="0.6832" stop-color="#52B3E2"/>
<stop offset="1" stop-color="#008FD5"/>
</linearGradient>
<linearGradient id="paint1_linear_186_15948" x1="106.719" y1="123.939" x2="95.0048" y2="102.182" gradientUnits="userSpaceOnUse">
<stop stop-color="white"/>
<stop offset="0.6832" stop-color="#52C7F4"/>
<stop offset="1" stop-color="#00ADEF"/>
</linearGradient>
<linearGradient id="paint2_linear_186_15948" x1="122.735" y1="137.016" x2="103.558" y2="103.558" gradientUnits="userSpaceOnUse">
<stop stop-color="white"/>
<stop offset="1" stop-color="#FF4C1B"/>
</linearGradient>
<linearGradient id="paint3_linear_186_15948" x1="81.2271" y1="84.2926" x2="62.2661" y2="50.1618" gradientUnits="userSpaceOnUse">
<stop stop-color="#0072BB"/>
<stop offset="1" stop-color="#008FD5"/>
</linearGradient>
<linearGradient id="paint4_linear_186_15948" x1="97.6372" y1="100.287" x2="83.416" y2="75.6371" gradientUnits="userSpaceOnUse">
<stop stop-color="#008FD5"/>
<stop offset="1" stop-color="#00ADEF"/>
</linearGradient>
<linearGradient id="paint5_linear_186_15948" x1="123.944" y1="135.102" x2="97.0363" y2="88.1546" gradientUnits="userSpaceOnUse">
<stop stop-color="#A42538"/>
<stop offset="1" stop-color="#FF4C1B"/>
</linearGradient>
</defs>
</svg>
