<svg width="16" height="16" viewBox="0 0 16 16" fill="none" xmlns="http://www.w3.org/2000/svg">

<path d="M13.0659 4.13035C12.8056 3.87006 12.5204 3.63818 12.215 3.43596C12.4848 3.33527 12.6505 3.24264 12.6671 3.23317C12.7407 3.19123 12.786 3.11283 12.7855 3.02807C12.785 2.94335 12.7388 2.86548 12.6647 2.82445C11.8315 2.36322 10.8067 2.12499 9.61854 2.1164C9.61791 2.1164 9.61738 2.1164 9.61679 2.1164C9.48816 2.1164 9.38338 2.22021 9.38244 2.34909C9.3815 2.47853 9.48569 2.58422 9.6151 2.58516C10.5015 2.59157 11.3109 2.74041 11.9868 3.01867C11.6138 3.14986 11.0446 3.28761 10.4182 3.21633C10.3234 3.20555 10.2315 3.25333 10.1859 3.33714C10.1402 3.42096 10.15 3.52408 10.2105 3.5979C10.4455 3.88428 10.9686 4.57548 11.2437 5.12102C10.67 4.83717 9.71982 4.33091 9.0254 3.77831C8.96221 3.72799 8.87755 3.71384 8.80146 3.74068C8.7253 3.76756 8.66836 3.83175 8.65074 3.91053C8.55742 4.32769 8.28701 5.36031 7.99635 5.93257C7.70569 5.36031 7.43528 4.32769 7.34196 3.91053C7.32434 3.83175 7.26737 3.76756 7.19124 3.74068C7.11508 3.71381 7.03049 3.72806 6.9673 3.77828C6.27272 4.33085 5.32264 4.83708 4.749 5.12096C5.0242 4.57539 5.54724 3.88425 5.78221 3.59787C5.84274 3.52408 5.85253 3.42093 5.80687 3.33711C5.76124 3.25327 5.66924 3.20548 5.57449 3.2163C4.94773 3.28774 4.37803 3.14964 4.00521 3.01839C5.23586 2.50972 6.61354 2.55547 7.35587 2.6341C7.32799 2.88454 7.32659 3.05598 7.32659 3.08714C7.32659 3.45458 7.62553 3.75353 7.99297 3.75353C8.36045 3.75353 8.65939 3.45458 8.65939 3.08892C8.6388 2.76001 8.85765 1.50664 9.3636 1.21076C9.66385 0.999035 9.73595 0.582464 9.52422 0.282115C9.31256 -0.01811 8.89599 -0.0901739 8.59558 0.121455C8.06701 0.494119 7.69334 1.09863 7.48499 1.91821C7.46303 2.00465 7.44418 2.08899 7.42787 2.17043C6.54704 2.07515 4.78107 2.01993 3.32804 2.82441C3.25391 2.86545 3.20769 2.94332 3.20719 3.02807C3.20669 3.11279 3.25198 3.19123 3.3256 3.23314C3.34223 3.24261 3.50742 3.33499 3.77655 3.43552C2.25402 4.44095 1.32812 6.14035 1.32812 7.98955C1.32812 9.4242 1.88057 10.7793 2.88369 11.805L4.95916 13.9279C5.00507 13.9749 5.06592 13.9984 5.12676 13.9984C5.18586 13.9984 5.24501 13.9762 5.29061 13.9316C5.38317 13.8411 5.38483 13.6928 5.29436 13.6002L3.21885 11.4773C2.30189 10.5396 1.79688 9.30095 1.79688 7.98955C1.79688 6.16082 2.78772 4.4926 4.3879 3.61418C4.6051 3.66074 4.84698 3.69502 5.10595 3.70306C4.73604 4.19791 4.17481 5.02208 4.11052 5.54431C4.10021 5.62806 4.13571 5.71088 4.20349 5.76116C4.27124 5.81141 4.36078 5.82138 4.43797 5.78728C4.50172 5.7591 5.88821 5.14205 6.96902 4.36419C7.11224 4.92824 7.41515 5.98798 7.77247 6.46211V6.91921C7.77247 7.04865 7.87741 7.15359 8.00685 7.15359C8.13632 7.15359 8.24123 7.04865 8.24123 6.91921V6.44895C8.24123 6.44414 8.24079 6.43945 8.24051 6.43474C8.58899 5.94819 8.88318 4.91758 9.02368 4.36423C10.1043 5.14202 11.491 5.7591 11.5548 5.78728C11.632 5.82144 11.7215 5.81141 11.7892 5.76113C11.857 5.71085 11.8925 5.62803 11.8822 5.54428C11.8179 5.02205 11.2567 4.19791 10.8868 3.70303C11.1456 3.69499 11.3874 3.66071 11.6045 3.61418C12.019 3.84206 12.3991 4.12641 12.7345 4.46179C13.6768 5.40387 14.1958 6.65671 14.1958 7.98955C14.1958 9.30098 13.6909 10.5396 12.7738 11.4773L9.37944 14.9493C9.01249 15.3246 8.5213 15.5313 7.99638 15.5313C7.47143 15.5313 6.98024 15.3246 6.61329 14.9493L6.06147 14.3849C5.971 14.2923 5.82256 14.2906 5.73002 14.3811C5.63746 14.4716 5.6358 14.62 5.72627 14.7126L6.2781 15.277C6.73398 15.7432 7.34421 16 7.99635 16C8.64849 16 9.25872 15.7432 9.7146 15.277L13.109 11.805C14.1122 10.7792 14.6646 9.4242 14.6646 7.98952C14.6646 6.53152 14.0968 5.16093 13.0659 4.13035ZM8.86558 0.504682C8.90015 0.480337 8.9399 0.468618 8.97927 0.468618C9.04143 0.468618 9.10265 0.497775 9.14109 0.552276C9.2039 0.64134 9.18253 0.764905 9.0935 0.827688C8.72043 1.09069 8.45523 1.55289 8.30529 2.20143C8.19376 2.68382 8.19063 3.08326 8.19063 3.08714C8.19063 3.19611 8.10194 3.28477 7.99297 3.28477C7.884 3.28477 7.79534 3.19611 7.79534 3.08714C7.79534 3.06726 7.79697 2.5936 7.93932 2.03374C8.06304 1.54686 8.32423 0.886345 8.86558 0.504682Z" fill="white"/>
<path d="M4.0048 7.15392C4.01464 7.15392 4.02461 7.15329 4.03464 7.15201C4.16305 7.1357 4.25393 7.01839 4.23761 6.88995L4.17786 6.4197C4.16155 6.29129 4.04421 6.20045 3.9158 6.21673C3.78739 6.23304 3.69652 6.35036 3.71283 6.47879L3.77258 6.94904C3.78761 7.06745 3.88852 7.15392 4.0048 7.15392Z" fill="white"/>
<path d="M5.97656 6.21484C5.84712 6.21484 5.74219 6.31978 5.74219 6.44922V6.91947C5.74219 7.04891 5.84712 7.15384 5.97656 7.15384C6.106 7.15384 6.21094 7.04891 6.21094 6.91947V6.44922C6.21094 6.31978 6.106 6.21484 5.97656 6.21484Z" fill="white"/>
<path d="M10.0391 7.15384C10.1685 7.15384 10.2734 7.04891 10.2734 6.91947V6.44922C10.2734 6.31978 10.1685 6.21484 10.0391 6.21484C9.90959 6.21484 9.80469 6.31978 9.80469 6.44922V6.91947C9.80469 7.04891 9.90959 7.15384 10.0391 7.15384Z" fill="white"/>
<path d="M12.0081 7.15385C12.1244 7.15385 12.2253 7.06735 12.2404 6.94898L12.3001 6.47873C12.3164 6.35032 12.2255 6.23301 12.0971 6.21669C11.9687 6.2006 11.8514 6.29126 11.835 6.41969L11.7753 6.88994C11.759 7.01835 11.8499 7.13566 11.9783 7.15198C11.9883 7.15323 11.9983 7.15385 12.0081 7.15385Z" fill="white"/>
<path d="M2.87024 8.04034C2.74309 8.06456 2.65965 8.18731 2.68387 8.31443L2.77346 8.78468C2.79487 8.89703 2.89315 8.97525 3.00343 8.97525C3.01796 8.97525 3.03274 8.9739 3.04756 8.97106C3.17471 8.94684 3.25815 8.82409 3.23393 8.69697L3.14434 8.22672C3.12012 8.09956 2.99746 8.01603 2.87024 8.04034Z" fill="white"/>
<path d="M5.03468 8.97525C5.04921 8.97525 5.06399 8.9739 5.07881 8.97106C5.20596 8.94684 5.2894 8.82409 5.26518 8.69697L5.17559 8.22672C5.15137 8.09956 5.02862 8.01603 4.90149 8.04034C4.77434 8.06456 4.6909 8.18731 4.71512 8.31443L4.80471 8.78468C4.82612 8.89703 4.92437 8.97525 5.03468 8.97525Z" fill="white"/>
<path d="M6.97656 8.03613C6.84712 8.03613 6.74219 8.14107 6.74219 8.27051V8.74076C6.74219 8.8702 6.84712 8.97513 6.97656 8.97513C7.106 8.97513 7.21094 8.8702 7.21094 8.74076V8.27051C7.21094 8.14107 7.106 8.03613 6.97656 8.03613Z" fill="white"/>
<path d="M9.01562 8.97513C9.14509 8.97513 9.25 8.8702 9.25 8.74076V8.27051C9.25 8.14107 9.14509 8.03613 9.01562 8.03613C8.88616 8.03613 8.78125 8.14107 8.78125 8.27051V8.74076C8.78125 8.8702 8.88616 8.97513 9.01562 8.97513Z" fill="white"/>
<path d="M10.9535 8.97521C11.0637 8.97521 11.162 8.89699 11.1834 8.78465L11.273 8.3144C11.2972 8.18724 11.2138 8.06453 11.0866 8.04031C10.9597 8.01612 10.8368 8.09953 10.8125 8.22668L10.7229 8.69693C10.6987 8.82409 10.7822 8.94681 10.9093 8.97103C10.9242 8.97387 10.9389 8.97521 10.9535 8.97521Z" fill="white"/>
<path d="M12.9406 8.97103C12.9554 8.97384 12.9702 8.97521 12.9847 8.97521C13.095 8.97521 13.1933 8.89699 13.2147 8.78465L13.3042 8.3144C13.3285 8.18724 13.245 8.06453 13.1179 8.04031C12.991 8.01612 12.868 8.09953 12.8438 8.22668L12.7542 8.69693C12.73 8.82409 12.8134 8.94681 12.9406 8.97103Z" fill="white"/>
<path d="M3.72198 10.1638L3.87133 10.634C3.90301 10.7338 3.99523 10.7975 4.09464 10.7975C4.11814 10.7975 4.14205 10.794 4.16564 10.7865C4.28901 10.7473 4.35726 10.6155 4.31808 10.4921L4.16876 10.0219C4.12958 9.89852 3.9978 9.83027 3.87445 9.86946C3.75108 9.90865 3.68283 10.0404 3.72198 10.1638Z" fill="white"/>
<path d="M5.9189 9.86567C5.79343 9.89754 5.71759 10.0251 5.74946 10.1505L5.86893 10.6208C5.89587 10.7269 5.99124 10.7975 6.09593 10.7975C6.11502 10.7975 6.13443 10.7951 6.15381 10.7902C6.27927 10.7584 6.35512 10.6308 6.32324 10.5054L6.20377 10.0351C6.1719 9.9097 6.04443 9.83379 5.9189 9.86567Z" fill="white"/>
<path d="M8.00781 10.7974C8.13728 10.7974 8.24219 10.6925 8.24219 10.563V10.0928C8.24219 9.96334 8.13728 9.8584 8.00781 9.8584C7.87837 9.8584 7.77344 9.96334 7.77344 10.0928V10.563C7.77344 10.6925 7.87837 10.7974 8.00781 10.7974Z" fill="white"/>
<path d="M9.86422 10.7902C9.8836 10.7952 9.90297 10.7975 9.92213 10.7975C10.0268 10.7975 10.1221 10.7269 10.1491 10.6208L10.2686 10.1506C10.3005 10.0251 10.2246 9.89756 10.0991 9.86568C9.97378 9.83378 9.84613 9.90965 9.81425 10.0351L9.69478 10.5054C9.66288 10.6308 9.73875 10.7584 9.86422 10.7902Z" fill="white"/>
<path d="M11.851 10.7865C11.8746 10.794 11.8985 10.7975 11.922 10.7975C12.0214 10.7975 12.1137 10.7338 12.1453 10.634L12.2946 10.1638C12.3338 10.0404 12.2655 9.90861 12.1422 9.86945C12.0188 9.83027 11.887 9.89858 11.8478 10.0219L11.6985 10.4921C11.6594 10.6155 11.7277 10.7473 11.851 10.7865Z" fill="white"/>
<path d="M4.97534 12.4905C5.01669 12.5719 5.09903 12.6187 5.18447 12.6187C5.22019 12.6187 5.25644 12.6106 5.29047 12.5933C5.40584 12.5347 5.45187 12.3936 5.39325 12.2782L5.15431 11.8079C5.09569 11.6926 4.95469 11.6466 4.83919 11.7051C4.72381 11.7637 4.67778 11.9048 4.7364 12.0202L4.97534 12.4905Z" fill="white"/>
<path d="M6.94705 11.6816C6.81864 11.6979 6.72777 11.8152 6.74408 11.9437L6.80383 12.4139C6.81886 12.5323 6.91977 12.6188 7.03605 12.6188C7.04589 12.6188 7.05586 12.6182 7.06589 12.6169C7.1943 12.6006 7.28518 12.4832 7.26886 12.3548L7.20911 11.8846C7.19277 11.7562 7.07546 11.6652 6.94705 11.6816Z" fill="white"/>
<path d="M8.92361 12.6168C8.93364 12.6181 8.94361 12.6187 8.95346 12.6187C9.06974 12.6187 9.17061 12.5322 9.18567 12.4139L9.24543 11.9436C9.26171 11.8152 9.17086 11.6979 9.04246 11.6816C8.91414 11.6653 8.79674 11.7561 8.78039 11.8845L8.72064 12.3548C8.70433 12.4832 8.79518 12.6005 8.92361 12.6168Z" fill="white"/>
<path d="M10.6986 12.5933C10.7326 12.6106 10.7688 12.6188 10.8046 12.6188C10.89 12.6188 10.9723 12.5719 11.0137 12.4905L11.2526 12.0203C11.3113 11.9049 11.2652 11.7638 11.1498 11.7052C11.0345 11.6465 10.8934 11.6925 10.8347 11.808L10.5958 12.2782C10.5372 12.3936 10.5832 12.5347 10.6986 12.5933Z" fill="white"/>
<path d="M7.77344 14.2056C7.77344 14.335 7.87837 14.44 8.00781 14.44C8.13728 14.44 8.24219 14.335 8.24219 14.2056V13.7354C8.24219 13.6059 8.13728 13.501 8.00781 13.501C7.87837 13.501 7.77344 13.6059 7.77344 13.7354V14.2056Z" fill="white"/>

</svg>
