<svg width="53" height="46" viewBox="0 0 53 46" fill="none" xmlns="http://www.w3.org/2000/svg">
<path d="M23.6977 29.451C23.6977 30.5727 25.6103 31.4852 26.7321 31.4852C27.8538 31.4852 29.7664 30.5727 29.7664 29.451L29.7744 20.8469C29.775 20.295 30.2225 19.8478 30.7744 19.8478H30.8449C31.3972 19.8478 31.8449 20.2955 31.8449 20.8478V21.0252C31.8449 22.1386 33.3901 23 34.5034 23H34.5335C35.6469 23 36.9134 22.1386 36.9134 21.0252V17.7995C36.9134 17.2472 37.3611 16.7995 37.9134 16.7995H42.4646C43.0811 16.7995 43.5507 16.2471 43.4516 15.6386L42.9656 12.6572C42.8867 12.1734 42.4688 11.8181 41.9786 11.8181H28.6167C29.5222 11.1 30.1047 9.99134 30.1047 8.7486C30.1047 7.34044 29.3576 6.10383 28.2392 5.41343C27.9434 5.23085 27.7315 4.92401 27.7315 4.57643C27.7315 3.74551 28.4074 3.0695 29.2385 3.0695H30.842C31.3943 3.0695 31.842 2.62179 31.842 2.0695V1C31.842 0.447716 31.3943 0 30.842 0H29.2385C26.7148 0.000102317 24.6619 2.05299 24.6619 4.57643C24.6619 4.91866 24.4525 5.22055 24.16 5.39822C23.0282 6.08571 22.2705 7.33035 22.2705 8.7486C22.2705 9.99134 22.853 11.1 23.7585 11.8181H10.3966C9.90637 11.8181 9.48844 12.1734 9.40958 12.6572L8.9236 15.6386C8.82442 16.2471 9.29408 16.7995 9.91058 16.7995H22.6977C23.25 16.7995 23.6977 17.2472 23.6977 17.7995V29.451Z" fill="#FF7C1B"/>
<path d="M44.2753 19.7083C44.1964 19.2245 43.7785 18.8691 43.2883 18.8691H39.9803C39.428 18.8691 38.9803 19.3169 38.9803 19.8691V20.0253C38.9803 22.8313 36.6974 25.114 33.8916 25.114H33.8615C33.6729 25.114 33.4867 25.1037 33.3034 25.0835C32.587 25.0046 31.8333 25.4978 31.8333 26.2185V28.4511C31.8333 31.2653 29.5437 33.5549 26.7295 33.5549C23.9153 33.5549 21.6256 31.2653 21.6256 28.4511V19.8691C21.6256 19.3169 21.1779 18.8691 20.6256 18.8691H9.08164C8.59145 18.8691 8.17352 19.2245 8.09466 19.7083L4.96266 38.9228C4.86348 39.5313 5.33314 40.0837 5.94964 40.0837H46.4203C47.0368 40.0837 47.5065 39.5313 47.4073 38.9228L44.2753 19.7083Z" fill="#FF7C1B"/>
<path d="M2.41587 42.0939C1.52473 42.0939 1.07867 43.1716 1.7091 43.8014L3.617 45.7074C3.80451 45.8948 4.05871 46 4.32376 46H48.0625C48.3275 46 48.5817 45.8948 48.7692 45.7074L50.6771 43.8014C51.3075 43.1716 50.8615 42.0939 49.9703 42.0939H2.41587Z" fill="#FF7C1B"/>
</svg>
