<svg width="270" height="104" viewBox="0 0 270 104" fill="none" xmlns="http://www.w3.org/2000/svg">
<g clip-path="url(#clip0_204_5658)">
<rect width="270" height="104" fill="#222222"/>
<path d="M108.632 45.8362L107.625 36.4692L106.536 45.8362H108.632ZM111.285 34.1592L114.339 54.0362H109.588L109.056 49.1792H106.112L105.583 54.0362H100.938L103.911 34.1592H111.285Z" fill="white"/>
<path d="M122.752 34.1592L126.336 49.8692L126.07 34.1592H130.287V54.0362H123.787L120.153 37.8762L120.445 54.0362H116.227V34.1592H122.752Z" fill="white"/>
<path d="M142.917 34.1592V37.6642H139.784V54.0362H135.139V37.6642H132.008V34.1592H142.917Z" fill="white"/>
<path d="M149.37 34.1592H144.727V54.0362H149.37V34.1592Z" fill="white"/>
<path d="M63.5245 43.8037L64.1715 52.4187L65.1405 43.8037H68.3455L69.3135 52.4187L69.9645 43.8037H72.2975L71.0825 54.1547H67.6825L66.7425 45.4227L65.8175 54.1547H62.4145L61.1875 43.8037H63.5245Z" fill="white"/>
<path d="M75.1495 43.8037L75.7955 52.4187L76.7655 43.8037H79.9705L80.9405 52.4187L81.5855 43.8037H83.9245L82.7065 54.1547H79.3075L78.3685 45.4227L77.4425 54.1547H74.0415L72.8125 43.8037H75.1495Z" fill="white"/>
<path d="M86.7687 43.8037L87.4137 52.4187L88.3847 43.8037H91.5897L92.5567 52.4187L93.2037 43.8037H95.5427L94.3257 54.1547H90.9227L89.9827 45.4227L89.0597 54.1547H85.6597L84.4297 43.8037H86.7687Z" fill="white"/>
<path d="M98.6504 52.0264H96.5234V54.1554H98.6504V52.0264Z" fill="white"/>
<path d="M155.476 41.1953L156.572 52.4353L157.707 41.1953H160.79L158.971 54.0293H154.19L152.391 41.1953H155.476Z" fill="white"/>
<path d="M164.952 44.226V51.015C164.952 51.734 165.123 51.925 165.758 51.925C166.392 51.925 166.544 51.734 166.544 51.015V44.226C166.544 43.507 166.392 43.299 165.758 43.299C165.123 43.299 164.952 43.491 164.952 44.226ZM169.632 44.637V50.587C169.632 53.653 168.96 54.184 165.758 54.184C162.607 54.184 161.867 53.567 161.867 50.587V44.637C161.867 41.742 162.571 41.04 165.758 41.04C168.892 41.04 169.632 41.742 169.632 44.637Z" fill="white"/>
<path d="M174.34 47.4333H175.065C175.781 47.4333 176.022 47.2633 176.022 46.5063V44.3643C176.022 43.6113 175.781 43.4593 175.065 43.4593H174.34V47.4333ZM171.344 41.1953H174.461C177.716 41.1953 179.02 41.6743 179.02 44.4863V45.9563C179.02 47.4493 178.42 48.1683 176.928 48.4233C178.299 48.6323 179.02 49.4183 179.02 50.7583V54.0293H176.022V50.7733C176.022 49.8473 175.696 49.5913 174.821 49.5913H174.34V54.0293H171.344V41.1953Z" fill="white"/>
<path d="M183.356 51.3896H180.719V54.0296H183.356V51.3896Z" fill="white"/>
<path d="M188.188 47.4333H188.908C189.627 47.4333 189.868 47.2633 189.868 46.5063V44.3643C189.868 43.6113 189.627 43.4593 188.908 43.4593H188.188V47.4333ZM185.188 41.1953H188.305C191.561 41.1953 192.864 41.6743 192.864 44.4863V45.9563C192.864 47.4493 192.263 48.1683 190.772 48.4233C192.147 48.6323 192.864 49.4183 192.864 50.7583V54.0293H189.868V50.7733C189.868 49.8473 189.539 49.5913 188.666 49.5913H188.188V54.0293H185.188V41.1953Z" fill="white"/>
<path d="M197.615 41.1953V50.9793C197.615 51.6983 197.786 51.9253 198.421 51.9253C199.055 51.9253 199.189 51.6983 199.189 50.9793V41.1953H202.068V49.8833C202.068 53.0183 201.655 54.1843 198.333 54.1843C194.992 54.1843 194.617 53.0383 194.617 49.8833V41.1953H197.615Z" fill="white"/>
<path d="M206.284 39.228H206.854C207.142 39.228 207.157 39.14 207.157 38.797C207.157 38.551 207.097 38.477 206.854 38.477H206.284V39.228ZM206.284 40.635H205.547V37.873H206.969C207.61 37.873 207.893 38.058 207.893 38.698C207.893 39.261 207.835 39.453 207.396 39.56V39.589C207.727 39.622 207.893 39.766 207.893 40.079V40.635H207.157V40.178C207.157 39.968 207.076 39.833 206.854 39.833H206.284V40.635Z" fill="white"/>
<path d="M209.289 39.1539H208.957C208.955 40.4109 207.938 41.4279 206.682 41.4299C205.424 41.4279 204.408 40.4109 204.405 39.1539C204.408 37.8969 205.424 36.8799 206.682 36.8779C207.938 36.8799 208.955 37.8969 208.957 39.1539H209.622C209.622 37.5299 208.305 36.2149 206.682 36.2139C205.058 36.2149 203.743 37.5299 203.742 39.1539C203.743 40.7779 205.058 42.0929 206.682 42.0939C208.305 42.0929 209.622 40.7779 209.622 39.1539H209.289Z" fill="white"/>
<path d="M202.525 68.8294L61.5234 68.8324L61.5244 55.5684H202.526L202.525 68.8294Z" fill="white"/>
<path d="M100.956 59.9793L101.657 60.2023C101.549 60.5923 101.37 60.8813 101.121 61.0723C100.871 61.2613 100.554 61.3563 100.17 61.3563C99.6951 61.3563 99.3041 61.1943 98.9981 60.8693C98.6921 60.5453 98.5391 60.1003 98.5391 59.5383C98.5391 58.9423 98.6931 58.4793 99.0001 58.1493C99.3081 57.8203 99.7121 57.6553 100.214 57.6553C100.652 57.6553 101.007 57.7843 101.281 58.0443C101.443 58.1963 101.565 58.4163 101.647 58.7023L100.932 58.8743C100.889 58.6883 100.801 58.5423 100.667 58.4343C100.532 58.3273 100.369 58.2723 100.177 58.2723C99.9121 58.2723 99.6971 58.3683 99.5311 58.5583C99.3661 58.7493 99.2841 59.0573 99.2841 59.4833C99.2841 59.9363 99.3651 60.2583 99.5281 60.4503C99.6901 60.6423 99.9021 60.7393 100.162 60.7393C100.354 60.7393 100.52 60.6773 100.658 60.5553C100.796 60.4333 100.896 60.2413 100.956 59.9793Z" fill="#222222"/>
<path d="M102.752 59.5033C102.752 59.9093 102.846 60.2153 103.033 60.4243C103.22 60.6333 103.458 60.7393 103.746 60.7393C104.034 60.7393 104.271 60.6343 104.455 60.4273C104.64 60.2193 104.732 59.9093 104.732 59.4933C104.732 59.0833 104.643 58.7773 104.463 58.5753C104.283 58.3743 104.044 58.2723 103.746 58.2723C103.448 58.2723 103.208 58.3753 103.026 58.5793C102.844 58.7843 102.752 59.0913 102.752 59.5033ZM102.008 59.5283C102.008 59.1633 102.062 58.8573 102.171 58.6103C102.253 58.4273 102.364 58.2643 102.505 58.1193C102.646 57.9733 102.8 57.8663 102.967 57.7973C103.19 57.7023 103.447 57.6553 103.739 57.6553C104.266 57.6553 104.688 57.8193 105.005 58.1453C105.321 58.4733 105.479 58.9283 105.479 59.5103C105.479 60.0893 105.322 60.5403 105.008 60.8673C104.694 61.1933 104.274 61.3563 103.748 61.3563C103.216 61.3563 102.793 61.1943 102.479 60.8693C102.165 60.5453 102.008 60.0973 102.008 59.5283Z" fill="#222222"/>
<path d="M106.769 59.7348V60.6918H107.438C107.699 60.6918 107.864 60.6838 107.934 60.6708C108.041 60.6508 108.129 60.6028 108.196 60.5268C108.264 60.4518 108.298 60.3498 108.298 60.2228C108.298 60.1158 108.272 60.0238 108.22 59.9498C108.167 59.8758 108.092 59.8208 107.994 59.7858C107.895 59.7528 107.682 59.7348 107.353 59.7348H106.769ZM106.769 58.3108V59.1388H107.243C107.525 59.1388 107.7 59.1348 107.768 59.1278C107.892 59.1118 107.989 59.0698 108.06 58.9988C108.131 58.9278 108.166 58.8348 108.166 58.7188C108.166 58.6078 108.136 58.5178 108.074 58.4498C108.014 58.3808 107.923 58.3388 107.802 58.3238C107.73 58.3148 107.525 58.3108 107.185 58.3108H106.769ZM106.047 57.7148H107.477C107.761 57.7148 107.972 57.7268 108.111 57.7518C108.25 57.7748 108.375 57.8248 108.484 57.8988C108.595 57.9728 108.686 58.0738 108.759 58.1978C108.833 58.3228 108.869 58.4618 108.869 58.6168C108.869 58.7838 108.824 58.9378 108.733 59.0788C108.644 59.2178 108.521 59.3228 108.366 59.3928C108.584 59.4568 108.752 59.5648 108.869 59.7168C108.986 59.8708 109.045 60.0508 109.045 60.2568C109.045 60.4208 109.007 60.5788 108.932 60.7318C108.855 60.8858 108.752 61.0078 108.621 61.1008C108.49 61.1928 108.329 61.2498 108.137 61.2698C108.016 61.2838 107.726 61.2918 107.265 61.2958H106.047V57.7148Z" fill="#222222"/>
<path d="M110.379 58.3208V59.3368H110.774C111.059 59.3368 111.249 59.3188 111.346 59.2808C111.442 59.2428 111.517 59.1838 111.571 59.1048C111.626 59.0258 111.653 58.9318 111.653 58.8268C111.653 58.6958 111.615 58.5888 111.539 58.5048C111.462 58.4208 111.365 58.3668 111.248 58.3458C111.162 58.3298 110.988 58.3208 110.728 58.3208H110.379ZM109.656 61.2958V57.7148H110.816C111.255 57.7148 111.542 57.7338 111.675 57.7698C111.88 57.8228 112.052 57.9398 112.19 58.1198C112.329 58.2988 112.398 58.5318 112.398 58.8168C112.398 59.0368 112.358 59.2208 112.278 59.3718C112.199 59.5208 112.097 59.6378 111.975 59.7238C111.852 59.8088 111.727 59.8658 111.6 59.8928C111.427 59.9278 111.177 59.9448 110.85 59.9448H110.379V61.2958H109.656Z" fill="#222222"/>
<path d="M112.992 61.2958V57.7148H115.646V58.3208H113.715V59.1148H115.512V59.7168H113.715V60.6918H115.714V61.2958H112.992Z" fill="#222222"/>
<path d="M116.312 61.2958V57.7148H117.395L118.043 60.1568L118.685 57.7148H119.771V61.2958H119.098V58.4768L118.389 61.2958H117.693L116.985 58.4768V61.2958H116.312Z" fill="#222222"/>
<path d="M120.492 61.2958V57.7148H123.146V58.3208H121.215V59.1148H123.012V59.7168H121.215V60.6918H123.214V61.2958H120.492Z" fill="#222222"/>
<path d="M123.828 61.2958V57.7148H124.55V59.1248H125.966V57.7148H126.689V61.2958H125.966V59.7298H124.55V61.2958H123.828Z" fill="#222222"/>
<path d="M127.438 61.2958V57.7148H128.16V59.1248H129.576V57.7148H130.299V61.2958H129.576V59.7298H128.16V61.2958H127.438Z" fill="#222222"/>
<path d="M134.467 57.7148H135.189V61.2958H134.467V57.7148ZM131.786 60.6938H132.492C132.716 60.6938 132.873 60.6828 132.962 60.6618C133.05 60.6388 133.129 60.5888 133.198 60.5108C133.267 60.4328 133.302 60.3388 133.302 60.2248C133.302 60.0658 133.245 59.9458 133.133 59.8668C133.02 59.7878 132.815 59.7468 132.521 59.7468H131.786V60.6938ZM131.062 57.7148H131.786V59.1468H132.753C133.007 59.1468 133.226 59.1808 133.408 59.2508C133.592 59.3188 133.744 59.4428 133.866 59.6218C133.988 59.7988 134.049 60.0048 134.049 60.2348C134.049 60.4778 133.986 60.6858 133.859 60.8618C133.732 61.0368 133.591 61.1528 133.435 61.2098C133.28 61.2658 133.052 61.2958 132.753 61.2958H131.062V57.7148Z" fill="#222222"/>
<path d="M135.945 61.2958V57.7148H138.598V58.3208H136.668V59.1148H138.464V59.7168H136.668V60.6918H138.667V61.2958H135.945Z" fill="#222222"/>
<path d="M141.387 58.3208V59.3368H141.784C142.068 59.3368 142.258 59.3188 142.354 59.2808C142.451 59.2428 142.526 59.1838 142.58 59.1048C142.635 59.0258 142.663 58.9318 142.663 58.8268C142.663 58.6958 142.623 58.5888 142.547 58.5048C142.471 58.4208 142.373 58.3668 142.256 58.3458C142.17 58.3298 141.997 58.3208 141.737 58.3208H141.387ZM140.664 61.2958V57.7148H141.825C142.264 57.7148 142.551 57.7338 142.684 57.7698C142.889 57.8228 143.061 57.9398 143.2 58.1198C143.337 58.2988 143.407 58.5318 143.407 58.8168C143.407 59.0368 143.367 59.2208 143.288 59.3718C143.207 59.5208 143.106 59.6378 142.983 59.7238C142.86 59.8088 142.735 59.8658 142.608 59.8928C142.436 59.9278 142.186 59.9448 141.859 59.9448H141.387V61.2958H140.664Z" fill="#222222"/>
<path d="M144 61.2958V57.7148H146.654V58.3208H144.723V59.1148H146.52V59.7168H144.723V60.6918H146.722V61.2958H144Z" fill="#222222"/>
<path d="M147.344 57.7148H148.067V60.6938H149.102V57.7148H149.822V60.6938H150.892V57.7148H151.612L151.617 61.2978L147.344 61.2958V57.7148Z" fill="#222222"/>
<path d="M152.359 61.2958V57.7148H155.012V58.3208H153.081V59.1148H154.878V59.7168H153.081V60.6918H155.081V61.2958H152.359Z" fill="#222222"/>
<path d="M155.695 61.2958V57.7148H156.417V59.1248H157.833V57.7148H158.556V61.2958H157.833V59.7298H156.417V61.2958H155.695Z" fill="#222222"/>
<path d="M159.312 57.7148H159.989V60.0978L161.44 57.7148H162.16V61.2958H161.483V58.9588L160.036 61.2958H159.312V57.7148Z" fill="#222222"/>
<path d="M165.041 58.3208H164.478C164.192 58.3208 164.002 58.3278 163.913 58.3398C163.823 58.3538 163.745 58.3978 163.68 58.4728C163.615 58.5478 163.582 58.6448 163.582 58.7658C163.582 58.8908 163.614 58.9908 163.676 59.0648C163.739 59.1388 163.819 59.1838 163.915 59.2028C164.012 59.2208 164.209 59.2288 164.507 59.2288H165.041V58.3208ZM165.041 61.2958V59.8008H164.895C164.667 59.8008 164.506 59.8348 164.413 59.9028C164.32 59.9708 164.16 60.1758 163.934 60.5158L163.411 61.2958H162.547L162.984 60.5958C163.157 60.3198 163.293 60.1258 163.397 60.0138C163.499 59.9028 163.627 59.8028 163.782 59.7148C163.449 59.6628 163.207 59.5478 163.059 59.3678C162.912 59.1878 162.837 58.9718 162.837 58.7208C162.837 58.5038 162.893 58.3098 163.002 58.1418C163.112 57.9728 163.256 57.8598 163.436 57.8018C163.617 57.7448 163.885 57.7148 164.244 57.7148H165.764V61.2958H165.041Z" fill="#222222"/>
<path d="M75.7378 64.0248C75.7378 65.1118 75.6388 65.9048 75.4418 66.4028H76.8018V64.0248H75.7378ZM75.0488 63.4238H77.5228V66.4028H77.8368V67.7848H77.2368V67.0038H74.9828V67.7848H74.3828V66.4028H74.6858C74.8328 66.0958 74.9308 65.7418 74.9788 65.3368C75.0258 64.9318 75.0488 64.4218 75.0488 63.8028V63.4238Z" fill="#222222"/>
<path d="M78.5811 63.4238H81.0881V67.0038H80.3651V64.0298H79.2891V65.5578C79.2891 65.9968 79.2741 66.3008 79.2451 66.4748C79.2151 66.6488 79.1441 66.7838 79.0311 66.8798C78.9181 66.9768 78.7411 67.0258 78.5001 67.0258C78.4161 67.0258 78.2621 67.0168 78.0391 67.0008V66.4418L78.2001 66.4438C78.3511 66.4438 78.4531 66.4238 78.5051 66.3828C78.5571 66.3418 78.5831 66.2428 78.5831 66.0828L78.5811 65.4668V63.4238Z" fill="#222222"/>
<path d="M83.9726 64.0298H83.4086C83.1216 64.0298 82.9336 64.0358 82.8436 64.0488C82.7526 64.0628 82.6746 64.1058 82.6096 64.1808C82.5446 64.2558 82.5126 64.3538 82.5126 64.4738C82.5126 64.5998 82.5436 64.6998 82.6056 64.7738C82.6686 64.8468 82.7486 64.8928 82.8456 64.9108C82.9426 64.9288 83.1396 64.9378 83.4376 64.9378H83.9726V64.0298ZM83.9726 67.0038V65.5088H83.8256C83.5976 65.5088 83.4366 65.5438 83.3436 65.6118C83.2506 65.6798 83.0896 65.8838 82.8636 66.2248L82.3416 67.0038H81.4766L81.9146 66.3048C82.0866 66.0278 82.2246 65.8348 82.3266 65.7228C82.4296 65.6118 82.5576 65.5118 82.7126 65.4238C82.3786 65.3718 82.1376 65.2558 81.9896 65.0768C81.8416 64.8958 81.7676 64.6798 81.7676 64.4298C81.7676 64.2118 81.8226 64.0178 81.9326 63.8498C82.0426 63.6818 82.1866 63.5688 82.3666 63.5098C82.5466 63.4538 82.8156 63.4238 83.1736 63.4238H84.6946V67.0038H83.9726Z" fill="#222222"/>
<path d="M87.5355 64.0298V65.0458H87.9315C88.2155 65.0458 88.4065 65.0268 88.5025 64.9888C88.5985 64.9518 88.6735 64.8928 88.7285 64.8128C88.7825 64.7338 88.8105 64.6408 88.8105 64.5358C88.8105 64.4048 88.7715 64.2978 88.6955 64.2138C88.6185 64.1288 88.5215 64.0748 88.4045 64.0538C88.3185 64.0378 88.1455 64.0298 87.8845 64.0298H87.5355ZM86.8125 67.0038V63.4238H87.9725C88.4125 63.4238 88.6985 63.4418 88.8315 63.4778C89.0375 63.5318 89.2085 63.6488 89.3475 63.8288C89.4855 64.0078 89.5545 64.2408 89.5545 64.5258C89.5545 64.7448 89.5145 64.9298 89.4355 65.0798C89.3555 65.2288 89.2535 65.3458 89.1315 65.4318C89.0085 65.5178 88.8835 65.5748 88.7565 65.6018C88.5835 65.6358 88.3335 65.6528 88.0065 65.6528H87.5355V67.0038H86.8125Z" fill="#222222"/>
<path d="M94.5464 67.0038V64.0298H93.4844V63.4238H96.3284V64.0298H95.2694V67.0038H94.5464Z" fill="#222222"/>
<path d="M96.7969 67.0038V63.4238H99.4509V64.0298H97.5199V64.8228H99.3169V65.4258H97.5199V66.4008H99.5189V67.0038H96.7969Z" fill="#222222"/>
<path d="M90.2188 67.0038V63.4238H92.8727V64.0298H90.9408V64.8228H92.7377V65.4258H90.9408V66.4008H92.9408V67.0038H90.2188Z" fill="#222222"/>
<path d="M101.997 62.5342H102.331C102.311 62.7552 102.234 62.9282 102.098 63.0552C101.962 63.1802 101.786 63.2442 101.569 63.2442C101.353 63.2442 101.177 63.1802 101.041 63.0552C100.905 62.9282 100.827 62.7552 100.808 62.5342H101.142C101.153 62.6492 101.194 62.7372 101.264 62.7962C101.334 62.8552 101.436 62.8852 101.569 62.8852C101.703 62.8852 101.805 62.8552 101.875 62.7962C101.944 62.7372 101.985 62.6492 101.997 62.5342ZM100.141 63.4242H100.817V65.8072L102.268 63.4242H102.988V67.0042H102.311V64.6672L100.864 67.0042H100.141V63.4242Z" fill="#222222"/>
<path d="M103.979 63.4238H106.487V67.0038H105.764V64.0298H104.688V65.5578C104.688 65.9968 104.674 66.3008 104.645 66.4748C104.615 66.6488 104.544 66.7838 104.431 66.8798C104.318 66.9768 104.14 67.0258 103.899 67.0258C103.814 67.0258 103.662 67.0168 103.438 67.0008V66.4418L103.599 66.4438C103.75 66.4438 103.852 66.4238 103.904 66.3828C103.956 66.3418 103.982 66.2428 103.982 66.0828L103.979 65.4668V63.4238Z" fill="#222222"/>
<path d="M109.127 65.5878L108.634 64.2588L108.151 65.5878H109.127ZM110.458 67.0038H109.672L109.359 66.1898H107.929L107.633 67.0038H106.867L108.261 63.4238H109.025L110.458 67.0038Z" fill="#222222"/>
<path d="M112.242 63.4238H112.918V65.8068L114.369 63.4238H115.089V67.0038H114.413V64.6668L112.965 67.0038H112.242V63.4238Z" fill="#222222"/>
<path d="M118.023 67.0038V64.0298H116.961V63.4238H119.805V64.0298H118.746V67.0038H118.023Z" fill="#222222"/>
<path d="M120.744 65.2123C120.744 65.6173 120.838 65.9243 121.025 66.1333C121.212 66.3423 121.45 66.4473 121.738 66.4473C122.026 66.4473 122.262 66.3423 122.447 66.1353C122.632 65.9283 122.724 65.6173 122.724 65.2023C122.724 64.7923 122.634 64.4853 122.454 64.2843C122.274 64.0833 122.036 63.9813 121.738 63.9813C121.44 63.9813 121.2 64.0833 121.018 64.2883C120.835 64.4923 120.744 64.7993 120.744 65.2123ZM120 65.2363C120 64.8723 120.054 64.5653 120.163 64.3183C120.245 64.1353 120.355 63.9723 120.496 63.8273C120.637 63.6823 120.791 63.5753 120.959 63.5053C121.182 63.4113 121.439 63.3643 121.73 63.3643C122.258 63.3643 122.68 63.5273 122.996 63.8543C123.313 64.1813 123.471 64.6363 123.471 65.2193C123.471 65.7973 123.314 66.2493 123 66.5753C122.686 66.9013 122.266 67.0653 121.74 67.0653C121.208 67.0653 120.785 66.9033 120.471 66.5773C120.157 66.2533 120 65.8053 120 65.2363Z" fill="#222222"/>
<path d="M124.762 64.0298V65.0458H125.157C125.442 65.0458 125.632 65.0268 125.729 64.9888C125.825 64.9518 125.9 64.8928 125.954 64.8128C126.009 64.7338 126.036 64.6408 126.036 64.5358C126.036 64.4048 125.998 64.2978 125.921 64.2138C125.845 64.1288 125.748 64.0748 125.631 64.0538C125.544 64.0378 125.371 64.0298 125.111 64.0298H124.762ZM124.039 67.0038V63.4238H125.199C125.638 63.4238 125.925 63.4418 126.058 63.4778C126.263 63.5318 126.435 63.6488 126.573 63.8288C126.711 64.0078 126.781 64.2408 126.781 64.5258C126.781 64.7448 126.741 64.9298 126.661 65.0798C126.582 65.2288 126.48 65.3458 126.358 65.4318C126.234 65.5178 126.109 65.5748 125.983 65.6018C125.81 65.6358 125.56 65.6528 125.233 65.6528H124.762V67.0038H124.039Z" fill="#222222"/>
<path d="M127.406 63.4238H129.83V64.0248H128.128V67.0038H127.406V63.4238Z" fill="#222222"/>
<path d="M130.737 65.2123C130.737 65.6173 130.83 65.9243 131.018 66.1333C131.205 66.3423 131.442 66.4473 131.73 66.4473C132.018 66.4473 132.255 66.3423 132.439 66.1353C132.625 65.9283 132.717 65.6173 132.717 65.2023C132.717 64.7923 132.627 64.4853 132.447 64.2843C132.267 64.0833 132.028 63.9813 131.73 63.9813C131.433 63.9813 131.192 64.0833 131.01 64.2883C130.828 64.4923 130.737 64.7993 130.737 65.2123ZM129.992 65.2363C129.992 64.8723 130.047 64.5653 130.156 64.3183C130.237 64.1353 130.348 63.9723 130.489 63.8273C130.63 63.6823 130.784 63.5753 130.952 63.5053C131.175 63.4113 131.432 63.3643 131.723 63.3643C132.25 63.3643 132.672 63.5273 132.989 63.8543C133.306 64.1813 133.464 64.6363 133.464 65.2193C133.464 65.7973 133.307 66.2493 132.993 66.5753C132.679 66.9013 132.259 67.0653 131.733 67.0653C131.201 67.0653 130.777 66.9033 130.463 66.5773C130.149 66.2533 129.992 65.8053 129.992 65.2363Z" fill="#222222"/>
<path d="M134.754 65.4438V66.4008H135.423C135.683 66.4008 135.849 66.3928 135.918 66.3788C136.026 66.3588 136.113 66.3108 136.181 66.2348C136.248 66.1608 136.283 66.0588 136.283 65.9318C136.283 65.8248 136.256 65.7328 136.205 65.6588C136.152 65.5838 136.077 65.5288 135.978 65.4948C135.88 65.4608 135.665 65.4438 135.337 65.4438H134.754ZM134.754 64.0198V64.8478H135.227C135.509 64.8478 135.684 64.8438 135.752 64.8358C135.876 64.8208 135.974 64.7778 136.044 64.7078C136.115 64.6368 136.15 64.5438 136.15 64.4278C136.15 64.3168 136.121 64.2268 136.058 64.1588C135.998 64.0888 135.908 64.0478 135.787 64.0318C135.714 64.0238 135.509 64.0198 135.169 64.0198H134.754ZM134.031 63.4238H135.462C135.746 63.4238 135.956 63.4358 136.095 63.4598C136.234 63.4828 136.359 63.5328 136.468 63.6078C136.58 63.6818 136.67 63.7818 136.744 63.9068C136.817 64.0318 136.853 64.1708 136.853 64.3248C136.853 64.4928 136.808 64.6468 136.718 64.7868C136.628 64.9258 136.505 65.0318 136.351 65.1018C136.569 65.1648 136.736 65.2738 136.853 65.4258C136.97 65.5788 137.029 65.7588 137.029 65.9648C137.029 66.1288 136.992 66.2878 136.915 66.4398C136.839 66.5938 136.737 66.7168 136.605 66.8088C136.474 66.9008 136.313 66.9578 136.121 66.9788C136.001 66.9928 135.71 67.0008 135.249 67.0038H134.031V63.4238Z" fill="#222222"/>
<path d="M138.111 65.2123C138.111 65.6173 138.204 65.9243 138.392 66.1333C138.579 66.3423 138.817 66.4473 139.105 66.4473C139.393 66.4473 139.629 66.3423 139.814 66.1353C139.999 65.9283 140.091 65.6173 140.091 65.2023C140.091 64.7923 140.001 64.4853 139.822 64.2843C139.642 64.0833 139.403 63.9813 139.105 63.9813C138.807 63.9813 138.567 64.0833 138.384 64.2883C138.203 64.4923 138.111 64.7993 138.111 65.2123ZM137.367 65.2363C137.367 64.8723 137.421 64.5653 137.531 64.3183C137.612 64.1353 137.722 63.9723 137.863 63.8273C138.004 63.6823 138.159 63.5753 138.326 63.5053C138.549 63.4113 138.806 63.3643 139.097 63.3643C139.624 63.3643 140.046 63.5273 140.363 63.8543C140.68 64.1813 140.838 64.6363 140.838 65.2193C140.838 65.7973 140.681 66.2493 140.367 66.5753C140.053 66.9013 139.633 67.0653 139.107 67.0653C138.576 67.0653 138.152 66.9033 137.837 66.5773C137.524 66.2533 137.367 65.8053 137.367 65.2363Z" fill="#222222"/>
<path d="M143.269 62.5342H143.604C143.584 62.7552 143.507 62.9282 143.371 63.0552C143.235 63.1802 143.058 63.2442 142.842 63.2442C142.626 63.2442 142.45 63.1802 142.314 63.0552C142.177 62.9282 142.1 62.7552 142.081 62.5342H142.415C142.426 62.6492 142.467 62.7372 142.537 62.7962C142.607 62.8552 142.708 62.8852 142.842 62.8852C142.976 62.8852 143.078 62.8552 143.148 62.7962C143.217 62.7372 143.258 62.6492 143.269 62.5342ZM141.414 63.4242H142.09V65.8072L143.54 63.4242H144.261V67.0042H143.584V64.6672L142.136 67.0042H141.414V63.4242Z" fill="#222222"/>
<path d="M146.391 67.0038V63.4238H147.114V64.8328H148.53V63.4238H149.252V67.0038H148.53V65.4378H147.114V67.0038H146.391Z" fill="#222222"/>
<path d="M150 67.0038V63.4238H152.654V64.0298H150.722V64.8228H152.519V65.4258H150.722V66.4008H152.722V67.0038H150Z" fill="#222222"/>
<path d="M154.308 64.0248C154.308 65.1118 154.208 65.9048 154.012 66.4028H155.372V64.0248H154.308ZM153.619 63.4238H156.092V66.4028H156.408V67.7848H155.806V67.0038H153.553V67.7848H152.953V66.4028H153.255C153.404 66.0958 153.501 65.7418 153.548 65.3368C153.595 64.9318 153.619 64.4218 153.619 63.8028V63.4238Z" fill="#222222"/>
<path d="M157.621 65.4438V66.4008H158.289C158.549 66.4008 158.714 66.3928 158.785 66.3788C158.892 66.3588 158.98 66.3108 159.046 66.2348C159.115 66.1608 159.148 66.0588 159.148 65.9318C159.148 65.8248 159.123 65.7328 159.07 65.6588C159.018 65.5838 158.943 65.5288 158.845 65.4948C158.746 65.4608 158.533 65.4438 158.204 65.4438H157.621ZM157.621 64.0198V64.8478H158.093C158.376 64.8478 158.55 64.8438 158.619 64.8358C158.742 64.8208 158.839 64.7778 158.91 64.7078C158.982 64.6368 159.017 64.5438 159.017 64.4278C159.017 64.3168 158.986 64.2268 158.925 64.1588C158.865 64.0888 158.773 64.0478 158.653 64.0318C158.581 64.0238 158.376 64.0198 158.035 64.0198H157.621ZM156.898 63.4238H158.328C158.611 63.4238 158.822 63.4358 158.962 63.4598C159.101 63.4828 159.226 63.5328 159.335 63.6078C159.445 63.6818 159.537 63.7818 159.61 63.9068C159.683 64.0318 159.72 64.1708 159.72 64.3248C159.72 64.4928 159.675 64.6468 159.583 64.7868C159.494 64.9258 159.372 65.0318 159.216 65.1018C159.435 65.1648 159.603 65.2738 159.72 65.4258C159.837 65.5788 159.896 65.7588 159.896 65.9648C159.896 66.1288 159.857 66.2878 159.783 66.4398C159.706 66.5938 159.603 66.7168 159.472 66.8088C159.341 66.9008 159.179 66.9578 158.988 66.9788C158.867 66.9928 158.576 67.0008 158.116 67.0038H156.898V63.4238Z" fill="#222222"/>
<path d="M160.516 63.4238H161.193V65.8068L162.643 63.4238H163.364V67.0038H162.687V64.6668L161.239 67.0038H160.516V63.4238Z" fill="#222222"/>
<path d="M166.345 63.4244V64.9484C166.465 64.9384 166.557 64.8934 166.619 64.8134C166.68 64.7344 166.766 64.5514 166.875 64.2664C167.018 63.8944 167.164 63.6574 167.315 63.5534C167.462 63.4534 167.709 63.4034 168.054 63.4034C168.071 63.4034 168.106 63.4014 168.159 63.4004V63.9344L168.054 63.9324C167.908 63.9324 167.8 63.9504 167.732 63.9874C167.663 64.0244 167.608 64.0804 167.566 64.1554C167.524 64.2294 167.461 64.3834 167.377 64.6164C167.334 64.7394 167.286 64.8424 167.235 64.9264C167.184 65.0084 167.093 65.0874 166.963 65.1614C167.123 65.2084 167.256 65.2994 167.362 65.4384C167.467 65.5754 167.582 65.7704 167.707 66.0224L168.196 67.0044H167.346L166.916 66.0794C166.912 66.0654 166.898 66.0404 166.875 66.0034C166.862 65.9784 166.832 65.9234 166.787 65.8354C166.696 65.6634 166.621 65.5544 166.563 65.5064C166.504 65.4604 166.432 65.4364 166.345 65.4364V67.0044H165.639V65.4364C165.557 65.4364 165.485 65.4604 165.424 65.5054C165.365 65.5494 165.289 65.6604 165.2 65.8354C165.15 65.9324 165.12 65.9884 165.11 66.0034C165.095 66.0274 165.081 66.0524 165.069 66.0794L164.639 67.0044H163.789L164.278 66.0224C164.398 65.7804 164.511 65.5874 164.618 65.4444C164.725 65.3024 164.86 65.2084 165.024 65.1614C164.894 65.0874 164.803 65.0094 164.752 64.9264C164.702 64.8444 164.653 64.7414 164.607 64.6164C164.526 64.3874 164.463 64.2364 164.422 64.1594C164.381 64.0834 164.326 64.0264 164.256 63.9894C164.188 63.9514 164.075 63.9324 163.918 63.9324C163.899 63.9324 163.868 63.9334 163.826 63.9344V63.4004C163.879 63.4014 163.914 63.4034 163.93 63.4034C164.281 63.4034 164.53 63.4544 164.678 63.5564C164.825 63.6614 164.968 63.8974 165.11 64.2664C165.221 64.5534 165.307 64.7364 165.368 64.8154C165.428 64.8934 165.519 64.9384 165.639 64.9484V63.4244H166.345Z" fill="#222222"/>
<path d="M168.625 63.4238H169.301V65.8068L170.752 63.4238H171.472V67.0038H170.795V64.6668L169.348 67.0038H168.625V63.4238Z" fill="#222222"/>
<path d="M172.203 67.0038V63.4238H173.285L173.933 65.8658L174.576 63.4238H175.66V67.0038H174.988V64.1858L174.278 67.0038H173.581L172.874 64.1858V67.0038H172.203Z" fill="#222222"/>
<path d="M176.979 65.2123C176.979 65.6173 177.073 65.9243 177.259 66.1333C177.446 66.3423 177.684 66.4473 177.972 66.4473C178.26 66.4473 178.497 66.3423 178.682 66.1353C178.866 65.9283 178.959 65.6173 178.959 65.2023C178.959 64.7923 178.869 64.4853 178.688 64.2843C178.508 64.0833 178.27 63.9813 177.972 63.9813C177.674 63.9813 177.434 64.0833 177.252 64.2883C177.07 64.4923 176.979 64.7993 176.979 65.2123ZM176.234 65.2363C176.234 64.8723 176.289 64.5653 176.397 64.3183C176.479 64.1353 176.59 63.9723 176.731 63.8273C176.872 63.6823 177.026 63.5753 177.194 63.5053C177.417 63.4113 177.673 63.3643 177.965 63.3643C178.493 63.3643 178.915 63.5273 179.231 63.8543C179.547 64.1813 179.706 64.6363 179.706 65.2193C179.706 65.7973 179.548 66.2493 179.235 66.5753C178.92 66.9013 178.501 67.0653 177.975 67.0653C177.442 67.0653 177.019 66.9033 176.706 66.5773C176.391 66.2533 176.234 65.8053 176.234 65.2363Z" fill="#222222"/>
<path d="M182.557 65.6883L183.258 65.9103C183.151 66.3003 182.972 66.5903 182.723 66.7803C182.473 66.9693 182.156 67.0653 181.772 67.0653C181.296 67.0653 180.906 66.9033 180.6 66.5773C180.293 66.2533 180.141 65.8093 180.141 65.2463C180.141 64.6503 180.294 64.1883 180.602 63.8583C180.91 63.5283 181.314 63.3643 181.815 63.3643C182.253 63.3643 182.609 63.4933 182.882 63.7523C183.045 63.9053 183.166 64.1243 183.249 64.4113L182.534 64.5823C182.491 64.3963 182.403 64.2503 182.268 64.1423C182.133 64.0353 181.971 63.9813 181.779 63.9813C181.514 63.9813 181.298 64.0773 181.133 64.2663C180.967 64.4583 180.885 64.7663 180.885 65.1923C180.885 65.6453 180.967 65.9673 181.129 66.1593C181.291 66.3503 181.504 66.4473 181.764 66.4473C181.956 66.4473 182.122 66.3853 182.26 66.2643C182.398 66.1413 182.498 65.9503 182.557 65.6883Z" fill="#222222"/>
<path d="M184.561 67.0038V64.0298H183.5V63.4238H186.344V64.0298H185.284V67.0038H184.561Z" fill="#222222"/>
<path d="M186.82 63.4238H187.497V65.8068L188.946 63.4238H189.667V67.0038H188.991V64.6668L187.543 67.0038H186.82V63.4238Z" fill="#222222"/>
<path d="M108.632 45.8362L107.625 36.4692L106.536 45.8362H108.632ZM111.285 34.1592L114.339 54.0362H109.588L109.056 49.1792H106.112L105.583 54.0362H100.938L103.911 34.1592H111.285Z" fill="white"/>
<path d="M122.752 34.1592L126.336 49.8692L126.07 34.1592H130.287V54.0362H123.787L120.153 37.8762L120.445 54.0362H116.227V34.1592H122.752Z" fill="white"/>
<path d="M142.917 34.1592V37.6642H139.784V54.0362H135.139V37.6642H132.008V34.1592H142.917Z" fill="white"/>
<path d="M149.37 34.1592H144.727V54.0362H149.37V34.1592Z" fill="white"/>
<path d="M63.5245 43.8037L64.1715 52.4187L65.1405 43.8037H68.3455L69.3135 52.4187L69.9645 43.8037H72.2975L71.0825 54.1547H67.6825L66.7425 45.4227L65.8175 54.1547H62.4145L61.1875 43.8037H63.5245Z" fill="white"/>
<path d="M75.1495 43.8037L75.7955 52.4187L76.7655 43.8037H79.9705L80.9405 52.4187L81.5855 43.8037H83.9245L82.7065 54.1547H79.3075L78.3685 45.4227L77.4425 54.1547H74.0415L72.8125 43.8037H75.1495Z" fill="white"/>
<path d="M86.7687 43.8037L87.4137 52.4187L88.3847 43.8037H91.5897L92.5567 52.4187L93.2037 43.8037H95.5427L94.3257 54.1547H90.9227L89.9827 45.4227L89.0597 54.1547H85.6597L84.4297 43.8037H86.7687Z" fill="white"/>
<path d="M98.6504 52.0264H96.5234V54.1554H98.6504V52.0264Z" fill="white"/>
<path d="M155.476 41.1953L156.572 52.4353L157.707 41.1953H160.79L158.971 54.0293H154.19L152.391 41.1953H155.476Z" fill="white"/>
<path d="M164.952 44.226V51.015C164.952 51.734 165.123 51.925 165.758 51.925C166.392 51.925 166.544 51.734 166.544 51.015V44.226C166.544 43.507 166.392 43.299 165.758 43.299C165.123 43.299 164.952 43.491 164.952 44.226ZM169.632 44.637V50.587C169.632 53.653 168.96 54.184 165.758 54.184C162.607 54.184 161.867 53.567 161.867 50.587V44.637C161.867 41.742 162.571 41.04 165.758 41.04C168.892 41.04 169.632 41.742 169.632 44.637Z" fill="white"/>
<path d="M174.34 47.4333H175.065C175.781 47.4333 176.022 47.2633 176.022 46.5063V44.3643C176.022 43.6113 175.781 43.4593 175.065 43.4593H174.34V47.4333ZM171.344 41.1953H174.461C177.716 41.1953 179.02 41.6743 179.02 44.4863V45.9563C179.02 47.4493 178.42 48.1683 176.928 48.4233C178.299 48.6323 179.02 49.4183 179.02 50.7583V54.0293H176.022V50.7733C176.022 49.8473 175.696 49.5913 174.821 49.5913H174.34V54.0293H171.344V41.1953Z" fill="white"/>
<path d="M183.356 51.3896H180.719V54.0296H183.356V51.3896Z" fill="white"/>
<path d="M188.188 47.4333H188.908C189.627 47.4333 189.868 47.2633 189.868 46.5063V44.3643C189.868 43.6113 189.627 43.4593 188.908 43.4593H188.188V47.4333ZM185.188 41.1953H188.305C191.561 41.1953 192.864 41.6743 192.864 44.4863V45.9563C192.864 47.4493 192.263 48.1683 190.772 48.4233C192.147 48.6323 192.864 49.4183 192.864 50.7583V54.0293H189.868V50.7733C189.868 49.8473 189.539 49.5913 188.666 49.5913H188.188V54.0293H185.188V41.1953Z" fill="white"/>
<path d="M197.615 41.1953V50.9793C197.615 51.6983 197.786 51.9253 198.421 51.9253C199.055 51.9253 199.189 51.6983 199.189 50.9793V41.1953H202.068V49.8833C202.068 53.0183 201.655 54.1843 198.333 54.1843C194.992 54.1843 194.617 53.0383 194.617 49.8833V41.1953H197.615Z" fill="white"/>
<path d="M206.284 39.228H206.854C207.142 39.228 207.157 39.14 207.157 38.797C207.157 38.551 207.097 38.477 206.854 38.477H206.284V39.228ZM206.284 40.635H205.547V37.873H206.969C207.61 37.873 207.893 38.058 207.893 38.698C207.893 39.261 207.835 39.453 207.396 39.56V39.589C207.727 39.622 207.893 39.766 207.893 40.079V40.635H207.157V40.178C207.157 39.968 207.076 39.833 206.854 39.833H206.284V40.635Z" fill="white"/>
<path d="M209.289 39.1539H208.957C208.955 40.4109 207.938 41.4279 206.682 41.4299C205.424 41.4279 204.408 40.4109 204.405 39.1539C204.408 37.8969 205.424 36.8799 206.682 36.8779C207.938 36.8799 208.955 37.8969 208.957 39.1539H209.622C209.622 37.5299 208.305 36.2149 206.682 36.2139C205.058 36.2149 203.743 37.5299 203.742 39.1539C203.743 40.7779 205.058 42.0929 206.682 42.0939C208.305 42.0929 209.622 40.7779 209.622 39.1539H209.289Z" fill="white"/>
<path d="M202.525 68.8294L61.5234 68.8324L61.5244 55.5684H202.526L202.525 68.8294Z" fill="white"/>
<path d="M100.956 59.9793L101.657 60.2023C101.549 60.5923 101.37 60.8813 101.121 61.0723C100.871 61.2613 100.554 61.3563 100.17 61.3563C99.6951 61.3563 99.3041 61.1943 98.9981 60.8693C98.6921 60.5453 98.5391 60.1003 98.5391 59.5383C98.5391 58.9423 98.6931 58.4793 99.0001 58.1493C99.3081 57.8203 99.7121 57.6553 100.214 57.6553C100.652 57.6553 101.007 57.7843 101.281 58.0443C101.443 58.1963 101.565 58.4163 101.647 58.7023L100.932 58.8743C100.889 58.6883 100.801 58.5423 100.667 58.4343C100.532 58.3273 100.369 58.2723 100.177 58.2723C99.9121 58.2723 99.6971 58.3683 99.5311 58.5583C99.3661 58.7493 99.2841 59.0573 99.2841 59.4833C99.2841 59.9363 99.3651 60.2583 99.5281 60.4503C99.6901 60.6423 99.9021 60.7393 100.162 60.7393C100.354 60.7393 100.52 60.6773 100.658 60.5553C100.796 60.4333 100.896 60.2413 100.956 59.9793Z" fill="#222222"/>
<path d="M102.752 59.5033C102.752 59.9093 102.846 60.2153 103.033 60.4243C103.22 60.6333 103.458 60.7393 103.746 60.7393C104.034 60.7393 104.271 60.6343 104.455 60.4273C104.64 60.2193 104.732 59.9093 104.732 59.4933C104.732 59.0833 104.643 58.7773 104.463 58.5753C104.283 58.3743 104.044 58.2723 103.746 58.2723C103.448 58.2723 103.208 58.3753 103.026 58.5793C102.844 58.7843 102.752 59.0913 102.752 59.5033ZM102.008 59.5283C102.008 59.1633 102.062 58.8573 102.171 58.6103C102.253 58.4273 102.364 58.2643 102.505 58.1193C102.646 57.9733 102.8 57.8663 102.967 57.7973C103.19 57.7023 103.447 57.6553 103.739 57.6553C104.266 57.6553 104.688 57.8193 105.005 58.1453C105.321 58.4733 105.479 58.9283 105.479 59.5103C105.479 60.0893 105.322 60.5403 105.008 60.8673C104.694 61.1933 104.274 61.3563 103.748 61.3563C103.216 61.3563 102.793 61.1943 102.479 60.8693C102.165 60.5453 102.008 60.0973 102.008 59.5283Z" fill="#222222"/>
<path d="M106.769 59.7348V60.6918H107.438C107.699 60.6918 107.864 60.6838 107.934 60.6708C108.041 60.6508 108.129 60.6028 108.196 60.5268C108.264 60.4518 108.298 60.3498 108.298 60.2228C108.298 60.1158 108.272 60.0238 108.22 59.9498C108.167 59.8758 108.092 59.8208 107.994 59.7858C107.895 59.7528 107.682 59.7348 107.353 59.7348H106.769ZM106.769 58.3108V59.1388H107.243C107.525 59.1388 107.7 59.1348 107.768 59.1278C107.892 59.1118 107.989 59.0698 108.06 58.9988C108.131 58.9278 108.166 58.8348 108.166 58.7188C108.166 58.6078 108.136 58.5178 108.074 58.4498C108.014 58.3808 107.923 58.3388 107.802 58.3238C107.73 58.3148 107.525 58.3108 107.185 58.3108H106.769ZM106.047 57.7148H107.477C107.761 57.7148 107.972 57.7268 108.111 57.7518C108.25 57.7748 108.375 57.8248 108.484 57.8988C108.595 57.9728 108.686 58.0738 108.759 58.1978C108.833 58.3228 108.869 58.4618 108.869 58.6168C108.869 58.7838 108.824 58.9378 108.733 59.0788C108.644 59.2178 108.521 59.3228 108.366 59.3928C108.584 59.4568 108.752 59.5648 108.869 59.7168C108.986 59.8708 109.045 60.0508 109.045 60.2568C109.045 60.4208 109.007 60.5788 108.932 60.7318C108.855 60.8858 108.752 61.0078 108.621 61.1008C108.49 61.1928 108.329 61.2498 108.137 61.2698C108.016 61.2838 107.726 61.2918 107.265 61.2958H106.047V57.7148Z" fill="#222222"/>
<path d="M110.379 58.3208V59.3368H110.774C111.059 59.3368 111.249 59.3188 111.346 59.2808C111.442 59.2428 111.517 59.1838 111.571 59.1048C111.626 59.0258 111.653 58.9318 111.653 58.8268C111.653 58.6958 111.615 58.5888 111.539 58.5048C111.462 58.4208 111.365 58.3668 111.248 58.3458C111.162 58.3298 110.988 58.3208 110.728 58.3208H110.379ZM109.656 61.2958V57.7148H110.816C111.255 57.7148 111.542 57.7338 111.675 57.7698C111.88 57.8228 112.052 57.9398 112.19 58.1198C112.329 58.2988 112.398 58.5318 112.398 58.8168C112.398 59.0368 112.358 59.2208 112.278 59.3718C112.199 59.5208 112.097 59.6378 111.975 59.7238C111.852 59.8088 111.727 59.8658 111.6 59.8928C111.427 59.9278 111.177 59.9448 110.85 59.9448H110.379V61.2958H109.656Z" fill="#222222"/>
<path d="M112.992 61.2958V57.7148H115.646V58.3208H113.715V59.1148H115.512V59.7168H113.715V60.6918H115.714V61.2958H112.992Z" fill="#222222"/>
<path d="M116.312 61.2958V57.7148H117.395L118.043 60.1568L118.685 57.7148H119.771V61.2958H119.098V58.4768L118.389 61.2958H117.693L116.985 58.4768V61.2958H116.312Z" fill="#222222"/>
<path d="M120.492 61.2958V57.7148H123.146V58.3208H121.215V59.1148H123.012V59.7168H121.215V60.6918H123.214V61.2958H120.492Z" fill="#222222"/>
<path d="M123.828 61.2958V57.7148H124.55V59.1248H125.966V57.7148H126.689V61.2958H125.966V59.7298H124.55V61.2958H123.828Z" fill="#222222"/>
<path d="M127.438 61.2958V57.7148H128.16V59.1248H129.576V57.7148H130.299V61.2958H129.576V59.7298H128.16V61.2958H127.438Z" fill="#222222"/>
<path d="M134.467 57.7148H135.189V61.2958H134.467V57.7148ZM131.786 60.6938H132.492C132.716 60.6938 132.873 60.6828 132.962 60.6618C133.05 60.6388 133.129 60.5888 133.198 60.5108C133.267 60.4328 133.302 60.3388 133.302 60.2248C133.302 60.0658 133.245 59.9458 133.133 59.8668C133.02 59.7878 132.815 59.7468 132.521 59.7468H131.786V60.6938ZM131.062 57.7148H131.786V59.1468H132.753C133.007 59.1468 133.226 59.1808 133.408 59.2508C133.592 59.3188 133.744 59.4428 133.866 59.6218C133.988 59.7988 134.049 60.0048 134.049 60.2348C134.049 60.4778 133.986 60.6858 133.859 60.8618C133.732 61.0368 133.591 61.1528 133.435 61.2098C133.28 61.2658 133.052 61.2958 132.753 61.2958H131.062V57.7148Z" fill="#222222"/>
<path d="M135.945 61.2958V57.7148H138.598V58.3208H136.668V59.1148H138.464V59.7168H136.668V60.6918H138.667V61.2958H135.945Z" fill="#222222"/>
<path d="M141.387 58.3208V59.3368H141.784C142.068 59.3368 142.258 59.3188 142.354 59.2808C142.451 59.2428 142.526 59.1838 142.58 59.1048C142.635 59.0258 142.663 58.9318 142.663 58.8268C142.663 58.6958 142.623 58.5888 142.547 58.5048C142.471 58.4208 142.373 58.3668 142.256 58.3458C142.17 58.3298 141.997 58.3208 141.737 58.3208H141.387ZM140.664 61.2958V57.7148H141.825C142.264 57.7148 142.551 57.7338 142.684 57.7698C142.889 57.8228 143.061 57.9398 143.2 58.1198C143.337 58.2988 143.407 58.5318 143.407 58.8168C143.407 59.0368 143.367 59.2208 143.288 59.3718C143.207 59.5208 143.106 59.6378 142.983 59.7238C142.86 59.8088 142.735 59.8658 142.608 59.8928C142.436 59.9278 142.186 59.9448 141.859 59.9448H141.387V61.2958H140.664Z" fill="#222222"/>
<path d="M144 61.2958V57.7148H146.654V58.3208H144.723V59.1148H146.52V59.7168H144.723V60.6918H146.722V61.2958H144Z" fill="#222222"/>
<path d="M147.344 57.7148H148.067V60.6938H149.102V57.7148H149.822V60.6938H150.892V57.7148H151.612L151.617 61.2978L147.344 61.2958V57.7148Z" fill="#222222"/>
<path d="M152.359 61.2958V57.7148H155.012V58.3208H153.081V59.1148H154.878V59.7168H153.081V60.6918H155.081V61.2958H152.359Z" fill="#222222"/>
<path d="M155.695 61.2958V57.7148H156.417V59.1248H157.833V57.7148H158.556V61.2958H157.833V59.7298H156.417V61.2958H155.695Z" fill="#222222"/>
<path d="M159.312 57.7148H159.989V60.0978L161.44 57.7148H162.16V61.2958H161.483V58.9588L160.036 61.2958H159.312V57.7148Z" fill="#222222"/>
<path d="M165.041 58.3208H164.478C164.192 58.3208 164.002 58.3278 163.913 58.3398C163.823 58.3538 163.745 58.3978 163.68 58.4728C163.615 58.5478 163.582 58.6448 163.582 58.7658C163.582 58.8908 163.614 58.9908 163.676 59.0648C163.739 59.1388 163.819 59.1838 163.915 59.2028C164.012 59.2208 164.209 59.2288 164.507 59.2288H165.041V58.3208ZM165.041 61.2958V59.8008H164.895C164.667 59.8008 164.506 59.8348 164.413 59.9028C164.32 59.9708 164.16 60.1758 163.934 60.5158L163.411 61.2958H162.547L162.984 60.5958C163.157 60.3198 163.293 60.1258 163.397 60.0138C163.499 59.9028 163.627 59.8028 163.782 59.7148C163.449 59.6628 163.207 59.5478 163.059 59.3678C162.912 59.1878 162.837 58.9718 162.837 58.7208C162.837 58.5038 162.893 58.3098 163.002 58.1418C163.112 57.9728 163.256 57.8598 163.436 57.8018C163.617 57.7448 163.885 57.7148 164.244 57.7148H165.764V61.2958H165.041Z" fill="#222222"/>
<path d="M75.7378 64.0248C75.7378 65.1118 75.6388 65.9048 75.4418 66.4028H76.8018V64.0248H75.7378ZM75.0488 63.4238H77.5228V66.4028H77.8368V67.7848H77.2368V67.0038H74.9828V67.7848H74.3828V66.4028H74.6858C74.8328 66.0958 74.9308 65.7418 74.9788 65.3368C75.0258 64.9318 75.0488 64.4218 75.0488 63.8028V63.4238Z" fill="#222222"/>
<path d="M78.5811 63.4238H81.0881V67.0038H80.3651V64.0298H79.2891V65.5578C79.2891 65.9968 79.2741 66.3008 79.2451 66.4748C79.2151 66.6488 79.1441 66.7838 79.0311 66.8798C78.9181 66.9768 78.7411 67.0258 78.5001 67.0258C78.4161 67.0258 78.2621 67.0168 78.0391 67.0008V66.4418L78.2001 66.4438C78.3511 66.4438 78.4531 66.4238 78.5051 66.3828C78.5571 66.3418 78.5831 66.2428 78.5831 66.0828L78.5811 65.4668V63.4238Z" fill="#222222"/>
<path d="M83.9726 64.0298H83.4086C83.1216 64.0298 82.9336 64.0358 82.8436 64.0488C82.7526 64.0628 82.6746 64.1058 82.6096 64.1808C82.5446 64.2558 82.5126 64.3538 82.5126 64.4738C82.5126 64.5998 82.5436 64.6998 82.6056 64.7738C82.6686 64.8468 82.7486 64.8928 82.8456 64.9108C82.9426 64.9288 83.1396 64.9378 83.4376 64.9378H83.9726V64.0298ZM83.9726 67.0038V65.5088H83.8256C83.5976 65.5088 83.4366 65.5438 83.3436 65.6118C83.2506 65.6798 83.0896 65.8838 82.8636 66.2248L82.3416 67.0038H81.4766L81.9146 66.3048C82.0866 66.0278 82.2246 65.8348 82.3266 65.7228C82.4296 65.6118 82.5576 65.5118 82.7126 65.4238C82.3786 65.3718 82.1376 65.2558 81.9896 65.0768C81.8416 64.8958 81.7676 64.6798 81.7676 64.4298C81.7676 64.2118 81.8226 64.0178 81.9326 63.8498C82.0426 63.6818 82.1866 63.5688 82.3666 63.5098C82.5466 63.4538 82.8156 63.4238 83.1736 63.4238H84.6946V67.0038H83.9726Z" fill="#222222"/>
<path d="M87.5355 64.0298V65.0458H87.9315C88.2155 65.0458 88.4065 65.0268 88.5025 64.9888C88.5985 64.9518 88.6735 64.8928 88.7285 64.8128C88.7825 64.7338 88.8105 64.6408 88.8105 64.5358C88.8105 64.4048 88.7715 64.2978 88.6955 64.2138C88.6185 64.1288 88.5215 64.0748 88.4045 64.0538C88.3185 64.0378 88.1455 64.0298 87.8845 64.0298H87.5355ZM86.8125 67.0038V63.4238H87.9725C88.4125 63.4238 88.6985 63.4418 88.8315 63.4778C89.0375 63.5318 89.2085 63.6488 89.3475 63.8288C89.4855 64.0078 89.5545 64.2408 89.5545 64.5258C89.5545 64.7448 89.5145 64.9298 89.4355 65.0798C89.3555 65.2288 89.2535 65.3458 89.1315 65.4318C89.0085 65.5178 88.8835 65.5748 88.7565 65.6018C88.5835 65.6358 88.3335 65.6528 88.0065 65.6528H87.5355V67.0038H86.8125Z" fill="#222222"/>
<path d="M94.5464 67.0038V64.0298H93.4844V63.4238H96.3284V64.0298H95.2694V67.0038H94.5464Z" fill="#222222"/>
<path d="M96.7969 67.0038V63.4238H99.4509V64.0298H97.5199V64.8228H99.3169V65.4258H97.5199V66.4008H99.5189V67.0038H96.7969Z" fill="#222222"/>
<path d="M90.2188 67.0038V63.4238H92.8727V64.0298H90.9408V64.8228H92.7377V65.4258H90.9408V66.4008H92.9408V67.0038H90.2188Z" fill="#222222"/>
<path d="M101.997 62.5342H102.331C102.311 62.7552 102.234 62.9282 102.098 63.0552C101.962 63.1802 101.786 63.2442 101.569 63.2442C101.353 63.2442 101.177 63.1802 101.041 63.0552C100.905 62.9282 100.827 62.7552 100.808 62.5342H101.142C101.153 62.6492 101.194 62.7372 101.264 62.7962C101.334 62.8552 101.436 62.8852 101.569 62.8852C101.703 62.8852 101.805 62.8552 101.875 62.7962C101.944 62.7372 101.985 62.6492 101.997 62.5342ZM100.141 63.4242H100.817V65.8072L102.268 63.4242H102.988V67.0042H102.311V64.6672L100.864 67.0042H100.141V63.4242Z" fill="#222222"/>
<path d="M103.979 63.4238H106.487V67.0038H105.764V64.0298H104.688V65.5578C104.688 65.9968 104.674 66.3008 104.645 66.4748C104.615 66.6488 104.544 66.7838 104.431 66.8798C104.318 66.9768 104.14 67.0258 103.899 67.0258C103.814 67.0258 103.662 67.0168 103.438 67.0008V66.4418L103.599 66.4438C103.75 66.4438 103.852 66.4238 103.904 66.3828C103.956 66.3418 103.982 66.2428 103.982 66.0828L103.979 65.4668V63.4238Z" fill="#222222"/>
<path d="M109.127 65.5878L108.634 64.2588L108.151 65.5878H109.127ZM110.458 67.0038H109.672L109.359 66.1898H107.929L107.633 67.0038H106.867L108.261 63.4238H109.025L110.458 67.0038Z" fill="#222222"/>
<path d="M112.242 63.4238H112.918V65.8068L114.369 63.4238H115.089V67.0038H114.413V64.6668L112.965 67.0038H112.242V63.4238Z" fill="#222222"/>
<path d="M118.023 67.0038V64.0298H116.961V63.4238H119.805V64.0298H118.746V67.0038H118.023Z" fill="#222222"/>
<path d="M120.744 65.2123C120.744 65.6173 120.838 65.9243 121.025 66.1333C121.212 66.3423 121.45 66.4473 121.738 66.4473C122.026 66.4473 122.262 66.3423 122.447 66.1353C122.632 65.9283 122.724 65.6173 122.724 65.2023C122.724 64.7923 122.634 64.4853 122.454 64.2843C122.274 64.0833 122.036 63.9813 121.738 63.9813C121.44 63.9813 121.2 64.0833 121.018 64.2883C120.835 64.4923 120.744 64.7993 120.744 65.2123ZM120 65.2363C120 64.8723 120.054 64.5653 120.163 64.3183C120.245 64.1353 120.355 63.9723 120.496 63.8273C120.637 63.6823 120.791 63.5753 120.959 63.5053C121.182 63.4113 121.439 63.3643 121.73 63.3643C122.258 63.3643 122.68 63.5273 122.996 63.8543C123.313 64.1813 123.471 64.6363 123.471 65.2193C123.471 65.7973 123.314 66.2493 123 66.5753C122.686 66.9013 122.266 67.0653 121.74 67.0653C121.208 67.0653 120.785 66.9033 120.471 66.5773C120.157 66.2533 120 65.8053 120 65.2363Z" fill="#222222"/>
<path d="M124.762 64.0298V65.0458H125.157C125.442 65.0458 125.632 65.0268 125.729 64.9888C125.825 64.9518 125.9 64.8928 125.954 64.8128C126.009 64.7338 126.036 64.6408 126.036 64.5358C126.036 64.4048 125.998 64.2978 125.921 64.2138C125.845 64.1288 125.748 64.0748 125.631 64.0538C125.544 64.0378 125.371 64.0298 125.111 64.0298H124.762ZM124.039 67.0038V63.4238H125.199C125.638 63.4238 125.925 63.4418 126.058 63.4778C126.263 63.5318 126.435 63.6488 126.573 63.8288C126.711 64.0078 126.781 64.2408 126.781 64.5258C126.781 64.7448 126.741 64.9298 126.661 65.0798C126.582 65.2288 126.48 65.3458 126.358 65.4318C126.234 65.5178 126.109 65.5748 125.983 65.6018C125.81 65.6358 125.56 65.6528 125.233 65.6528H124.762V67.0038H124.039Z" fill="#222222"/>
<path d="M127.406 63.4238H129.83V64.0248H128.128V67.0038H127.406V63.4238Z" fill="#222222"/>
<path d="M130.737 65.2123C130.737 65.6173 130.83 65.9243 131.018 66.1333C131.205 66.3423 131.442 66.4473 131.73 66.4473C132.018 66.4473 132.255 66.3423 132.439 66.1353C132.625 65.9283 132.717 65.6173 132.717 65.2023C132.717 64.7923 132.627 64.4853 132.447 64.2843C132.267 64.0833 132.028 63.9813 131.73 63.9813C131.433 63.9813 131.192 64.0833 131.01 64.2883C130.828 64.4923 130.737 64.7993 130.737 65.2123ZM129.992 65.2363C129.992 64.8723 130.047 64.5653 130.156 64.3183C130.237 64.1353 130.348 63.9723 130.489 63.8273C130.63 63.6823 130.784 63.5753 130.952 63.5053C131.175 63.4113 131.432 63.3643 131.723 63.3643C132.25 63.3643 132.672 63.5273 132.989 63.8543C133.306 64.1813 133.464 64.6363 133.464 65.2193C133.464 65.7973 133.307 66.2493 132.993 66.5753C132.679 66.9013 132.259 67.0653 131.733 67.0653C131.201 67.0653 130.777 66.9033 130.463 66.5773C130.149 66.2533 129.992 65.8053 129.992 65.2363Z" fill="#222222"/>
<path d="M134.754 65.4438V66.4008H135.423C135.683 66.4008 135.849 66.3928 135.918 66.3788C136.026 66.3588 136.113 66.3108 136.181 66.2348C136.248 66.1608 136.283 66.0588 136.283 65.9318C136.283 65.8248 136.256 65.7328 136.205 65.6588C136.152 65.5838 136.077 65.5288 135.978 65.4948C135.88 65.4608 135.665 65.4438 135.337 65.4438H134.754ZM134.754 64.0198V64.8478H135.227C135.509 64.8478 135.684 64.8438 135.752 64.8358C135.876 64.8208 135.974 64.7778 136.044 64.7078C136.115 64.6368 136.15 64.5438 136.15 64.4278C136.15 64.3168 136.121 64.2268 136.058 64.1588C135.998 64.0888 135.908 64.0478 135.787 64.0318C135.714 64.0238 135.509 64.0198 135.169 64.0198H134.754ZM134.031 63.4238H135.462C135.746 63.4238 135.956 63.4358 136.095 63.4598C136.234 63.4828 136.359 63.5328 136.468 63.6078C136.58 63.6818 136.67 63.7818 136.744 63.9068C136.817 64.0318 136.853 64.1708 136.853 64.3248C136.853 64.4928 136.808 64.6468 136.718 64.7868C136.628 64.9258 136.505 65.0318 136.351 65.1018C136.569 65.1648 136.736 65.2738 136.853 65.4258C136.97 65.5788 137.029 65.7588 137.029 65.9648C137.029 66.1288 136.992 66.2878 136.915 66.4398C136.839 66.5938 136.737 66.7168 136.605 66.8088C136.474 66.9008 136.313 66.9578 136.121 66.9788C136.001 66.9928 135.71 67.0008 135.249 67.0038H134.031V63.4238Z" fill="#222222"/>
<path d="M138.111 65.2123C138.111 65.6173 138.204 65.9243 138.392 66.1333C138.579 66.3423 138.817 66.4473 139.105 66.4473C139.393 66.4473 139.629 66.3423 139.814 66.1353C139.999 65.9283 140.091 65.6173 140.091 65.2023C140.091 64.7923 140.001 64.4853 139.822 64.2843C139.642 64.0833 139.403 63.9813 139.105 63.9813C138.807 63.9813 138.567 64.0833 138.384 64.2883C138.203 64.4923 138.111 64.7993 138.111 65.2123ZM137.367 65.2363C137.367 64.8723 137.421 64.5653 137.531 64.3183C137.612 64.1353 137.722 63.9723 137.863 63.8273C138.004 63.6823 138.159 63.5753 138.326 63.5053C138.549 63.4113 138.806 63.3643 139.097 63.3643C139.624 63.3643 140.046 63.5273 140.363 63.8543C140.68 64.1813 140.838 64.6363 140.838 65.2193C140.838 65.7973 140.681 66.2493 140.367 66.5753C140.053 66.9013 139.633 67.0653 139.107 67.0653C138.576 67.0653 138.152 66.9033 137.837 66.5773C137.524 66.2533 137.367 65.8053 137.367 65.2363Z" fill="#222222"/>
<path d="M143.269 62.5342H143.604C143.584 62.7552 143.507 62.9282 143.371 63.0552C143.235 63.1802 143.058 63.2442 142.842 63.2442C142.626 63.2442 142.45 63.1802 142.314 63.0552C142.177 62.9282 142.1 62.7552 142.081 62.5342H142.415C142.426 62.6492 142.467 62.7372 142.537 62.7962C142.607 62.8552 142.708 62.8852 142.842 62.8852C142.976 62.8852 143.078 62.8552 143.148 62.7962C143.217 62.7372 143.258 62.6492 143.269 62.5342ZM141.414 63.4242H142.09V65.8072L143.54 63.4242H144.261V67.0042H143.584V64.6672L142.136 67.0042H141.414V63.4242Z" fill="#222222"/>
<path d="M146.391 67.0038V63.4238H147.114V64.8328H148.53V63.4238H149.252V67.0038H148.53V65.4378H147.114V67.0038H146.391Z" fill="#222222"/>
<path d="M150 67.0038V63.4238H152.654V64.0298H150.722V64.8228H152.519V65.4258H150.722V66.4008H152.722V67.0038H150Z" fill="#222222"/>
<path d="M154.308 64.0248C154.308 65.1118 154.208 65.9048 154.012 66.4028H155.372V64.0248H154.308ZM153.619 63.4238H156.092V66.4028H156.408V67.7848H155.806V67.0038H153.553V67.7848H152.953V66.4028H153.255C153.404 66.0958 153.501 65.7418 153.548 65.3368C153.595 64.9318 153.619 64.4218 153.619 63.8028V63.4238Z" fill="#222222"/>
<path d="M157.621 65.4438V66.4008H158.289C158.549 66.4008 158.714 66.3928 158.785 66.3788C158.892 66.3588 158.98 66.3108 159.046 66.2348C159.115 66.1608 159.148 66.0588 159.148 65.9318C159.148 65.8248 159.123 65.7328 159.07 65.6588C159.018 65.5838 158.943 65.5288 158.845 65.4948C158.746 65.4608 158.533 65.4438 158.204 65.4438H157.621ZM157.621 64.0198V64.8478H158.093C158.376 64.8478 158.55 64.8438 158.619 64.8358C158.742 64.8208 158.839 64.7778 158.91 64.7078C158.982 64.6368 159.017 64.5438 159.017 64.4278C159.017 64.3168 158.986 64.2268 158.925 64.1588C158.865 64.0888 158.773 64.0478 158.653 64.0318C158.581 64.0238 158.376 64.0198 158.035 64.0198H157.621ZM156.898 63.4238H158.328C158.611 63.4238 158.822 63.4358 158.962 63.4598C159.101 63.4828 159.226 63.5328 159.335 63.6078C159.445 63.6818 159.537 63.7818 159.61 63.9068C159.683 64.0318 159.72 64.1708 159.72 64.3248C159.72 64.4928 159.675 64.6468 159.583 64.7868C159.494 64.9258 159.372 65.0318 159.216 65.1018C159.435 65.1648 159.603 65.2738 159.72 65.4258C159.837 65.5788 159.896 65.7588 159.896 65.9648C159.896 66.1288 159.857 66.2878 159.783 66.4398C159.706 66.5938 159.603 66.7168 159.472 66.8088C159.341 66.9008 159.179 66.9578 158.988 66.9788C158.867 66.9928 158.576 67.0008 158.116 67.0038H156.898V63.4238Z" fill="#222222"/>
<path d="M160.516 63.4238H161.193V65.8068L162.643 63.4238H163.364V67.0038H162.687V64.6668L161.239 67.0038H160.516V63.4238Z" fill="#222222"/>
<path d="M166.345 63.4244V64.9484C166.465 64.9384 166.557 64.8934 166.619 64.8134C166.68 64.7344 166.766 64.5514 166.875 64.2664C167.018 63.8944 167.164 63.6574 167.315 63.5534C167.462 63.4534 167.709 63.4034 168.054 63.4034C168.071 63.4034 168.106 63.4014 168.159 63.4004V63.9344L168.054 63.9324C167.908 63.9324 167.8 63.9504 167.732 63.9874C167.663 64.0244 167.608 64.0804 167.566 64.1554C167.524 64.2294 167.461 64.3834 167.377 64.6164C167.334 64.7394 167.286 64.8424 167.235 64.9264C167.184 65.0084 167.093 65.0874 166.963 65.1614C167.123 65.2084 167.256 65.2994 167.362 65.4384C167.467 65.5754 167.582 65.7704 167.707 66.0224L168.196 67.0044H167.346L166.916 66.0794C166.912 66.0654 166.898 66.0404 166.875 66.0034C166.862 65.9784 166.832 65.9234 166.787 65.8354C166.696 65.6634 166.621 65.5544 166.563 65.5064C166.504 65.4604 166.432 65.4364 166.345 65.4364V67.0044H165.639V65.4364C165.557 65.4364 165.485 65.4604 165.424 65.5054C165.365 65.5494 165.289 65.6604 165.2 65.8354C165.15 65.9324 165.12 65.9884 165.11 66.0034C165.095 66.0274 165.081 66.0524 165.069 66.0794L164.639 67.0044H163.789L164.278 66.0224C164.398 65.7804 164.511 65.5874 164.618 65.4444C164.725 65.3024 164.86 65.2084 165.024 65.1614C164.894 65.0874 164.803 65.0094 164.752 64.9264C164.702 64.8444 164.653 64.7414 164.607 64.6164C164.526 64.3874 164.463 64.2364 164.422 64.1594C164.381 64.0834 164.326 64.0264 164.256 63.9894C164.188 63.9514 164.075 63.9324 163.918 63.9324C163.899 63.9324 163.868 63.9334 163.826 63.9344V63.4004C163.879 63.4014 163.914 63.4034 163.93 63.4034C164.281 63.4034 164.53 63.4544 164.678 63.5564C164.825 63.6614 164.968 63.8974 165.11 64.2664C165.221 64.5534 165.307 64.7364 165.368 64.8154C165.428 64.8934 165.519 64.9384 165.639 64.9484V63.4244H166.345Z" fill="#222222"/>
<path d="M168.625 63.4238H169.301V65.8068L170.752 63.4238H171.472V67.0038H170.795V64.6668L169.348 67.0038H168.625V63.4238Z" fill="#222222"/>
<path d="M172.203 67.0038V63.4238H173.285L173.933 65.8658L174.576 63.4238H175.66V67.0038H174.988V64.1858L174.278 67.0038H173.581L172.874 64.1858V67.0038H172.203Z" fill="#222222"/>
<path d="M176.979 65.2123C176.979 65.6173 177.073 65.9243 177.259 66.1333C177.446 66.3423 177.684 66.4473 177.972 66.4473C178.26 66.4473 178.497 66.3423 178.682 66.1353C178.866 65.9283 178.959 65.6173 178.959 65.2023C178.959 64.7923 178.869 64.4853 178.688 64.2843C178.508 64.0833 178.27 63.9813 177.972 63.9813C177.674 63.9813 177.434 64.0833 177.252 64.2883C177.07 64.4923 176.979 64.7993 176.979 65.2123ZM176.234 65.2363C176.234 64.8723 176.289 64.5653 176.397 64.3183C176.479 64.1353 176.59 63.9723 176.731 63.8273C176.872 63.6823 177.026 63.5753 177.194 63.5053C177.417 63.4113 177.673 63.3643 177.965 63.3643C178.493 63.3643 178.915 63.5273 179.231 63.8543C179.547 64.1813 179.706 64.6363 179.706 65.2193C179.706 65.7973 179.548 66.2493 179.235 66.5753C178.92 66.9013 178.501 67.0653 177.975 67.0653C177.442 67.0653 177.019 66.9033 176.706 66.5773C176.391 66.2533 176.234 65.8053 176.234 65.2363Z" fill="#222222"/>
<path d="M182.557 65.6883L183.258 65.9103C183.151 66.3003 182.972 66.5903 182.723 66.7803C182.473 66.9693 182.156 67.0653 181.772 67.0653C181.296 67.0653 180.906 66.9033 180.6 66.5773C180.293 66.2533 180.141 65.8093 180.141 65.2463C180.141 64.6503 180.294 64.1883 180.602 63.8583C180.91 63.5283 181.314 63.3643 181.815 63.3643C182.253 63.3643 182.609 63.4933 182.882 63.7523C183.045 63.9053 183.166 64.1243 183.249 64.4113L182.534 64.5823C182.491 64.3963 182.403 64.2503 182.268 64.1423C182.133 64.0353 181.971 63.9813 181.779 63.9813C181.514 63.9813 181.298 64.0773 181.133 64.2663C180.967 64.4583 180.885 64.7663 180.885 65.1923C180.885 65.6453 180.967 65.9673 181.129 66.1593C181.291 66.3503 181.504 66.4473 181.764 66.4473C181.956 66.4473 182.122 66.3853 182.26 66.2643C182.398 66.1413 182.498 65.9503 182.557 65.6883Z" fill="#222222"/>
<path d="M184.561 67.0038V64.0298H183.5V63.4238H186.344V64.0298H185.284V67.0038H184.561Z" fill="#222222"/>
<path d="M186.82 63.4238H187.497V65.8068L188.946 63.4238H189.667V67.0038H188.991V64.6668L187.543 67.0038H186.82V63.4238Z" fill="#222222"/>
</g>
<defs>
<clipPath id="clip0_204_5658">
<rect width="270" height="104" fill="white"/>
</clipPath>
</defs>
</svg>
