<svg width="48" height="48" viewBox="0 0 48 48" fill="none" xmlns="http://www.w3.org/2000/svg">
<path d="M33.184 2C33.5523 2.10558 33.9322 2.18133 34.2857 2.32363C36.3388 3.14533 37.5426 4.65905 37.6528 6.86823C37.7538 8.8938 37.6746 10.9285 37.6746 12.9966H26.6562V2C28.831 2 31.0081 2 33.184 2Z" fill="#FF7C1B"/>
<path d="M2 26.6547H13.0057V37.6879H12.5226C10.8494 37.6879 9.17496 37.6478 7.50402 37.6971C4.42379 37.7878 2.35806 35.5591 2.05968 33.2937C2.05509 33.2547 2.02066 33.2202 2 33.1835C2 31.0076 2 28.8306 2 26.6547Z" fill="#FF7C1B"/>
<path d="M12.9954 2C13.0092 2.11247 13.0356 2.22493 13.0356 2.33625C13.0379 5.76766 13.0379 9.19906 13.0356 12.6305C13.0356 12.7429 13.0218 12.8543 13.0126 12.9931C12.8921 13.0069 12.7831 13.031 12.6741 13.031C9.21398 13.0333 5.75389 13.0333 2.29494 13.031C2.19624 13.031 2.0987 13.008 2 12.9954C2 10.8195 2 8.64247 2 6.46656C2.03099 6.37475 2.07001 6.28639 2.08951 6.19228C2.41659 4.69692 3.19927 3.50339 4.5374 2.7494C5.13302 2.41429 5.82045 2.24444 6.46656 2C8.64246 2 10.8195 2 12.9954 2Z" fill="#FF7C1B"/>
<path d="M24.0754 2V13.0103H15.6093V12.5146C15.6093 9.17955 15.6093 5.84455 15.6082 2.50955C15.6082 2.3397 15.5841 2.16985 15.5703 2C18.405 2 21.2396 2 24.0754 2Z" fill="#FF7C1B"/>
<path d="M2 15.5728C2.16985 15.5854 2.3397 15.6095 2.50955 15.6106C5.83078 15.6129 9.15086 15.6118 12.4721 15.6118H13.008V24.0778H2C2 21.242 2 18.4074 2 15.5728Z" fill="#FF7C1B"/>
<path d="M37.6443 26.6842C37.6443 28.8716 37.7304 31.0211 37.6202 33.1603C37.5043 35.4153 35.4225 37.4994 33.1651 37.6245C31.0397 37.7416 28.904 37.667 26.7717 37.6739C26.7465 37.6739 26.7212 37.6544 26.6719 37.6349V26.6842H37.6432H37.6443Z" fill="#FF7C1B"/>
<path d="M45.9134 34.9047C45.9134 37.1793 46.0558 39.4057 45.8744 41.6034C45.6805 43.9583 43.6446 45.8152 41.269 45.9437C39.1895 46.055 37.0985 45.9667 34.9789 45.9667C34.9662 45.8335 34.9456 45.7119 34.9456 45.5891C34.9433 43.816 34.9502 42.0418 34.9375 40.2687C34.9352 39.9806 35.0225 39.8441 35.2956 39.7373C37.4336 38.8984 38.9152 37.3893 39.7553 35.2581C39.862 34.9873 39.9779 34.8944 40.2717 34.8966C42.0448 34.9116 43.819 34.9047 45.5921 34.9047C45.7034 34.9047 45.8159 34.9047 45.9134 34.9047Z" fill="#FF7C1B"/>
<path d="M37.6593 15.6453V24.0482H26.6719V15.6453H37.6593Z" fill="#FF7C1B"/>
<path d="M24.0571 26.6694V37.666H15.6484V26.6694H24.0571Z" fill="#FF7C1B"/>
<path d="M15.6406 15.6363H24.0504V24.0519H15.6406V15.6363Z" fill="#FF7C1B"/>
<path d="M10.3352 40.2941H21.2973V45.9634C21.1562 45.9703 21.0173 45.9818 20.8784 45.9818C19.0755 45.9829 17.2726 45.991 15.4697 45.9806C12.4709 45.9634 10.1321 43.4742 10.2973 40.4869C10.3008 40.4318 10.318 40.3768 10.334 40.2941H10.3352Z" fill="#FF7C1B"/>
<path d="M40.2969 10.3124C42.0986 10.2022 43.5997 10.7806 44.7669 12.1497C45.545 13.0621 45.9604 14.1351 45.9742 15.3356C45.9948 17.2246 45.9811 19.1147 45.9799 21.0037C45.9799 21.0863 45.9662 21.1689 45.957 21.2757H40.2969V10.3135V10.3124Z" fill="#FF7C1B"/>
<path d="M32.3328 45.961H23.9219V40.2986H32.3328V45.961Z" fill="#FF7C1B"/>
<path d="M45.9606 32.3098H40.2891V23.9069H45.9606V32.3098Z" fill="#FF7C1B"/>
</svg>
