<svg width="40" height="40" viewBox="0 0 40 40" fill="none" xmlns="http://www.w3.org/2000/svg">
<path d="M29.3752 23.6233L33.7804 26.25C34.6904 26.7933 35.1602 27.85 34.9518 28.89C34.1002 33.155 29.817 35.8883 25.622 34.7367C15.7237 32.02 7.99181 24.3117 5.26514 14.3917C4.11181 10.195 6.84198 5.9083 11.1086 5.05496L11.1367 5.04998C12.1784 4.84164 13.2403 5.31331 13.782 6.22831L16.387 10.6267C17.3136 12.1917 16.8534 14.2066 15.3384 15.2133L12.5702 17.055C14.5236 21.7333 18.2568 25.4817 22.9218 27.4317L24.7801 24.6567C25.7951 23.145 27.8119 22.6917 29.3752 23.6233Z" fill="#FF7C1B"/>
</svg>
