<svg width="17" height="16" viewBox="0 0 17 16" fill="none" xmlns="http://www.w3.org/2000/svg">
<path fill-rule="evenodd" clip-rule="evenodd" d="M4.32933 2.19498L4.57344 2.36729L4.81756 2.19497C5.30795 1.84529 5.96368 1.95674 6.337 2.39794C6.33834 2.39953 6.33966 2.40113 6.34097 2.40274C7.03236 3.25367 7.59712 4.6045 7.92784 6.02913C7.96687 6.19725 7.86222 6.36518 7.6941 6.4042C7.52598 6.44323 7.35806 6.33858 7.31903 6.17046C7.00013 4.79671 6.46577 3.54886 5.85805 2.7995C5.68136 2.59282 5.38888 2.55494 5.18007 2.70409L5.17865 2.7051L4.75365 3.0051C4.64561 3.08136 4.50126 3.08136 4.39322 3.0051L3.96822 2.7051L3.9668 2.70409C3.75819 2.55508 3.46606 2.59274 3.28933 2.79892C2.76343 3.45481 2.30429 4.44779 1.97676 5.58036C1.64982 6.7109 1.46094 7.95667 1.46094 9.0998C1.46094 10.7194 1.83281 11.794 2.38826 12.4588C2.93728 13.116 3.69858 13.4123 4.57344 13.4123C5.22035 13.4123 5.80265 13.2512 6.28963 12.8971C6.42921 12.7956 6.62466 12.8264 6.72617 12.966C6.82768 13.1056 6.79682 13.301 6.65724 13.4025C6.04422 13.8484 5.32652 14.0373 4.57344 14.0373C3.54829 14.0373 2.5971 13.6836 1.90862 12.8595C1.22656 12.0431 0.835938 10.8052 0.835938 9.0998C0.835938 7.89293 1.03455 6.58869 1.37636 5.40673C1.71702 4.22875 2.20687 3.14819 2.80484 2.40405C2.80649 2.40199 2.80817 2.39996 2.80988 2.39794C3.1832 1.95674 3.83894 1.84528 4.32933 2.19498Z" fill="white"/>
<path fill-rule="evenodd" clip-rule="evenodd" d="M4.57031 2.41211C4.7429 2.41211 4.88281 2.55202 4.88281 2.72461V7.62461C4.88281 7.7972 4.7429 7.93711 4.57031 7.93711C4.39772 7.93711 4.25781 7.7972 4.25781 7.62461V2.72461C4.25781 2.55202 4.39772 2.41211 4.57031 2.41211Z" fill="white"/>
<path fill-rule="evenodd" clip-rule="evenodd" d="M12.9458 3.97243C12.4165 3.67597 11.7376 3.64177 11.0001 3.8953C10.8369 3.9514 10.6591 3.86457 10.603 3.70136C10.5469 3.53814 10.6337 3.36035 10.7969 3.30424C11.6594 3.00777 12.5306 3.02357 13.2512 3.42711C13.9852 3.83814 14.3943 4.61294 14.5792 5.48492C14.615 5.65376 14.5072 5.81965 14.3384 5.85547C14.1695 5.89128 14.0036 5.78345 13.9678 5.61461C13.8028 4.8366 13.4619 4.2614 12.9458 3.97243Z" fill="white"/>
<path fill-rule="evenodd" clip-rule="evenodd" d="M11.0328 1.79886L10.7244 1.84962L10.4756 1.66058C10.5511 1.56118 10.6785 1.51626 10.7997 1.54632C10.9209 1.57639 11.0125 1.67568 11.0328 1.79886ZM10.9657 7.32691C11.1975 6.27643 11.248 5.15949 11.2306 4.21884C11.2179 3.53268 11.1687 2.92957 11.1227 2.49774C11.0996 2.28169 11.0774 2.10813 11.0607 1.98805C11.0524 1.928 11.0455 1.8813 11.0407 1.84932C11.0382 1.83333 11.0363 1.82101 11.035 1.81255C11.0343 1.80831 11.0338 1.80504 11.0334 1.80275L11.033 1.80006L11.0328 1.79902C11.0328 1.79893 11.0328 1.79886 10.7244 1.84962C10.4756 1.66058 10.4756 1.6606 10.4756 1.66063L10.4671 1.67182C10.4615 1.6792 10.4532 1.69015 10.4423 1.70448C10.4206 1.73313 10.3887 1.77528 10.3478 1.82939C10.2661 1.93761 10.1485 2.09367 10.0049 2.28521C9.71769 2.66825 9.32635 3.19342 8.90986 3.76179C8.08163 4.89204 7.13978 6.21214 6.72963 6.91694C5.90465 8.3222 5.51001 9.81703 5.54958 11.103C5.58897 12.3833 6.06523 13.5094 7.04396 14.0707C8.01925 14.6301 9.22641 14.493 10.3568 13.9015C11.4915 13.3078 12.5941 12.2375 13.4189 10.8329L13.4195 10.8318C13.829 10.128 14.517 8.66239 15.0964 7.38836C15.3876 6.74804 15.6537 6.1509 15.8469 5.71391C15.9436 5.49538 16.0221 5.31684 16.0764 5.19287C16.1035 5.13089 16.1247 5.08255 16.139 5.04968C16.1462 5.03324 16.1517 5.02067 16.1554 5.0122L16.161 4.99935C16.161 4.99931 16.161 4.99928 15.8744 4.87462L16.161 4.99928C16.2107 4.88507 16.1878 4.75226 16.1028 4.66126C16.0177 4.57026 15.8868 4.53844 15.7694 4.58029L15.8744 4.87462C15.7694 4.58029 15.7694 4.58031 15.7693 4.58034L15.7683 4.5807L15.7657 4.58162C15.7635 4.58241 15.7604 4.58354 15.7564 4.58501C15.7483 4.58795 15.7365 4.59224 15.7213 4.59788C15.6909 4.60916 15.6466 4.62581 15.5899 4.6477C15.4765 4.69148 15.3135 4.75628 15.1129 4.84109C14.712 5.01058 14.1596 5.26057 13.5528 5.58304C12.7213 6.02492 11.7692 6.61234 10.9657 7.32691ZM15.2808 5.44888C14.9001 5.61182 14.3958 5.84281 13.8461 6.13495C12.6627 6.7638 11.3072 7.65618 10.4998 8.73668C10.4046 8.86405 10.229 8.89965 10.0917 8.81939C9.95444 8.73914 9.89932 8.56862 9.96364 8.42322C10.5103 7.18737 10.6305 5.56864 10.6057 4.23041C10.5943 3.61231 10.5522 3.06309 10.5104 2.65278C10.5086 2.65523 10.5068 2.65767 10.5049 2.66013C10.2187 3.04194 9.82876 3.5652 9.414 4.13121C8.57994 5.26942 7.65956 6.56144 7.26954 7.23178L7.26891 7.23285C6.49411 8.55243 6.13886 9.93238 6.17428 11.0838C6.20989 12.2409 6.63363 13.1149 7.3549 13.5285C8.07962 13.9442 9.04745 13.8812 10.067 13.3477C11.0822 12.8166 12.1044 11.837 12.8796 10.517C13.2702 9.84561 13.9445 8.41156 14.5275 7.12963C14.8175 6.49184 15.0827 5.89678 15.2754 5.46112C15.2772 5.45702 15.279 5.45294 15.2808 5.44888Z" fill="white"/>
</svg>
