<svg width="16" height="16" viewBox="0 0 16 16" fill="none" xmlns="http://www.w3.org/2000/svg">
<path d="M8 5.33301V10.6663M5.33333 7.99967H10.6667M14.6667 7.99967C14.6667 11.6816 11.6819 14.6663 8 14.6663C4.3181 14.6663 1.33333 11.6816 1.33333 7.99967C1.33333 4.31778 4.3181 1.33301 8 1.33301C11.6819 1.33301 14.6667 4.31778 14.6667 7.99967Z" stroke="white" stroke-linecap="round" stroke-linejoin="round"/>
</svg>
