<svg width="294" height="268" viewBox="0 0 294 268" fill="none" xmlns="http://www.w3.org/2000/svg">
<path opacity="0.2" d="M1 261.104C10.7621 265.236 21.6122 266.102 32.0926 266.768C63.3838 268.759 93.7548 257.608 122.049 245.228C134.214 239.905 145.558 233.918 156.193 225.961C167.909 217.195 180.786 205.688 187.671 192.514C191.65 184.901 192.917 178.847 191.263 170.318C188.04 153.694 174.393 144.156 158.201 140.955C143.558 138.061 124.035 139.784 109.998 144.346C100.266 147.509 72.8363 159.551 79.9095 175.713C83.1861 183.2 92.5535 183.804 99.1058 183.689C116.001 183.394 134.245 175.484 149.008 168.083C163.771 160.683 179.443 150.48 192.422 140.493C215.842 122.473 238.094 101.874 256.461 78.6844C266.636 65.8385 272.417 56.4465 279.559 42.0001C282.17 36.7178 284.586 31.3282 286.666 25.8158C296.636 -0.617166 285.827 24.7167 293 1" stroke="white" stroke-linecap="round"/>
</svg>
