<svg width="246" height="336" viewBox="0 0 246 336" fill="none" xmlns="http://www.w3.org/2000/svg">
<path d="M1 104.291C3.6189 85.3782 13.2857 66.8844 26.9815 50.7218C42.1672 32.8009 61.9662 17.6639 88.358 8.30154C97.4713 5.06866 123.45 -3.00698 134.108 3.40691C141.589 7.90908 138.25 18.6348 137.309 23.2574C131.014 54.1666 115.925 83.968 103.796 113.808C96.3818 132.05 49.8948 217.674 94.3827 228.832C116.783 234.45 150.441 224.628 170.444 232.231C176.086 234.376 161.511 279.103 161.784 284.577C162.558 300.097 167.129 329.87 193.79 333.795C209.721 336.141 228.758 334.339 245 334.339" stroke="white" stroke-opacity="0.2" stroke-linecap="round"/>
</svg>
