<svg width="24" height="24" viewBox="0 0 24 24" xmlns="http://www.w3.org/2000/svg">
<path d="M11.1033 3.81651C11.4701 3.07334 12.5299 3.07334 12.8967 3.81651L14.8576 7.78897C15.0031 8.08382 15.2843 8.28827 15.6096 8.33583L19.9962 8.977C20.8161 9.09684 21.1429 10.1047 20.5493 10.6828L17.3768 13.7729C17.1409 14.0026 17.0333 14.3338 17.0889 14.6583L17.8374 19.0225C17.9775 19.8395 17.12 20.4624 16.3864 20.0766L12.4655 18.0147C12.1741 17.8614 11.8259 17.8614 11.5345 18.0147L7.61363 20.0766C6.88 20.4624 6.02245 19.8395 6.16257 19.0225L6.91109 14.6583C6.96675 14.3338 6.85908 14.0026 6.62321 13.7729L3.45068 10.6828C2.85708 10.1047 3.18387 9.09684 4.00378 8.977L8.39037 8.33583C8.71572 8.28827 8.99691 8.08382 9.14245 7.78897L11.1033 3.81651Z" stroke-width="1.99832" stroke-linecap="round" stroke-linejoin="round"/>
</svg>
