<svg width="12" height="12" viewBox="0 0 12 12" fill="none" xmlns="http://www.w3.org/2000/svg">
<path d="M9.5 4.5L6 8L2.5 4.5" stroke="#FF7C1B" stroke-linecap="round" stroke-linejoin="round"/>
</svg>
