<svg width="12" height="12" viewBox="0 0 12 12" fill="none" xmlns="http://www.w3.org/2000/svg">
<path d="M4.50039 8.87538C4.49989 8.87538 4.49938 8.87538 4.49888 8.87538C4.39888 8.87488 4.30339 8.83488 4.23289 8.76338L2.23289 6.73237C2.08739 6.58487 2.08939 6.34739 2.23689 6.20189C2.38439 6.05689 2.62239 6.05838 2.76739 6.20588L4.50189 7.96788L9.23488 3.23488C9.38138 3.08838 9.61889 3.08838 9.76539 3.23488C9.91189 3.38137 9.91189 3.61889 9.76539 3.76539L4.76539 8.76539C4.69539 8.83589 4.59989 8.87538 4.50039 8.87538Z" fill="#FF7C1B"/>
</svg>
