<svg width="44" height="44" viewBox="0 0 44 44" fill="none" xmlns="http://www.w3.org/2000/svg">
<path d="M22 8.80005C22.5835 8.80005 23.143 9.03183 23.5556 9.44441C23.9682 9.85699 24.2 10.4166 24.2 11V24.2C24.2 24.7835 23.9682 25.3431 23.5556 25.7557C23.143 26.1683 22.5835 26.4 22 26.4C21.4165 26.4 20.8569 26.1683 20.4444 25.7557C20.0318 25.3431 19.8 24.7835 19.8 24.2V11C19.8 10.4166 20.0318 9.85699 20.4444 9.44441C20.8569 9.03183 21.4165 8.80005 22 8.80005V8.80005ZM22 30.8C21.4165 30.8 20.8569 31.0318 20.4444 31.4444C20.0318 31.857 19.8 32.4166 19.8 33C19.8 33.5835 20.0318 34.1431 20.4444 34.5557C20.8569 34.9683 21.4165 35.2 22 35.2C22.5835 35.2 23.143 34.9683 23.5556 34.5557C23.9682 34.1431 24.2 33.5835 24.2 33C24.2 32.4166 23.9682 31.857 23.5556 31.4444C23.143 31.0318 22.5835 30.8 22 30.8Z" fill="#C65C5C"/>
<path fill-rule="evenodd" clip-rule="evenodd" d="M22 0C9.8494 0 0 9.8494 0 22C0 34.1506 9.8494 44 22 44C34.1506 44 44 34.1506 44 22C44 9.8494 34.1506 0 22 0ZM4.4 22C4.4 26.6678 6.25428 31.1444 9.55492 34.4451C12.8556 37.7457 17.3322 39.6 22 39.6C26.6678 39.6 31.1444 37.7457 34.4451 34.4451C37.7457 31.1444 39.6 26.6678 39.6 22C39.6 17.3322 37.7457 12.8556 34.4451 9.55492C31.1444 6.25428 26.6678 4.4 22 4.4C17.3322 4.4 12.8556 6.25428 9.55492 9.55492C6.25428 12.8556 4.4 17.3322 4.4 22V22Z" fill="#C65C5C"/>
</svg>
