<svg width="74" height="74" viewBox="0 0 74 74" fill="none" xmlns="http://www.w3.org/2000/svg">
<path d="M37 0C16.5655 0 0 16.5655 0 37C0 57.4345 16.5655 74 37 74C57.4344 74 74 57.4344 74 37C74 16.5655 57.4344 0 37 0ZM37 65.9565C21.0055 65.9565 8.04349 52.9904 8.04349 37C8.04349 21.0096 21.0055 8.04349 37 8.04349C52.9944 8.04349 65.9565 21.0096 65.9565 37C65.9565 52.9904 52.9944 65.9565 37 65.9565ZM44.2392 21.5163H29.7608V37.9652H20.712L37 53.288L53.288 37.9652H44.2391L44.2392 21.5163Z" fill="#009FDF"/>
</svg>
