<svg width="24" height="24" viewBox="0 0 24 24" xmlns="http://www.w3.org/2000/svg">
<path d="M2 5.99C1.46957 5.99 0.960859 6.20071 0.585786 6.57579C0.210714 6.95086 0 7.45957 0 7.99L0 16.004C0 16.5344 0.210714 17.0431 0.585786 17.4182C0.960859 17.7933 1.46957 18.004 2 18.004H4.8L12 24V0L4.8 5.99H2ZM10 4.268V19.729L5.525 16.007H2V7.993H5.525L10 4.268Z"/>
<path d="M20.0001 12.0004C19.9999 10.6737 19.4732 9.40125 18.5359 8.46236C17.5985 7.52346 16.3269 6.99482 15.0001 6.99243H14.0001V8.99243H15.0001C15.7971 8.99243 16.5614 9.30903 17.125 9.87257C17.6885 10.4361 18.0051 11.2005 18.0051 11.9974C18.0051 12.7944 17.6885 13.5587 17.125 14.1223C16.5614 14.6858 15.7971 15.0024 15.0001 15.0024H14.0001V17.0024H15.0001C16.3257 16.9998 17.5963 16.4719 18.5334 15.5343C19.4706 14.5968 19.998 13.326 20.0001 12.0004Z"/>
<path d="M15.0001 2.98427H14.0001V4.98427H15.0001C16.8598 4.98427 18.6433 5.72303 19.9584 7.03804C21.2734 8.35304 22.0121 10.1366 22.0121 11.9963C22.0121 13.856 21.2734 15.6395 19.9584 16.9545C18.6433 18.2695 16.8598 19.0083 15.0001 19.0083H14.0001V21.0083H15.0001C17.391 21.0083 19.684 20.0585 21.3747 18.3678C23.0653 16.6772 24.0151 14.3842 24.0151 11.9933C24.0151 9.60235 23.0653 7.30934 21.3747 5.6187C19.684 3.92806 17.391 2.97827 15.0001 2.97827V2.98427Z"/>
</svg>
