<svg width="15" height="17" viewBox="0 0 15 17" fill="none" xmlns="http://www.w3.org/2000/svg">
<path d="M0 10.5C0 9.67157 0.671573 9 1.5 9C2.32843 9 3 9.67157 3 10.5V15.5C3 16.3284 2.32843 17 1.5 17C0.671573 17 0 16.3284 0 15.5V10.5Z" fill="#2A286C"/>
<path d="M12 7.5C12 6.67157 12.6716 6 13.5 6C14.3284 6 15 6.67157 15 7.5V15.5C15 16.3284 14.3284 17 13.5 17C12.6716 17 12 16.3284 12 15.5V7.5Z" fill="#2A286C"/>
<path d="M6 1.5C6 0.671573 6.67157 0 7.5 0C8.32843 0 9 0.671573 9 1.5V15.5C9 16.3284 8.32843 17 7.5 17C6.67157 17 6 16.3284 6 15.5V1.5Z" fill="#2A286C"/>
</svg>
