<svg width="15" height="11" viewBox="0 0 15 11" fill="none" xmlns="http://www.w3.org/2000/svg">
<path fill-rule="evenodd" clip-rule="evenodd" d="M14.1056 1.9155L5.02113 11L0 5.97887L1.9155 4.06338L5.02113 7.16901L12.1901 0L14.1056 1.9155Z" fill="#E9AF3E"/>
</svg>
