<svg width="70" height="70" viewBox="0 0 70 70" fill="none" xmlns="http://www.w3.org/2000/svg">
<rect width="70" height="70" fill="white"/>
<path d="M58 35L20.5 56.6506V13.3494L58 35Z" fill="#ABA9EF"/>
</svg>
