<svg width="10" height="16" viewBox="0 0 10 16" fill="none" xmlns="http://www.w3.org/2000/svg">
<path fill-rule="evenodd" clip-rule="evenodd" d="M6.26463 0.925952C6.94691 0.243677 8.05309 0.243677 8.73537 0.925952C9.41764 1.60823 9.41764 2.71441 8.73537 3.39669L5.45318 6.67888C4.7709 7.36115 4.7709 8.46734 5.45318 9.14961L8.73537 12.4318C9.41764 13.1141 9.41764 14.2203 8.73537 14.9025C8.05309 15.5848 6.94691 15.5848 6.26463 14.9025L0.511706 9.14961C-0.170568 8.46734 -0.170569 7.36115 0.511705 6.67888L6.26463 0.925952Z" fill="#2A286C"/>
</svg>
