<svg width="13" height="9" viewBox="0 0 13 9" fill="none" xmlns="http://www.w3.org/2000/svg">
<line y1="8.5" x2="6" y2="8.5" stroke="black"/>
<line y1="4.5" x2="9" y2="4.5" stroke="black"/>
<line y1="0.5" x2="13" y2="0.5" stroke="black"/>
</svg>
