<svg width="692" height="739" viewBox="0 0 692 739" fill="none" xmlns="http://www.w3.org/2000/svg">
<g opacity="0.38">
<path d="M44.0306 85.0613C66.6912 85.0613 85.0615 66.6912 85.0615 44.0306C85.0615 21.37 66.6912 3 44.0306 3C21.37 3 3 21.37 3 44.0306C3 66.6912 21.37 85.0613 44.0306 85.0613Z" stroke="#2890CF" stroke-width="5.66722" stroke-miterlimit="10"/>
<path d="M163.099 85.0613C185.76 85.0613 204.13 66.6912 204.13 44.0306C204.13 21.37 185.76 3 163.099 3C140.438 3 122.068 21.37 122.068 44.0306C122.068 66.6912 140.438 85.0613 163.099 85.0613Z" stroke="#2890CF" stroke-width="5.66722" stroke-miterlimit="10"/>
<path d="M44.0306 193.532C66.6912 193.532 85.0615 175.162 85.0615 152.501C85.0615 129.841 66.6912 111.471 44.0306 111.471C21.37 111.471 3 129.841 3 152.501C3 175.162 21.37 193.532 44.0306 193.532Z" stroke="#2890CF" stroke-width="5.66722" stroke-miterlimit="10"/>
<path d="M163.099 193.532C185.76 193.532 204.13 175.162 204.13 152.501C204.13 129.841 185.76 111.471 163.099 111.471C140.438 111.471 122.068 129.841 122.068 152.501C122.068 175.162 140.438 193.532 163.099 193.532Z" stroke="#2890CF" stroke-width="5.66722" stroke-miterlimit="10"/>
<path d="M44.0306 302.002C66.6912 302.002 85.0615 283.632 85.0615 260.972C85.0615 238.311 66.6912 219.941 44.0306 219.941C21.37 219.941 3 238.311 3 260.972C3 283.632 21.37 302.002 44.0306 302.002Z" stroke="#2890CF" stroke-width="5.66722" stroke-miterlimit="10"/>
<path d="M163.099 302.002C185.76 302.002 204.13 283.632 204.13 260.972C204.13 238.311 185.76 219.941 163.099 219.941C140.438 219.941 122.068 238.311 122.068 260.972C122.068 283.632 140.438 302.002 163.099 302.002Z" stroke="#2890CF" stroke-width="5.66722" stroke-miterlimit="10"/>
<path d="M44.0306 410.473C66.6912 410.473 85.0615 392.103 85.0615 369.442C85.0615 346.782 66.6912 328.412 44.0306 328.412C21.37 328.412 3 346.782 3 369.442C3 392.103 21.37 410.473 44.0306 410.473Z" stroke="#2890CF" stroke-width="5.66722" stroke-miterlimit="10"/>
<path d="M163.099 410.473C185.76 410.473 204.13 392.103 204.13 369.442C204.13 346.782 185.76 328.412 163.099 328.412C140.438 328.412 122.068 346.782 122.068 369.442C122.068 392.103 140.438 410.473 163.099 410.473Z" stroke="#2890CF" stroke-width="5.66722" stroke-miterlimit="10"/>
<path d="M44.0306 518.944C66.6912 518.944 85.0615 500.574 85.0615 477.913C85.0615 455.252 66.6912 436.882 44.0306 436.882C21.37 436.882 3 455.252 3 477.913C3 500.574 21.37 518.944 44.0306 518.944Z" stroke="#2890CF" stroke-width="5.66722" stroke-miterlimit="10"/>
<path d="M163.099 518.944C185.76 518.944 204.13 500.574 204.13 477.913C204.13 455.252 185.76 436.882 163.099 436.882C140.438 436.882 122.068 455.252 122.068 477.913C122.068 500.574 140.438 518.944 163.099 518.944Z" stroke="#2890CF" stroke-width="5.66722" stroke-miterlimit="10"/>
<path d="M44.0306 627.414C66.6912 627.414 85.0615 609.044 85.0615 586.383C85.0615 563.722 66.6912 545.352 44.0306 545.352C21.37 545.352 3 563.722 3 586.383C3 609.044 21.37 627.414 44.0306 627.414Z" stroke="#2890CF" stroke-width="5.66722" stroke-miterlimit="10"/>
<path d="M163.099 627.414C185.76 627.414 204.13 609.044 204.13 586.383C204.13 563.722 185.76 545.352 163.099 545.352C140.438 545.352 122.068 563.722 122.068 586.383C122.068 609.044 140.438 627.414 163.099 627.414Z" stroke="#2890CF" stroke-width="5.66722" stroke-miterlimit="10"/>
<path d="M44.0306 735.884C66.6912 735.884 85.0615 717.514 85.0615 694.853C85.0615 672.193 66.6912 653.823 44.0306 653.823C21.37 653.823 3 672.193 3 694.853C3 717.514 21.37 735.884 44.0306 735.884Z" stroke="#2890CF" stroke-width="5.66722" stroke-miterlimit="10"/>
<path d="M163.099 735.884C185.76 735.884 204.13 717.514 204.13 694.853C204.13 672.193 185.76 653.823 163.099 653.823C140.438 653.823 122.068 672.193 122.068 694.853C122.068 717.514 140.438 735.884 163.099 735.884Z" stroke="#2890CF" stroke-width="5.66722" stroke-miterlimit="10"/>
<path d="M286.134 85.0613C308.795 85.0613 327.165 66.6912 327.165 44.0306C327.165 21.37 308.795 3 286.134 3C263.474 3 245.104 21.37 245.104 44.0306C245.104 66.6912 263.474 85.0613 286.134 85.0613Z" stroke="#2890CF" stroke-width="5.66722" stroke-miterlimit="10"/>
<path d="M405.146 85.0613C427.806 85.0613 446.176 66.6912 446.176 44.0306C446.176 21.37 427.806 3 405.146 3C382.485 3 364.115 21.37 364.115 44.0306C364.115 66.6912 382.485 85.0613 405.146 85.0613Z" stroke="#2890CF" stroke-width="5.66722" stroke-miterlimit="10"/>
<path d="M286.134 193.532C308.795 193.532 327.165 175.162 327.165 152.501C327.165 129.841 308.795 111.471 286.134 111.471C263.474 111.471 245.104 129.841 245.104 152.501C245.104 175.162 263.474 193.532 286.134 193.532Z" stroke="#2890CF" stroke-width="5.66722" stroke-miterlimit="10"/>
<path d="M405.146 193.532C427.806 193.532 446.176 175.162 446.176 152.501C446.176 129.841 427.806 111.471 405.146 111.471C382.485 111.471 364.115 129.841 364.115 152.501C364.115 175.162 382.485 193.532 405.146 193.532Z" stroke="#2890CF" stroke-width="5.66722" stroke-miterlimit="10"/>
<path d="M286.134 302.002C308.795 302.002 327.165 283.632 327.165 260.972C327.165 238.311 308.795 219.941 286.134 219.941C263.474 219.941 245.104 238.311 245.104 260.972C245.104 283.632 263.474 302.002 286.134 302.002Z" stroke="#2890CF" stroke-width="5.66722" stroke-miterlimit="10"/>
<path d="M405.146 302.002C427.806 302.002 446.176 283.632 446.176 260.972C446.176 238.311 427.806 219.941 405.146 219.941C382.485 219.941 364.115 238.311 364.115 260.972C364.115 283.632 382.485 302.002 405.146 302.002Z" stroke="#2890CF" stroke-width="5.66722" stroke-miterlimit="10"/>
<path d="M286.134 410.473C308.795 410.473 327.165 392.103 327.165 369.442C327.165 346.782 308.795 328.412 286.134 328.412C263.474 328.412 245.104 346.782 245.104 369.442C245.104 392.103 263.474 410.473 286.134 410.473Z" stroke="#2890CF" stroke-width="5.66722" stroke-miterlimit="10"/>
<path d="M405.146 410.473C427.806 410.473 446.176 392.103 446.176 369.442C446.176 346.782 427.806 328.412 405.146 328.412C382.485 328.412 364.115 346.782 364.115 369.442C364.115 392.103 382.485 410.473 405.146 410.473Z" stroke="#2890CF" stroke-width="5.66722" stroke-miterlimit="10"/>
<path d="M286.134 518.944C308.795 518.944 327.165 500.574 327.165 477.913C327.165 455.252 308.795 436.882 286.134 436.882C263.474 436.882 245.104 455.252 245.104 477.913C245.104 500.574 263.474 518.944 286.134 518.944Z" stroke="#2890CF" stroke-width="5.66722" stroke-miterlimit="10"/>
<path d="M405.146 518.944C427.806 518.944 446.176 500.574 446.176 477.913C446.176 455.252 427.806 436.882 405.146 436.882C382.485 436.882 364.115 455.252 364.115 477.913C364.115 500.574 382.485 518.944 405.146 518.944Z" stroke="#2890CF" stroke-width="5.66722" stroke-miterlimit="10"/>
<path d="M286.134 627.414C308.795 627.414 327.165 609.044 327.165 586.383C327.165 563.722 308.795 545.352 286.134 545.352C263.474 545.352 245.104 563.722 245.104 586.383C245.104 609.044 263.474 627.414 286.134 627.414Z" stroke="#2890CF" stroke-width="5.66722" stroke-miterlimit="10"/>
<path d="M405.146 627.414C427.806 627.414 446.176 609.044 446.176 586.383C446.176 563.722 427.806 545.352 405.146 545.352C382.485 545.352 364.115 563.722 364.115 586.383C364.115 609.044 382.485 627.414 405.146 627.414Z" stroke="#2890CF" stroke-width="5.66722" stroke-miterlimit="10"/>
<path d="M286.134 735.884C308.795 735.884 327.165 717.514 327.165 694.853C327.165 672.193 308.795 653.823 286.134 653.823C263.474 653.823 245.104 672.193 245.104 694.853C245.104 717.514 263.474 735.884 286.134 735.884Z" stroke="#2890CF" stroke-width="5.66722" stroke-miterlimit="10"/>
<path d="M405.146 735.884C427.806 735.884 446.176 717.514 446.176 694.853C446.176 672.193 427.806 653.823 405.146 653.823C382.485 653.823 364.115 672.193 364.115 694.853C364.115 717.514 382.485 735.884 405.146 735.884Z" stroke="#2890CF" stroke-width="5.66722" stroke-miterlimit="10"/>
<path d="M528.181 85.0613C550.842 85.0613 569.212 66.6912 569.212 44.0306C569.212 21.37 550.842 3 528.181 3C505.521 3 487.15 21.37 487.15 44.0306C487.15 66.6912 505.521 85.0613 528.181 85.0613Z" stroke="#2890CF" stroke-width="5.66722" stroke-miterlimit="10"/>
<path d="M647.249 85.0613C669.91 85.0613 688.28 66.6912 688.28 44.0306C688.28 21.37 669.91 3 647.249 3C624.588 3 606.218 21.37 606.218 44.0306C606.218 66.6912 624.588 85.0613 647.249 85.0613Z" stroke="#2890CF" stroke-width="5.66722" stroke-miterlimit="10"/>
<path d="M528.181 193.532C550.842 193.532 569.212 175.162 569.212 152.501C569.212 129.841 550.842 111.471 528.181 111.471C505.521 111.471 487.15 129.841 487.15 152.501C487.15 175.162 505.521 193.532 528.181 193.532Z" stroke="#2890CF" stroke-width="5.66722" stroke-miterlimit="10"/>
<path d="M647.249 193.532C669.91 193.532 688.28 175.162 688.28 152.501C688.28 129.841 669.91 111.471 647.249 111.471C624.588 111.471 606.218 129.841 606.218 152.501C606.218 175.162 624.588 193.532 647.249 193.532Z" stroke="#2890CF" stroke-width="5.66722" stroke-miterlimit="10"/>
<path d="M528.181 302.002C550.842 302.002 569.212 283.632 569.212 260.972C569.212 238.311 550.842 219.941 528.181 219.941C505.521 219.941 487.15 238.311 487.15 260.972C487.15 283.632 505.521 302.002 528.181 302.002Z" stroke="#2890CF" stroke-width="5.66722" stroke-miterlimit="10"/>
<path d="M647.249 302.002C669.91 302.002 688.28 283.632 688.28 260.972C688.28 238.311 669.91 219.941 647.249 219.941C624.588 219.941 606.218 238.311 606.218 260.972C606.218 283.632 624.588 302.002 647.249 302.002Z" stroke="#2890CF" stroke-width="5.66722" stroke-miterlimit="10"/>
<path d="M528.181 410.473C550.842 410.473 569.212 392.103 569.212 369.442C569.212 346.782 550.842 328.412 528.181 328.412C505.521 328.412 487.15 346.782 487.15 369.442C487.15 392.103 505.521 410.473 528.181 410.473Z" stroke="#2890CF" stroke-width="5.66722" stroke-miterlimit="10"/>
<path d="M647.249 410.473C669.91 410.473 688.28 392.103 688.28 369.442C688.28 346.782 669.91 328.412 647.249 328.412C624.588 328.412 606.218 346.782 606.218 369.442C606.218 392.103 624.588 410.473 647.249 410.473Z" stroke="#2890CF" stroke-width="5.66722" stroke-miterlimit="10"/>
<path d="M528.181 518.944C550.842 518.944 569.212 500.574 569.212 477.913C569.212 455.252 550.842 436.882 528.181 436.882C505.521 436.882 487.15 455.252 487.15 477.913C487.15 500.574 505.521 518.944 528.181 518.944Z" stroke="#2890CF" stroke-width="5.66722" stroke-miterlimit="10"/>
<path d="M647.249 518.944C669.91 518.944 688.28 500.574 688.28 477.913C688.28 455.252 669.91 436.882 647.249 436.882C624.588 436.882 606.218 455.252 606.218 477.913C606.218 500.574 624.588 518.944 647.249 518.944Z" stroke="#2890CF" stroke-width="5.66722" stroke-miterlimit="10"/>
<path d="M528.181 627.414C550.842 627.414 569.212 609.044 569.212 586.383C569.212 563.722 550.842 545.352 528.181 545.352C505.521 545.352 487.15 563.722 487.15 586.383C487.15 609.044 505.521 627.414 528.181 627.414Z" stroke="#2890CF" stroke-width="5.66722" stroke-miterlimit="10"/>
<path d="M647.249 627.414C669.91 627.414 688.28 609.044 688.28 586.383C688.28 563.722 669.91 545.352 647.249 545.352C624.588 545.352 606.218 563.722 606.218 586.383C606.218 609.044 624.588 627.414 647.249 627.414Z" stroke="#2890CF" stroke-width="5.66722" stroke-miterlimit="10"/>
<path d="M528.181 735.884C550.842 735.884 569.212 717.514 569.212 694.853C569.212 672.193 550.842 653.823 528.181 653.823C505.521 653.823 487.15 672.193 487.15 694.853C487.15 717.514 505.521 735.884 528.181 735.884Z" stroke="#2890CF" stroke-width="5.66722" stroke-miterlimit="10"/>
<path d="M647.249 735.884C669.91 735.884 688.28 717.514 688.28 694.853C688.28 672.193 669.91 653.823 647.249 653.823C624.588 653.823 606.218 672.193 606.218 694.853C606.218 717.514 624.588 735.884 647.249 735.884Z" stroke="#2890CF" stroke-width="5.66722" stroke-miterlimit="10"/>
</g>
</svg>
