<svg width="80" height="80" viewBox="0 0 80 80" fill="none" xmlns="http://www.w3.org/2000/svg">
<g clip-path="url(#clip0)">
<path d="M67.3196 60.4365L67.3187 60.4332C67.1006 59.6631 66.6654 58.8927 66.1149 58.3373L54.1243 46.2407L50.0766 34.6025L52.4216 33.7836L63.9339 41.2497C65.8147 42.4775 68.3554 41.9186 69.5702 40.0245C70.7852 38.1302 70.2336 35.57 68.3556 34.3441L68.3542 34.3432L55.1872 25.8711C55.1865 25.8706 55.1858 25.8701 55.1851 25.8697C54.1912 25.2022 52.8653 24.9777 51.645 25.4245C34.7982 31.2497 33.7821 31.6919 32.5815 32.2144C31.9544 32.4873 31.277 32.7821 28.2672 33.8773L19.9379 32.4426C18.8477 30.7529 16.9354 29.5952 14.8078 29.5952C11.4526 29.5952 8.75 32.3249 8.75 35.7044C8.75 39.0838 11.4526 41.8135 14.8078 41.8135C16.2832 41.8135 17.5523 41.2952 18.6102 40.468L28.0422 42.0195L28.0422 42.0195L28.0472 42.0202C28.8214 42.1318 29.4839 42.0188 30.133 41.8005L30.1331 41.8007L30.1434 41.7967L34.7758 40.0069L38.0882 49.6268L34.5058 62.1209L19.8576 71.5912L19.8563 71.5921C17.6708 73.0252 17.0101 75.8981 18.435 78.1096C19.855 80.3136 22.7053 80.9829 24.9006 79.5438C24.9008 79.5437 24.901 79.5436 24.9012 79.5434L41.0787 69.0815L41.0788 69.0815L41.0825 69.079C42.0625 68.4199 42.7212 67.5355 43.0494 66.4317L43.05 66.4298L46.8509 53.2679L47.5126 53.0454L58.5579 64.1884L62.0654 76.7813C62.0656 76.782 62.0658 76.7828 62.066 76.7836C62.7259 79.3304 65.3571 80.76 67.8677 80.0993L67.8704 80.0986C70.2807 79.4354 71.8178 76.8936 71.0522 74.3484L67.3196 60.4365ZM64.5206 76.1354L64.5207 76.1354L64.5192 76.13L61.001 63.1854C60.9951 63.049 60.9552 62.9254 60.8699 62.8178C60.7935 62.7215 60.6927 62.6538 60.5911 62.5995L48.7959 50.5956L48.7951 50.5948C48.4442 50.2408 47.9127 50.0601 47.4696 50.3356L45.4266 51.057C45.4259 51.0572 45.4253 51.0574 45.4247 51.0577C45.005 51.1997 44.7603 51.604 44.6466 51.9479L44.6465 51.9479L44.6441 51.9561L40.5993 65.7671L40.5962 65.7778L40.594 65.7887C40.5067 66.2291 40.1445 66.701 39.7622 66.9927L23.5919 77.45C23.5918 77.45 23.5916 77.4501 23.5915 77.4502C22.5665 78.108 21.2708 77.8268 20.6197 76.7946C19.9611 75.7505 20.2549 74.4536 21.2547 73.9035L21.2627 73.8991L21.2704 73.8941L36.4015 64.066C36.6496 63.9366 36.924 63.6707 36.9401 63.2597C39.5775 54.182 40.4572 51.2064 40.716 50.3317L40.7337 50.2719C40.7848 50.0991 40.8082 50.0203 40.8138 49.9989L40.8165 49.9877C40.817 49.9855 40.8181 49.9806 40.8191 49.9744L40.8213 49.959C40.822 49.9517 40.8228 49.9314 40.8224 49.9184C40.8204 49.9012 40.804 49.8577 40.7781 49.8126V49.8124V49.8112V49.81V49.8087V49.8075V49.8063V49.8051V49.8038V49.8026V49.8014V49.8002V49.7989V49.7977V49.7965V49.7953V49.794V49.7928V49.7916V49.7904V49.7891V49.7879V49.7867V49.7854V49.7842V49.783V49.7818V49.7805V49.7793V49.7781V49.7769V49.7756V49.7744V49.7732V49.772V49.7707V49.7695V49.7683V49.7671V49.7658V49.7646V49.7634V49.7622V49.7609V49.7597V49.7585V49.7572V49.756V49.7548V49.7536V49.7523V49.7511V49.7499V49.7487V49.7474V49.7462V49.745V49.7438V49.7425V49.7413V49.7401V49.7389V49.7376V49.7364V49.7352V49.734V49.7327V49.7315V49.7303V49.729V49.7278V49.7266V49.7254V49.7241V49.7229V49.7217V49.7205V49.7192V49.718V49.7168V49.7156V49.7143V49.7131V49.7119V49.7107V49.7094V49.7082V49.707V49.7058V49.7045V49.7033V49.7021V49.7008V49.6996V49.6984V49.6972V49.6959V49.6947V49.6935V49.6923V49.691V49.6898V49.6886V49.6874V49.6861V49.6849V49.6837V49.6825V49.6812V49.68V49.6788V49.6776V49.6763V49.6751V49.6739V49.6726V49.6714V49.6702V49.669V49.6677V49.6665V49.6653V49.6641V49.6628V49.6616V49.6604V49.6592V49.6579V49.6567V49.6555V49.6543V49.653V49.6518V49.6506V49.6493V49.6481V49.6469V49.6457V49.6444V49.6432V49.642V49.6408V49.6395V49.6383V49.6371V49.6359V49.6346V49.6334V49.6322V49.631V49.6297V49.6285V49.6273V49.6261V49.6248V49.6236V49.6224V49.6211V49.6199V49.6187V49.6175V49.6162V49.615V49.6138V49.6126V49.6113V49.6101V49.6089V49.6077V49.6064V49.6052V49.604V49.6028V49.6015V49.6003V49.5991V49.5979V49.5966V49.5954V49.5942V49.5929V49.5917V49.5905V49.5893V49.588V49.5868V49.5856V49.5844V49.5831V49.5819V49.5807V49.5795V49.5782V49.577V49.5758V49.5746V49.5733V49.5721V49.5709V49.5697V49.5684V49.5672V49.566V49.5647V49.5635V49.5623V49.5611V49.5598V49.5586V49.5574V49.5562V49.5549V49.5537V49.5525V49.5513V49.55V49.5488V49.5476V49.5464V49.5451V49.5439V49.5427V49.5415V49.5402V49.539V49.5378V49.5365V49.5353V49.5341V49.5329V49.5316V49.5304V49.5292V49.528V49.5267V49.5255V49.5243V49.5231V49.5218V49.5206V49.5194V49.5182V49.5169V49.5157V49.5145V49.5133V49.512V49.5108V49.5096V49.5083V49.5071V49.5059V49.5047V49.5034V49.5022V49.501V49.4998V49.4985V49.4973V49.4961V49.4949V49.4936V49.4924V49.4912V49.49V49.4887V49.4875V49.4863V49.4851V49.4838V49.4826V49.4814V49.4801V49.4789V49.4777V49.4765V49.4752V49.474V49.4728V49.4716V49.4703V49.4691V49.4679V49.4667V49.4654V49.4642V49.463V49.4618V49.4605V49.4593V49.4581V49.4568V49.4556V49.4544V49.4532V49.4519V49.4507V49.4495V49.4483V49.447V49.4458V49.4446V49.4434V49.4421V49.4409V49.4397V49.4385V49.4372V49.436V49.4348V49.4336V49.4323V49.4311V49.4299V49.4286V49.4274V49.4262V49.425V49.4237V49.4225V49.4213V49.4201V49.4188V49.4176V49.4164V49.4152V49.4139V49.4127V49.4115V49.4103V49.409V49.4078V49.4066V49.4054V49.4041V49.4029V49.4017V49.4004V49.3992V49.398V49.3968V49.3955V49.3943V49.3931V49.3919V49.3906V49.3894V49.3882V49.387V49.3857V49.3845V49.3833V49.3821V49.3808V49.3796V49.3784V49.3772V49.3759V49.3747V49.3735V49.3722V49.371V49.3698V49.3686V49.3673V49.3661V49.3649V49.3637V49.3624V49.3612V49.36V49.3588V49.3575V49.3563V49.3551V49.3539V49.3526V49.3514V49.3502V49.3489V49.3477V49.3465V49.3453V49.344V49.3428V49.3416V49.3404V49.3391V49.3379V49.3367V49.3355V49.3342V49.333V49.3318V49.3306V49.3293V49.3281V49.3269V49.3257V49.3244V49.3232V49.322V49.3207V49.3195V49.3183V49.3171V49.3158V49.3146V49.3134V49.3122V49.3109V49.3097V49.3085V49.3073V49.306V49.2633L40.7639 49.223L36.8229 38.0278L36.8231 38.0277L36.8195 38.0187C36.5684 37.3854 35.8112 36.9836 35.1469 37.2506C35.1463 37.2508 35.1458 37.251 35.1453 37.2512L29.2804 39.5349H29.2795H29.2782H29.2769H29.2756H29.2743H29.273H29.2716H29.2703H29.269H29.2677H29.2664H29.265H29.2637H29.2624H29.261H29.2597H29.2584H29.257H29.2557H29.2544H29.253H29.2517H29.2503H29.249H29.2476H29.2463H29.2449H29.2435H29.2422H29.2408H29.2395H29.2381H29.2367H29.2353H29.234H29.2326H29.2312H29.2298H29.2285H29.2271H29.2257H29.2243H29.2229H29.2215H29.2201H29.2187H29.2173H29.2159H29.2145H29.2131H29.2117H29.2103H29.2089H29.2075H29.2061H29.2047H29.2033H29.2018H29.2004H29.199H29.1976H29.1961H29.1947H29.1933H29.1919H29.1904H29.189H29.1875H29.1861H29.1847H29.1832H29.1818H29.1803H29.1789H29.1774H29.176H29.1745H29.1731H29.1716H29.1701H29.1687H29.1672H29.1657H29.1643H29.1628H29.1613H29.1599H29.1584H29.1569H29.1554H29.154H29.1525H29.151H29.1495H29.148H29.1465H29.145H29.1435H29.142H29.1406H29.1391H29.1376H29.1361H29.1346H29.133H29.1315H29.13H29.1285H29.127H29.1255H29.124H29.1225H29.1209H29.1194H29.1179H29.1164H29.1149H29.1133H29.1118H29.1103H29.1087H29.1072H29.1057H29.1041H29.1026H29.1011H29.0995H29.098H29.0964H29.0949H29.0933H29.0918H29.0902H29.0887H29.0871H29.0856H29.084H29.0825H29.0809H29.0793H29.0778H29.0762H29.0746H29.0731H29.0715H29.0699H29.0683H29.0668H29.0652H29.0636H29.062H29.0605H29.0589H29.0573H29.0557H29.0541H29.0525H29.0509H29.0494H29.0478H29.0462H29.0446H29.043H29.0414H29.0398H29.0382H29.0366H29.035H29.0334H29.0318H29.0302H29.0285H29.0269H29.0253H29.0237H29.0221H29.0205H29.0189H29.0172H29.0156H29.014H29.0124H29.0107H29.0091H29.0075H29.0059H29.0042H29.0026H29.001H28.9993H28.9977H28.9961H28.9944H28.9928H28.9911H28.9895H28.9879H28.9862H28.9846H28.9829H28.9813H28.9796H28.978H28.9763H28.9747H28.973H28.9714H28.9697H28.968H28.9664H28.9647H28.9631H28.9614H28.9597H28.9581H28.9564H28.9547H28.9531H28.9514H28.9497H28.948H28.9464H28.9447H28.943H28.9413H28.9397H28.938H28.9363H28.9346H28.9329H28.9313H28.9296H28.9279H28.9262H28.9245H28.9228H28.9211H28.9194H28.9177H28.916H28.9144H28.9127H28.911H28.9093H28.9076H28.9059H28.9042H28.9025H28.9007H28.899H28.8973H28.8956H28.8939H28.8922H28.8905H28.8888H28.8871H28.8854H28.8836H28.8819H28.8802H28.8785H28.8768H28.8751H28.8733H28.8716H28.8699H28.8682H28.8664H28.8647H28.863H28.8613H28.8595H28.8578H28.8561H28.8544H28.8526H28.8509H28.8492H28.8474H28.8457H28.844H28.8422H28.8405H28.8387H28.837H28.8353H28.8335H28.8318H28.83H28.8283H28.8265H28.8248H28.823H28.8213H28.8196H28.8178H28.8161H28.8143H28.8125H28.8108H28.809H28.8073H28.8055H28.8038H28.802H28.8003H28.7985H28.7967H28.795H28.7932H28.7915H28.7897H28.7879H28.7862H28.7844H28.7827H28.7809H28.7791H28.7774H28.7756H28.7738H28.772H28.7703H28.7685H28.7667H28.765H28.7632H28.7614H28.7596H28.7579H28.7561H28.7543H28.7525H28.7508H28.749H28.7472H28.7454H28.7436H28.7419H28.7401H28.7383H28.7365H28.7347H28.733H28.7312H28.7294H28.7276H28.7258H28.724H28.7222H28.7205H28.7187H28.7169H28.7151H28.7133H28.7115H28.7097H28.7079H28.7061H28.7043H28.7025H28.7008H28.699H28.6972H28.6954H28.6936H28.6918H28.69H28.6882H28.6864H28.6846H28.6828H28.681H28.6792H28.6774H28.6756H28.6738H28.672H28.6702H28.6684H28.6666H28.6648H28.663H28.6612H28.6594H28.6576H28.6558H28.6539H28.6521H28.6503H28.6485H28.6467H28.6449H28.6431H28.6413H28.6395H28.6377H28.6359H28.6341H28.6322H28.6304H28.6286H28.6268H28.625H28.6232H28.6214H28.6196H28.6178H28.6159H28.6141H28.6123H28.6105H28.6087H28.6069H28.6051H28.6032H28.6014H28.5996H28.5978H28.596H28.5942H28.5923H28.5905H28.5887H28.5869H28.5851H28.5833H28.5814H28.5796H28.5778H28.576H28.5742H28.5723H28.5705H28.5687H28.5669H28.5651H28.5633H28.5614H28.5596H28.5578H28.556H28.5541H28.5523H28.5505H28.5487H28.5469H28.545H28.5432H28.5414H28.5396H28.5378H28.5359H28.5341H28.5323H28.5305H28.5286H28.5268H28.525H28.5232H28.5214H28.5195H28.5178H28.5177L20.4625 38.2306C20.8559 37.3192 21.0251 36.3322 20.9093 35.2733L28.2499 36.4742L28.2699 36.4775H28.2902H28.2915H28.2927H28.2939H28.2951H28.2963H28.2975H28.2987H28.2999H28.3011H28.3023H28.3035H28.3047H28.3058H28.307H28.3082H28.3094H28.3106H28.3117H28.3129H28.3141H28.3153H28.3164H28.3176H28.3187H28.3199H28.3211H28.3222H28.3234H28.3245H28.3257H28.3268H28.328H28.3291H28.3302H28.3314H28.3325H28.3337H28.3348H28.3359H28.3371H28.3382H28.3393H28.3404H28.3415H28.3427H28.3438H28.3449H28.346H28.3471H28.3482H28.3493H28.3504H28.3515H28.3526H28.3537H28.3548H28.3559H28.357H28.3581H28.3592H28.3603H28.3614H28.3625H28.3636H28.3646H28.3657H28.3668H28.3679H28.369H28.37H28.3711H28.3722H28.3732H28.3743H28.3754H28.3764H28.3775H28.3785H28.3796H28.3807H28.3817H28.3828H28.3838H28.3849H28.3859H28.387H28.388H28.3891H28.3901H28.3911H28.3922H28.3932H28.3942H28.3953H28.3963H28.3973H28.3984H28.3994H28.4004H28.4015H28.4025H28.4035H28.4045H28.4055H28.4066H28.4076H28.4086H28.4096H28.4106H28.4116H28.4126H28.4136H28.4146H28.4157H28.4167H28.4177H28.4187H28.4197H28.4207H28.4217H28.4227H28.4237H28.4246H28.4256H28.4266H28.4276H28.4286H28.4296H28.4306H28.4316H28.4326H28.4335H28.4345H28.4355H28.4365H28.4375H28.4384H28.4394H28.4404H28.4414H28.4423H28.4433H28.4443H28.4453H28.4462H28.4472H28.4482H28.4491H28.4501H28.4511H28.452H28.453H28.4539H28.4549H28.4559H28.4568H28.4578H28.4587H28.4597H28.4606H28.4616H28.4625H28.4635H28.4645H28.4654H28.4664H28.4673H28.4682H28.4692H28.4701H28.4711H28.472H28.473H28.4739H28.4749H28.4758H28.4767H28.4777H28.4786H28.4796H28.4805H28.4814H28.4824H28.4833H28.4842H28.4852H28.4861H28.487H28.488H28.4889H28.4898H28.4908H28.4917H28.4926H28.4936H28.4945H28.4954H28.4963H28.4973H28.4982H28.4991H28.5H28.501H28.5019H28.5028H28.5037H28.5047H28.5056H28.5065H28.5074H28.5084H28.5093H28.5102H28.5111H28.512H28.513H28.5139H28.5148H28.5157H28.5166H28.5175H28.5185H28.5194H28.5203H28.5212H28.5221H28.523H28.524H28.5249H28.5258H28.5267H28.5276H28.5285H28.5294H28.5304H28.5313H28.5322H28.5331H28.534H28.5349H28.5358H28.5367H28.5377H28.5386H28.5395H28.5404H28.5413H28.5422H28.5431H28.544H28.545H28.5459H28.5468H28.5477H28.5486H28.5495H28.5504H28.5513H28.5522H28.5532H28.5541H28.555H28.5559H28.5568H28.5577H28.5586H28.5595H28.5605H28.5614H28.5623H28.5632H28.5641H28.565H28.5659H28.5668H28.5678H28.5687H28.5696H28.5705H28.5714H28.5723H28.5732H28.5742H28.5751H28.576H28.5769H28.5778H28.5787H28.5797H28.5806H28.5815H28.5824H28.5833H28.5842H28.5852H28.5861H28.587H28.5879H28.5888H28.5898H28.5907H28.5916H28.5925H28.5934H28.5944H28.5953H28.5962H28.5971H28.5981H28.599H28.5999H28.6008H28.6018H28.6027H28.6036H28.6045H28.6055H28.6064H28.6073H28.6083H28.6092H28.6101H28.6111H28.612H28.6129H28.6139H28.6148H28.6157H28.6167H28.6176H28.6185H28.6195H28.6204H28.6213H28.6223H28.6232H28.6242H28.6251H28.6261H28.627H28.6279H28.6289H28.6298H28.6308H28.6317H28.6327H28.6336H28.6346H28.6355H28.6365H28.6374H28.6384H28.6393H28.6403H28.6413H28.6422H28.6432H28.6441H28.6451H28.6461H28.647H28.648H28.6489H28.6499H28.6509H28.6518H28.6528H28.6538H28.6547H28.6557H28.6567H28.6577H28.6586H28.6596H28.6606H28.6616H28.6625H28.6635H28.6645H28.6655H28.6665H28.6675H28.6684H28.6694H28.6704H28.6714H28.6724H28.6734H28.6744H28.6754H28.6764H28.6774H28.6784H28.6794H28.6804H28.6814H28.6824H28.6834H28.6844H28.6854H28.6864H28.6874H28.6884H28.6894H28.6904H28.6915H28.6925H28.6935H28.6945H28.6955H28.6966H28.6976H28.6986H28.6996H28.7007H28.7017H28.7027H28.7038H28.7048H28.7058H28.7069H28.7079H28.7089H28.71H28.711H28.7121H28.7131H28.7142H28.7152H28.7163H28.7173H28.7184H28.7194H28.7205H28.7215H28.7226H28.7237H28.7247H28.7258H28.7269H28.7279H28.729H28.7301H28.7311H28.7322H28.7333H28.7344H28.7355H28.7365H28.7376H28.7387H28.7398H28.7409H28.742H28.7431H28.7442H28.7453H28.7464H28.7475H28.7486H28.7497H28.7508H28.7519H28.753H28.7541H28.7552H28.7564H28.7575H28.7586H28.7597H28.7609H28.762H28.7631H28.7642H28.7654H28.7665H28.7676H28.7688H28.7699H28.7711H28.7722H28.7734H28.7745H28.7757H28.7768H28.778H28.7791H28.7803H28.7814H28.7826H28.7838H28.7849H28.7861H28.7873H28.7885H28.7896H28.7908H28.792H28.7932H28.7944H28.7956H28.7968H28.7979H28.7991H28.8003H28.8015H28.8027H28.8039H28.8052H28.8064H28.8076H28.8088H28.853L28.8945 36.4623C32.2612 35.2338 33.0222 34.9149 33.641 34.6555C34.8169 34.1626 35.4795 33.8848 52.5366 27.9889L52.5367 27.9892L52.5484 27.9844C52.9765 27.8117 53.4032 27.8942 53.756 28.1612L53.763 28.1665L53.7704 28.1713L66.9417 36.7509L66.9448 36.7528C67.6507 37.1979 67.8353 38.088 67.3842 38.8162C66.943 39.5283 66.0647 39.7124 65.3463 39.2605C65.3457 39.2602 65.3452 39.2598 65.3447 39.2595L53.3204 31.4164C53.3199 31.4161 53.3194 31.4157 53.3189 31.4154C52.9291 31.1539 52.5336 31.1592 52.1678 31.2822L52.1642 31.2835L48.0158 32.7483L48.0157 32.748L48.0055 32.7522C47.3763 33.0061 46.9826 33.7666 47.2422 34.4308L51.7931 47.5782C51.8043 47.6754 51.8445 47.7744 51.8809 47.8476C51.9274 47.9415 51.9934 48.0446 52.0697 48.1217C52.0698 48.1217 52.0698 48.1218 52.0699 48.1219L64.2033 60.4673L64.2041 60.468C64.4927 60.7592 64.6712 61.0349 64.7613 61.3984L64.7612 61.3984L64.7626 61.4035L68.4962 75.2145L68.4999 75.2282L68.5051 75.2414C68.8576 76.1304 68.2371 77.3456 67.1207 77.6272C65.9987 77.9102 64.7956 77.245 64.5206 76.1354ZM11.3242 35.7044C11.3242 33.7478 12.8737 32.1877 14.8078 32.1877C16.7419 32.1877 18.2914 33.7478 18.2914 35.7044C18.2914 37.6609 16.7419 39.221 14.8078 39.221C12.8737 39.221 11.3242 37.6609 11.3242 35.7044Z" fill="url(#paint0_linear)" stroke="url(#paint1_linear)" stroke-width="0.5"/>
<path d="M33.7869 28.735C38.1792 28.735 41.7115 25.1683 41.7115 20.7425C41.7115 16.3167 38.1792 12.75 33.7869 12.75C29.3946 12.75 25.8623 16.3167 25.8623 20.7425C25.8623 25.1683 29.3946 28.735 33.7869 28.735ZM33.7869 15.4472C36.7581 15.4472 39.1373 17.8443 39.1373 20.8471C39.1373 23.85 36.7581 26.2471 33.7869 26.2471C30.8157 26.2471 28.4365 23.85 28.4365 20.8471C28.4365 17.8443 30.8157 15.4472 33.7869 15.4472Z" fill="url(#paint2_linear)" stroke="url(#paint3_linear)" stroke-width="0.5"/>
</g>
<defs>
<linearGradient id="paint0_linear" x1="-3.84286" y1="53.4145" x2="70.3851" y2="53.497" gradientUnits="userSpaceOnUse">
<stop stop-color="#EC0A15"/>
<stop offset="1" stop-color="#233BDB"/>
</linearGradient>
<linearGradient id="paint1_linear" x1="-3.84286" y1="53.4145" x2="70.3851" y2="53.497" gradientUnits="userSpaceOnUse">
<stop stop-color="#EC0A15"/>
<stop offset="1" stop-color="#233BDB"/>
</linearGradient>
<linearGradient id="paint2_linear" x1="22.9328" y1="20.9313" x2="41.3093" y2="20.9492" gradientUnits="userSpaceOnUse">
<stop stop-color="#EC0A15"/>
<stop offset="1" stop-color="#233BDB"/>
</linearGradient>
<linearGradient id="paint3_linear" x1="22.9328" y1="20.9313" x2="41.3093" y2="20.9492" gradientUnits="userSpaceOnUse">
<stop stop-color="#EC0A15"/>
<stop offset="1" stop-color="#233BDB"/>
</linearGradient>
<clipPath id="clip0">
<rect width="80" height="80" fill="white"/>
</clipPath>
</defs>
</svg>
