<svg width="32" height="32" viewBox="0 0 32 32" fill="none" xmlns="http://www.w3.org/2000/svg">
<circle cx="16" cy="16" r="16" fill="#4167AF"/>
<path d="M20.1836 17.375L20.6758 14.1406H17.5469V12.0312C17.5469 11.1172 17.9688 10.2734 19.375 10.2734H20.8164V7.49609C20.8164 7.49609 19.5156 7.25 18.2852 7.25C15.7188 7.25 14.0312 8.83203 14.0312 11.6445V14.1406H11.1484V17.375H14.0312V25.25H17.5469V17.375H20.1836Z" fill="white"/>
</svg>
