<svg width="484" height="762" viewBox="0 0 484 762" fill="none" xmlns="http://www.w3.org/2000/svg">
<path opacity="0.1" d="M636.902 673.892L82.5646 396.041L600.36 54.8956L636.902 673.892Z" stroke="url(#paint0_linear)" stroke-width="61"/>
<defs>
<linearGradient id="paint0_linear" x1="485.066" y1="965.896" x2="426.921" y2="-35.6925" gradientUnits="userSpaceOnUse">
<stop stop-color="#EC0A15"/>
<stop offset="1" stop-color="#233BDB"/>
</linearGradient>
</defs>
</svg>
