<svg width="80" height="80" viewBox="0 0 80 80" fill="none" xmlns="http://www.w3.org/2000/svg">
<path d="M61.9204 27.0796C56.0651 21.2246 48.2804 18 40 18C31.7196 18 23.9349 21.2246 18.0796 27.0796C12.2246 32.9349 9 40.7196 9 49C9 57.2804 12.2246 65.0651 18.0796 70.9204C23.9349 76.7754 31.7196 80 40 80C48.2804 80 56.0651 76.7754 61.9204 70.9204C67.7754 65.0651 71 57.2804 71 49C71 40.7196 67.7754 32.9349 61.9204 27.0796ZM67.3121 47.2774H50.6756C50.8772 43.9392 51.6646 40.7097 53.028 37.6553C54.4448 34.4813 56.4147 31.6402 58.8874 29.1956C59.0434 29.3447 59.1983 29.4954 59.3514 29.6485C64.1123 34.4093 66.9011 40.6156 67.3121 47.2774ZM49.7261 61.8598C51.2802 65.3301 53.4179 68.4464 56.0885 71.1439C51.9246 74.1827 47.011 75.9683 41.8164 76.3064V50.9103H47.0475C47.2728 54.7086 48.1695 58.3839 49.7261 61.8598ZM30.2679 36.1269C28.7141 32.6617 26.5787 29.5497 23.9116 26.8559C28.0755 23.8172 32.989 22.0318 38.1836 21.6936V47.2774H32.9647C32.758 43.4074 31.8539 39.6639 30.2679 36.1269ZM47.0354 47.2774H41.8164V21.6936C47.0112 22.0318 51.9249 23.8175 56.089 26.8564C53.4091 29.5634 51.2657 32.6913 49.7107 36.1746C48.1381 39.6977 47.2412 43.4251 47.0354 47.2774ZM32.9525 50.9103H38.1836V76.3064C32.9889 75.9682 28.0753 74.1827 23.9114 71.1438C26.5839 68.4444 28.7228 65.3256 30.277 61.8528C31.8317 58.379 32.7274 54.7059 32.9525 50.9103ZM20.6485 29.6485C20.8016 29.4954 20.9563 29.3448 21.1124 29.1957C23.5735 31.6287 25.537 34.4552 26.9531 37.6132C28.3281 40.6798 29.1219 43.9235 29.3244 47.2774H12.6879C13.0989 40.6156 15.8877 34.4093 20.6485 29.6485ZM12.6993 50.9103H29.3121C29.0921 54.1908 28.3055 57.3647 26.9611 60.3688C25.5447 63.5337 23.5785 66.3663 21.1124 68.8043C20.9563 68.6553 20.8016 68.5046 20.6485 68.3515C15.9324 63.6354 13.1507 57.501 12.6993 50.9103ZM59.3515 68.3515C59.1984 68.5046 59.0436 68.6553 58.8876 68.8043C56.4232 66.368 54.458 63.5375 53.0417 60.3749C51.6956 57.369 50.908 54.193 50.6879 50.9101H67.3007C66.8493 57.501 64.0676 63.6354 59.3515 68.3515Z" fill="url(#paint0_linear)"/>
<defs>
<linearGradient id="paint0_linear" x1="-3.84286" y1="49.7561" x2="70.3851" y2="49.8287" gradientUnits="userSpaceOnUse">
<stop stop-color="#EC0A15"/>
<stop offset="1" stop-color="#233BDB"/>
</linearGradient>
</defs>
</svg>
