<svg width="32" height="32" viewBox="0 0 32 32" fill="none" xmlns="http://www.w3.org/2000/svg">
<circle cx="16" cy="16" r="15.5" stroke="#193D6A"/>
<path d="M25.0352 11.3984C25.1406 10.9766 25.0352 10.625 24.4023 10.625H22.3281C21.8008 10.625 21.5547 10.9062 21.4141 11.2227C21.4141 11.2227 20.3594 13.7891 18.8828 15.4766C18.3906 15.9336 18.1797 16.1094 17.8984 16.1094C17.793 16.1094 17.582 15.9336 17.582 15.5117V11.3984C17.582 10.8711 17.4414 10.625 16.9844 10.625H13.75C13.3984 10.625 13.2227 10.8711 13.2227 11.1172C13.2227 11.6094 13.9609 11.7148 14.0312 13.1211V16.1797C14.0312 16.8477 13.9258 16.9883 13.6445 16.9883C12.9414 16.9883 11.2539 14.3867 10.2344 11.4336C10.0234 10.8711 9.8125 10.625 9.28516 10.625H7.21094C6.64844 10.625 6.50781 10.9062 6.50781 11.2227C6.50781 11.7852 7.21094 14.4922 9.77734 18.1133C11.5 20.5742 13.9258 21.875 16.1055 21.875C17.4062 21.875 17.582 21.5938 17.582 21.1016C17.582 18.7461 17.4766 18.5 18.1094 18.5C18.4258 18.5 18.9531 18.6758 20.1836 19.8711C21.5898 21.2773 21.8359 21.875 22.6094 21.875H24.6836C25.2812 21.875 25.5625 21.5938 25.3867 20.9961C25 19.8008 22.3633 17.2695 22.2227 17.0938C21.9062 16.707 22.0117 16.5312 22.2227 16.1797C22.2227 16.1797 24.7539 12.5938 25.0352 11.3984Z" fill="#193D6A"/>
</svg>
