<svg width="18" height="18" viewBox="0 0 18 18" fill="none" xmlns="http://www.w3.org/2000/svg">
<g opacity="0.85">
<path d="M14.8906 14.5742L11.582 11.2656C11.5 11.2109 11.418 11.1562 11.3359 11.1562H10.9805C11.8281 10.1719 12.375 8.85938 12.375 7.4375C12.375 4.32031 9.80469 1.75 6.6875 1.75C3.54297 1.75 1 4.32031 1 7.4375C1 10.582 3.54297 13.125 6.6875 13.125C8.10938 13.125 9.39453 12.6055 10.4062 11.7578V12.1133C10.4062 12.1953 10.4336 12.2773 10.4883 12.3594L13.7969 15.668C13.9336 15.8047 14.1523 15.8047 14.2617 15.668L14.8906 15.0391C15.0273 14.9297 15.0273 14.7109 14.8906 14.5742ZM6.6875 11.8125C4.25391 11.8125 2.3125 9.87109 2.3125 7.4375C2.3125 5.03125 4.25391 3.0625 6.6875 3.0625C9.09375 3.0625 11.0625 5.03125 11.0625 7.4375C11.0625 9.87109 9.09375 11.8125 6.6875 11.8125Z" fill="white"/>
</g>
</svg>
