<svg width="1336" height="600" viewBox="0 0 1336 600" fill="none" xmlns="http://www.w3.org/2000/svg">
<path d="M0 0H1335.5L734 600H0V0Z" fill="url(#paint0_radial_128_1009)"/>
<defs>
<radialGradient id="paint0_radial_128_1009" cx="0" cy="0" r="1" gradientUnits="userSpaceOnUse" gradientTransform="translate(-114.769 1004.31) rotate(-34.7196) scale(1499.13 5052.66)">
<stop stop-color="#F1F8E1"/>
<stop offset="0.411458" stop-color="#E4F3E8"/>
<stop offset="1" stop-color="#E0EEF7"/>
</radialGradient>
</defs>
</svg>
