<svg width="50" height="50" viewBox="0 0 50 50" fill="none" xmlns="http://www.w3.org/2000/svg">
<path d="M38.2009 19.2353C38.2009 19.0383 38.1352 18.8851 38.0258 18.7319C36.2309 14.2666 31.0652 11.2897 25.1114 11.2897C19.2233 11.2897 14.1451 14.2009 12.2627 18.5568C12.1094 18.7538 12 18.9726 12 19.2353V34.9734C12 36.3524 12.7661 37.3811 13.773 37.3811H36.4498C36.4717 37.3811 36.4936 37.3592 36.5155 37.3592H37.2597C37.7631 37.3592 38.179 36.9434 38.179 36.4399V35.1047C38.179 35.0609 38.2009 35.0171 38.2009 34.9734V19.2353ZM36.3185 20.1984V34.9953C36.3185 35.236 36.2747 35.4111 36.2309 35.5206H26.0307V20.1984H36.3185ZM25.1114 13.1502C29.708 13.1502 33.845 15.2078 35.7494 18.2941H14.4734C16.3778 15.2078 20.5366 13.1502 25.1114 13.1502ZM13.8824 34.9953V20.1984H24.1702V35.5206H13.9919C13.9481 35.4111 13.8824 35.236 13.8824 34.9953Z" fill="#0089C7"/>
<path d="M28.2854 31.4272C28.4605 31.6023 28.7013 31.6898 28.9421 31.6898C29.1829 31.6898 29.4236 31.6023 29.5988 31.4272L33.3199 27.7061C33.692 27.3339 33.692 26.7648 33.3199 26.3927C32.9477 26.0206 32.3786 26.0206 32.0065 26.3927L28.2854 30.1138C27.9133 30.464 27.9133 31.055 28.2854 31.4272Z" fill="#0089C7"/>
<path d="M31.5462 31.9964C31.1741 32.3685 31.1741 32.9376 31.5462 33.3097C31.7213 33.4848 31.9621 33.5724 32.2028 33.5724C32.4436 33.5724 32.6844 33.4848 32.8595 33.3097L34.6763 31.493C35.0484 31.1208 35.0484 30.5517 34.6763 30.1796C34.3042 29.8075 33.7351 29.8294 33.3629 30.1796L31.5462 31.9964Z" fill="#0089C7"/>
</svg>
