<svg width="50" height="50" viewBox="0 0 50 50" fill="none" xmlns="http://www.w3.org/2000/svg">
<path d="M36.1691 12H14.1732C12.9659 12 12 12.9659 12 14.1732V36.1691C12 37.3765 12.9659 38.3423 14.1732 38.3423H36.1691C37.3765 38.3423 38.3423 37.3765 38.3423 36.1691V14.1732C38.3423 12.9659 37.3765 12 36.1691 12ZM36.4764 14.1732V24.7102H26.0932V13.8659H36.1691C36.3447 13.8659 36.4764 13.9976 36.4764 14.1732ZM14.1732 13.8659H24.2272V24.7321H13.8659V14.1952C13.8659 13.9976 13.9976 13.8659 14.1732 13.8659ZM13.8659 36.1691V26.5761H24.2492V36.4764H14.1732C13.9976 36.4764 13.8659 36.3447 13.8659 36.1691ZM36.1691 36.4764H26.0932V26.5761H36.4764V36.1691C36.4764 36.3447 36.3447 36.4764 36.1691 36.4764Z" fill="#0089C7"/>
<path d="M28.0911 17.6197L31.8448 21.3735C32.0205 21.5491 32.2619 21.6369 32.5034 21.6369C32.7449 21.6369 32.9863 21.5491 33.162 21.3735C33.5351 21.0003 33.5351 20.4076 33.162 20.0564L29.4082 16.3026C29.035 15.9294 28.4642 15.9294 28.0911 16.3026C27.7179 16.6758 27.7398 17.2465 28.0911 17.6197Z" fill="#0089C7"/>
<path d="M33.7538 18.0805C33.9294 18.2561 34.1708 18.3439 34.4123 18.3439C34.6538 18.3439 34.8953 18.2561 35.0709 18.0805C35.4441 17.7073 35.4441 17.1366 35.0709 16.7634L33.2489 14.9414C32.8757 14.5682 32.3049 14.5902 31.9317 14.9414C31.5586 15.3146 31.5586 15.8853 31.9317 16.2585L33.7538 18.0805Z" fill="#0089C7"/>
<path d="M27.6954 27.2128C27.1905 27.2128 26.7734 27.6299 26.7734 28.1348V30.9885C26.7734 31.4934 27.1905 31.9105 27.6954 31.9105C28.2003 31.9105 28.6174 31.4934 28.6174 30.9885V28.1348C28.6394 27.6299 28.2223 27.2128 27.6954 27.2128Z" fill="#0089C7"/>
<path d="M22.3834 27.2128C21.8785 27.2128 21.4614 27.6299 21.4614 28.1348V30.9885C21.4614 31.4934 21.8785 31.9105 22.3834 31.9105C22.8883 31.9105 23.3054 31.4934 23.3054 30.9885V28.1348C23.3273 27.6299 22.9103 27.2128 22.3834 27.2128Z" fill="#0089C7"/>
</svg>
