<svg width="43" height="36" viewBox="0 0 43 36" fill="none" xmlns="http://www.w3.org/2000/svg">
<path d="M12.0691 7.47015L6.6665 12.6001C6.1294 13.1101 6.1294 13.8901 6.6665 14.4001C6.91925 14.6401 7.26679 14.7601 7.61433 14.7601C7.96187 14.7601 8.3094 14.6401 8.56216 14.4001L13.9648 9.27015C14.5019 8.76015 14.5019 7.98015 13.9648 7.47015C13.4277 6.96015 12.5746 6.96015 12.0691 7.47015Z" fill="#0089C7"/>
<path d="M9.22575 6.68982C9.76285 6.17982 9.76285 5.39982 9.22575 4.88982C8.68864 4.37982 7.86719 4.37982 7.33009 4.88982L4.70776 7.34982C4.17066 7.85982 4.17066 8.63982 4.70776 9.14982C4.96051 9.38982 5.30805 9.50983 5.65559 9.50983C6.00313 9.50983 6.35066 9.38982 6.60342 9.14982L9.22575 6.68982Z" fill="#0089C7"/>
<path d="M36.5862 26.16C31.8471 26.16 27.9926 22.5 27.9926 18C27.9926 13.5 31.8471 9.84 36.5862 9.84C37.3129 9.84 37.9132 9.27 37.9132 8.58V2.97C37.9132 1.32 36.523 0 34.7853 0H18.9566H3.12784C1.39015 0 0 1.32 0 2.97V33.03C0 34.68 1.39015 36 3.12784 36H18.9566H34.7853C36.523 36 37.9132 34.65 37.9132 33.03V27.45C37.9132 26.73 37.3129 26.16 36.5862 26.16ZM2.68552 33.03V2.97C2.68552 2.73 2.87508 2.55 3.12784 2.55H17.6296V33.45H3.12784C2.87508 33.45 2.68552 33.27 2.68552 33.03ZM35.2276 33.03C35.2276 33.27 35.0381 33.45 34.7853 33.45H20.2835V2.55H34.7853C35.0381 2.55 35.2276 2.73 35.2276 2.97V7.38C29.6355 7.98 25.2754 12.51 25.2754 18C25.2754 23.49 29.6355 28.02 35.2276 28.65V33.03Z" fill="#0089C7"/>
<path d="M41.673 16.7397H37.9133V13.1697C37.9133 12.4797 37.313 11.9097 36.5864 11.9097C35.8597 11.9097 35.2594 12.4797 35.2594 13.1697V16.7397H31.4681C30.7414 16.7397 30.1411 17.3097 30.1411 17.9997C30.1411 18.6897 30.7414 19.2597 31.4681 19.2597H35.2278V22.8297C35.2278 23.5197 35.8281 24.0897 36.5548 24.0897C37.2814 24.0897 37.9133 23.5497 37.9133 22.8297V19.2597H41.673C42.3997 19.2597 43 18.6897 43 17.9997C43 17.3097 42.3997 16.7397 41.673 16.7397Z" fill="#0089C7"/>
</svg>
