<svg width="50" height="50" viewBox="0 0 50 50" fill="none" xmlns="http://www.w3.org/2000/svg">
<path d="M36.6039 12H14.2123C12.9833 12 12 12.9567 12 14.1525V35.9389C12 37.1348 12.9833 38.0915 14.2123 38.0915H36.6039C37.833 38.0915 38.8162 37.1348 38.8162 35.9389V14.1525C38.8162 12.9567 37.833 12 36.6039 12ZM13.8995 35.9389V14.1525C13.8995 13.9786 14.0336 13.8481 14.2123 13.8481H24.4695V36.2433H14.2123C14.0336 36.2433 13.8995 36.1129 13.8995 35.9389ZM36.9167 35.9389C36.9167 36.1129 36.7827 36.2433 36.6039 36.2433H26.3467V13.8481H36.6039C36.7827 13.8481 36.9167 13.9786 36.9167 14.1525V35.9389Z" fill="#0089C7"/>
<path d="M33.8333 27.1117C33.4534 26.7421 32.8724 26.7421 32.4925 27.1117L28.6712 30.8297C28.2913 31.1994 28.2913 31.7647 28.6712 32.1343C28.8499 32.3082 29.0957 32.3952 29.3416 32.3952C29.5874 32.3952 29.8332 32.3082 30.012 32.1343L33.8333 28.4163C34.1908 28.0684 34.1908 27.4813 33.8333 27.1117Z" fill="#0089C7"/>
<path d="M33.855 30.8946L32.0003 32.6992C31.6204 33.0689 31.6204 33.6342 32.0003 34.0038C32.179 34.1778 32.4248 34.2647 32.6707 34.2647C32.9165 34.2647 33.1623 34.1778 33.3411 34.0038L35.1959 32.1992C35.5758 31.8295 35.5758 31.2642 35.1959 30.8946C34.8383 30.5467 34.2349 30.5467 33.855 30.8946Z" fill="#0089C7"/>
</svg>
