<svg width="15" height="16" viewBox="0 0 15 16" fill="none" xmlns="http://www.w3.org/2000/svg">
<path d="M14.9998 4.86783C14.9927 4.9581 14.9864 5.04863 14.9784 5.1389C14.9226 5.76676 14.7573 6.35766 14.4837 6.91159C14.289 7.30535 14.046 7.65892 13.7591 7.97607C12.5389 9.32313 11.3184 10.6699 10.0979 12.017C9.61001 12.5554 9.1209 13.0922 8.63518 13.6327C8.39802 13.8966 8.01693 13.8269 7.87104 13.5063C7.78244 13.3113 7.8157 13.0753 7.95746 12.9175C8.22155 12.6237 8.48711 12.3317 8.75218 12.0392C9.66147 11.0356 10.571 10.0322 11.4803 9.02849C12.0141 8.4392 12.552 7.85473 13.0797 7.25901C13.5409 6.73856 13.8324 6.11364 13.9417 5.39524C14.1169 4.24425 13.8572 3.22022 13.1596 2.34218C12.6889 1.74994 12.0949 1.37682 11.3963 1.21074C11.0441 1.1269 10.688 1.10976 10.3305 1.15771C9.55928 1.2611 8.90729 1.6278 8.35724 2.23156C7.37003 3.31505 6.37772 4.39264 5.38735 5.47265C4.13482 6.83874 2.88157 8.20375 1.62977 9.57063C1.24722 9.98849 1.02196 10.4958 0.95472 11.0848C0.829467 12.1825 1.35184 13.2454 2.2507 13.7294C2.62597 13.9314 3.02333 14.0184 3.43914 13.9852C4.02414 13.9386 4.52515 13.6831 4.94241 13.228C6.15052 11.9107 7.35862 10.5931 8.56673 9.27572C9.44956 8.31303 10.3322 7.35035 11.215 6.38766C11.4114 6.17337 11.6107 5.9623 11.8024 5.74292C12.0311 5.48149 12.1556 5.16488 12.1808 4.80274C12.2265 4.14916 11.91 3.5513 11.3735 3.27299C10.8572 3.00513 10.222 3.11522 9.81488 3.55558C9.36145 4.04603 8.9153 4.54479 8.46648 5.04006C7.19453 6.44338 5.92283 7.84696 4.65064 9.25001C4.51592 9.39867 4.35232 9.44474 4.17172 9.38126C3.98724 9.3167 3.87898 9.16965 3.85106 8.95884C3.82873 8.79036 3.87655 8.64223 3.98578 8.52116C4.28144 8.19384 4.57758 7.86732 4.87372 7.54079C5.59392 6.74606 6.31412 5.95105 7.03457 5.15631C7.73535 4.383 8.43492 3.60835 9.13789 2.83745C9.51195 2.42709 9.96514 2.1895 10.4875 2.1137C11.6886 1.93959 12.8338 2.83692 13.0722 4.14541C13.2219 4.96774 13.0511 5.7081 12.5641 6.35257C12.4309 6.52882 12.275 6.68445 12.1267 6.8465C11.0674 8.00258 10.0076 9.15786 8.94782 10.3134C7.83123 11.5311 6.7144 12.7482 5.59805 13.9662C5.20408 14.3961 4.74337 14.7017 4.21177 14.875C3.76344 15.021 3.30709 15.0607 2.8437 14.991C1.61594 14.8067 0.606148 13.9054 0.18864 12.6173C0.0405699 12.16 -0.0210854 11.6878 0.00634394 11.2027C0.059018 10.2652 0.390112 9.4667 0.994528 8.8067C1.90965 7.80758 2.82574 6.80954 3.74159 5.81123C5.11111 4.31845 6.47846 2.82352 7.85065 1.33423C8.42497 0.710918 9.11386 0.313683 9.9013 0.126449C10.3084 0.0294842 10.7198 0.00269827 11.1349 0.0415379C11.867 0.109842 12.5408 0.365915 13.1457 0.825562C14.0545 1.51637 14.6395 2.45683 14.8942 3.64371C14.9505 3.90568 14.9825 4.17193 14.9939 4.44113C14.9947 4.45666 14.9978 4.47193 15 4.4872C14.9998 4.61416 14.9998 4.74113 14.9998 4.86783Z" fill="#019E36"/>
</svg>
