<svg width="38" height="39" viewBox="0 0 38 39" fill="none" xmlns="http://www.w3.org/2000/svg">
<path d="M8.35009 13.8505C9.66991 17.4488 11.665 20.6308 14.2432 23.4856C17.0363 26.6081 20.4126 28.9871 24.3414 30.6524C24.4642 30.3253 24.5563 29.9982 24.6483 29.7008C25.2008 28.095 25.9375 26.5783 27.0731 25.2699C27.4721 24.7941 27.9325 24.3777 28.5157 24.0804C28.9147 23.8722 29.2831 23.8425 29.7128 24.0209C30.6643 24.4075 31.493 24.9725 32.3217 25.5375C33.9178 26.6676 35.3911 27.9165 36.6188 29.4332C37.202 30.1469 37.7238 30.9201 37.9386 31.8122C38 32.1393 38 32.4962 38 32.853C38 33.1504 37.8465 33.3883 37.6317 33.5965C36.5267 34.6968 35.4217 35.8268 34.3168 36.9271C33.7643 37.4922 33.1197 37.968 32.4138 38.3546C31.186 39.0385 29.8662 39.1277 28.5157 38.8601C27.0731 38.5627 25.6919 38.0274 24.4028 37.3732C22.0087 36.1837 19.6453 34.9942 17.3126 33.6857C16.1769 33.0612 15.164 32.2285 14.1512 31.4554C11.665 29.5521 9.45506 27.411 7.61345 24.913C6.07878 22.9206 4.88173 20.7794 3.80746 18.6086C3.19359 17.3596 2.54903 16.1403 2.02724 14.8616C1.41337 13.3747 0.891577 11.8878 0.400482 10.3712C0.00146645 9.24113 -0.152001 8.05161 0.185627 6.8621C0.492562 5.79153 1.13713 4.89939 1.90446 4.06673C3.22428 2.66905 4.72826 1.50927 6.26294 0.379229C6.87681 -0.0668401 7.58276 -0.0965779 8.3194 0.171063C9.11743 0.468443 9.76199 1.03346 10.3452 1.62822C11.4194 2.69879 12.2789 3.91804 13.0769 5.19677C13.7521 6.2376 14.366 7.3379 15.0106 8.40847C15.4403 9.12218 15.3175 9.77641 14.8571 10.4009C14.3353 11.0551 13.6294 11.531 12.8927 11.9473C11.5115 12.7205 10.0382 13.2855 8.53426 13.791C8.47287 13.791 8.44217 13.8208 8.35009 13.8505Z" fill="white"/>
</svg>
