<svg width="13" height="15" viewBox="0 0 13 15" fill="none" xmlns="http://www.w3.org/2000/svg">
<path d="M6.18591 0C9.20937 0 11.7751 1.9987 12.2861 4.73838C12.467 5.73286 12.2648 6.66883 11.8709 7.58531C11.3386 8.82353 10.6466 9.98375 9.85878 11.0952C9.07098 12.2164 8.24059 13.3084 7.4102 14.4101C6.81402 15.1999 5.60038 15.1901 4.98291 14.4199C3.65216 12.7527 2.38529 11.0465 1.33134 9.21352C0.884204 8.45304 0.500948 7.68281 0.224152 6.85408C-0.201688 5.56711 0.000585944 4.31914 0.649992 3.14917C1.65072 1.34547 3.26891 0.311992 5.46198 0.0292493C5.57909 0.0194995 5.70684 0.00974976 5.83459 0C5.9517 0 6.0688 0 6.18591 0ZM6.19656 3.19792C4.76999 3.18817 3.63087 4.23139 3.62023 5.52811C3.62023 6.83458 4.7487 7.8778 6.16462 7.88755C7.59118 7.8973 8.74095 6.86383 8.74095 5.56711C8.7516 4.25089 7.62312 3.19792 6.19656 3.19792Z" fill="#9D9D9C"/>
</svg>
