<svg width="32" height="31" viewBox="0 0 32 31" fill="none" xmlns="http://www.w3.org/2000/svg">
<path d="M14.2255 1.59775C15.0508 -0.120147 17.497 -0.120149 18.3223 1.59775L21.3292 7.85678C21.6605 8.54634 22.3165 9.02295 23.0746 9.12493L29.9565 10.0505C31.8454 10.3046 32.6013 12.631 31.2225 13.9467L26.199 18.7406C25.6455 19.2688 25.395 20.0399 25.5323 20.7925L26.7786 27.6236C27.1207 29.4985 25.1417 30.9363 23.4643 30.0316L17.3527 26.7354C16.6793 26.3722 15.8685 26.3722 15.1952 26.7354L9.08355 30.0316C7.40612 30.9363 5.42715 29.4985 5.76923 27.6236L7.01555 20.7925C7.15286 20.0399 6.90229 19.2688 6.34885 18.7406L1.32534 13.9467C-0.0534437 12.631 0.702451 10.3046 2.5913 10.0505L9.47318 9.12493C10.2314 9.02295 10.8874 8.54635 11.2186 7.85678L14.2255 1.59775Z" fill="#E7E7F1"/>
</svg>
