<svg width="22" height="22" viewBox="0 0 22 22" xmlns="http://www.w3.org/2000/svg">
<path fill-rule="evenodd" clip-rule="evenodd" d="M13.7855 11.09L9.2605 15.776C8.97215 16.0747 8.50463 16.0747 8.21627 15.776C7.92791 15.4774 7.92791 14.9933 8.21627 14.6946L12.2659 10.4994L8.21627 6.30536C7.92791 6.00674 7.92791 5.52258 8.21627 5.22396C8.50463 4.92535 8.97215 4.92535 9.2605 5.22396L13.7855 9.91001C13.9166 10.0457 14 10.22 14 10.4757C14 10.7364 13.9205 10.9502 13.7855 11.09Z"/>
</svg>
