<svg width="24" height="24" viewBox="0 0 24 24" fill="none" xmlns="http://www.w3.org/2000/svg">
<path d="M20.25 12L3.75 12" stroke-width="2" stroke-linecap="round" stroke-linejoin="round"/>
<path d="M10.5 18.75L3.75 12L10.5 5.25"  stroke-width="2" stroke-linecap="round" stroke-linejoin="round"/>
</svg>
