<svg width="32" height="32" viewBox="0 0 32 32" fill="none" xmlns="http://www.w3.org/2000/svg">
<path d="M27 16H5" stroke="#776345" stroke-width="2" stroke-linecap="round" stroke-linejoin="round"/>
<path d="M14 7L5 16L14 25" stroke="#776345" stroke-width="2" stroke-linecap="round" stroke-linejoin="round"/>
</svg>
