<svg width="24" height="24" viewBox="0 0 24 24" fill="none" xmlns="http://www.w3.org/2000/svg">
<rect width="24" height="24" fill="white" fill-opacity="0.01" style="mix-blend-mode:multiply"/>
<path fill-rule="evenodd" clip-rule="evenodd" d="M18.707 9.70712L11.9999 16.4142L5.29282 9.70712L6.70703 8.29291L11.9999 13.5858L17.2928 8.29291L18.707 9.70712Z" fill="#0043A4"/>
</svg>
