<svg width="920" height="920" viewBox="0 0 920 920" fill="none" xmlns="http://www.w3.org/2000/svg">
<circle cx="459.905" cy="459.905" r="379.905" stroke="url(#paint0_radial_439_3997)" stroke-width="160"/>
<circle cx="459.905" cy="459.905" r="379.905" stroke="url(#paint1_radial_439_3997)" stroke-width="160"/>
<defs>
<radialGradient id="paint0_radial_439_3997" cx="0" cy="0" r="1" gradientUnits="userSpaceOnUse" gradientTransform="translate(67.9987 504.506) rotate(-3.93498) scale(1129.39 652.028)">
<stop offset="0.229167" stop-color="#1BB8AB"/>
<stop offset="0.681155" stop-color="#0473C6"/>
<stop offset="0.974401" stop-color="#016CCA"/>
</radialGradient>
<radialGradient id="paint1_radial_439_3997" cx="0" cy="0" r="1" gradientUnits="userSpaceOnUse" gradientTransform="translate(459.174 525.71) rotate(-26.982) scale(763.866 648.954)">
<stop stop-color="#24D49F"/>
<stop offset="0.305032" stop-color="#0069CA"/>
<stop offset="0.535741" stop-color="#0069CA"/>
</radialGradient>
</defs>
</svg>
