<svg width="237" height="135" viewBox="0 0 215 198" fill="none" xmlns="http://www.w3.org/2000/svg">
<path opacity="0.1" d="M61.42 139.7C80.4961 139.7 96.9838 132.356 108.662 119.473C120.308 106.625 126.9 88.5813 126.9 67.56H116.9C116.9 86.4986 110.982 102.025 101.253 112.757C91.5562 123.454 77.8039 129.7 61.42 129.7V139.7ZM126.9 67.56C126.9 46.5377 120.308 28.5349 108.656 15.7299C96.9728 2.89114 80.4854 -4.4 61.42 -4.4V5.6C77.8146 5.6 91.5672 11.8089 101.259 22.4601C110.982 33.1451 116.9 48.6223 116.9 67.56H126.9ZM61.42 -4.4C42.3566 -4.4 25.828 2.88932 14.1015 15.7221C2.4032 28.524 -4.24 46.5281 -4.24 67.56H5.76C5.76 48.6319 11.7168 33.156 21.4836 22.4678C31.222 11.8107 45.0234 5.6 61.42 5.6V-4.4ZM-4.24 67.56C-4.24 88.5909 2.4024 106.636 14.095 119.481C25.817 132.358 42.346 139.7 61.42 139.7V129.7C45.034 129.7 31.233 123.452 21.49 112.749C11.7176 102.014 5.76 86.4891 5.76 67.56H-4.24ZM61.42 97.3C56.5893 97.3 52.4419 94.982 49.294 90.1613C46.0491 85.1919 43.92 77.5547 43.92 67.56H33.92C33.92 78.8053 36.2909 88.5381 40.921 95.6287C45.6481 102.868 52.7507 107.3 61.42 107.3V97.3ZM43.92 67.56C43.92 57.5653 46.0491 49.9281 49.294 44.9587C52.4419 40.138 56.5893 37.82 61.42 37.82V27.82C52.7507 27.82 45.6481 32.252 40.921 39.4913C36.2909 46.5819 33.92 56.3147 33.92 67.56H43.92ZM61.42 37.82C66.1467 37.82 70.3043 40.1253 73.4857 44.9696C76.7536 49.9458 78.92 57.5842 78.92 67.56H88.92C88.92 56.2958 86.4964 46.5642 81.8443 39.4804C77.1057 32.2647 70.0133 27.82 61.42 27.82V37.82ZM78.92 67.56C78.92 77.5358 76.7536 85.1742 73.4857 90.1504C70.3043 94.9947 66.1467 97.3 61.42 97.3V107.3C70.0133 107.3 77.1057 102.855 81.8443 95.6396C86.4964 88.5558 88.92 78.8242 88.92 67.56H78.92ZM133.651 132H128.651V137H133.651V132ZM233.191 132V137H238.191V132H233.191ZM233.191 104.64H238.191V99.64H233.191V104.64ZM184.591 104.64H179.591V109.64H184.591V104.64ZM184.591 102.84L181.473 98.9307L179.591 100.432V102.84H184.591ZM212.131 80.88L215.248 84.7893L215.248 84.7892L212.131 80.88ZM236.611 42H241.611V41.9813L241.61 41.9627L236.611 42ZM134.191 52.44L129.195 52.6494L129.396 57.44H134.191V52.44ZM167.311 52.44V57.44H172.182L172.309 52.5698L167.311 52.44ZM187.291 65.94L190.481 69.7896L190.513 69.7632L190.545 69.7363L187.291 65.94ZM133.651 110.4L130.46 106.55L128.651 108.05V110.4H133.651ZM133.651 137H233.191V127H133.651V137ZM238.191 132V104.64H228.191V132H238.191ZM233.191 99.64H184.591V109.64H233.191V99.64ZM189.591 104.64V102.84H179.591V104.64H189.591ZM187.708 106.749L215.248 84.7893L209.013 76.9707L181.473 98.9307L187.708 106.749ZM215.248 84.7892C229.635 73.3157 241.611 60.31 241.611 42H231.611C231.611 55.37 223.066 65.7643 209.013 76.9708L215.248 84.7892ZM241.61 41.9627C241.404 14.3076 217.436 -4.4 186.931 -4.4V5.6C213.665 5.6 231.457 21.4524 231.611 42.0373L241.61 41.9627ZM186.931 -4.4C169.933 -4.4 155.127 1.45748 144.707 11.6779C134.265 21.9199 128.509 36.2753 129.195 52.6494L139.186 52.2306C138.613 38.5447 143.387 26.9801 151.709 18.8171C160.054 10.6325 172.248 5.6 186.931 5.6V-4.4ZM134.191 57.44H167.311V47.44H134.191V57.44ZM172.309 52.5698C172.465 46.5452 174.247 42.2203 176.664 39.4791C179.033 36.7922 182.283 35.3 186.211 35.3V25.3C179.518 25.3 173.499 27.9478 169.163 32.8659C164.874 37.7297 162.516 44.4747 162.312 52.3102L172.309 52.5698ZM186.211 35.3C193.082 35.3 197.231 39.6268 197.231 45.42H207.231C207.231 33.5732 198.059 25.3 186.211 25.3V35.3ZM197.231 45.42C197.231 47.7802 196.362 49.9365 194.198 52.5813C191.907 55.3815 188.563 58.264 184.037 62.1437L190.545 69.7363C194.838 66.056 198.964 62.5485 201.938 58.9137C205.039 55.1234 207.231 50.7997 207.231 45.42H197.231ZM184.1 62.0904L130.46 106.55L136.841 114.25L190.481 69.7896L184.1 62.0904ZM128.651 110.4V132H138.651V110.4H128.651Z" fill="url(#paint0_radial_1732_32334)"/>
<defs>
<radialGradient id="paint0_radial_1732_32334" cx="0" cy="0" r="1" gradientUnits="userSpaceOnUse" gradientTransform="translate(-32.7875 226.8) rotate(-42.3242) scale(371.663 1406.06)">
<stop stop-color="#4EA6F8"/>
<stop offset="0.223958" stop-color="#5ADDC5"/>
<stop offset="0.5" stop-color="#519DF5"/>
<stop offset="0.959244" stop-color="#2A1A8F"/>
</radialGradient>
</defs>
</svg>
