<svg width="14" height="16" viewBox="0 0 14 16" fill="none" xmlns="http://www.w3.org/2000/svg">
<path fill-rule="evenodd" clip-rule="evenodd" d="M7.00033 0.583008C7.39383 0.583008 7.71282 0.902005 7.71282 1.29551V9.94622L11.3257 6.33336C11.6039 6.05512 12.0551 6.05512 12.3333 6.33337C12.6116 6.61162 12.6116 7.06275 12.3333 7.34099L7.50414 12.1702C7.22589 12.4484 6.77476 12.4484 6.49651 12.1702L1.66735 7.34099C1.3891 7.06274 1.3891 6.61162 1.66735 6.33337C1.9456 6.05512 2.39673 6.05512 2.67498 6.33337L6.28783 9.94621V1.29551C6.28783 0.902005 6.60682 0.583008 7.00033 0.583008ZM0.666992 14.833C0.666992 14.4395 0.985989 14.1205 1.37949 14.1205H12.6212C13.0147 14.1205 13.3337 14.4395 13.3337 14.833C13.3337 15.2265 13.0147 15.5455 12.6212 15.5455H1.37949C0.985989 15.5455 0.666992 15.2265 0.666992 14.833Z" fill="white"/>
</svg>
