<svg width="284" height="169" viewBox="0 0 284 169" fill="none" xmlns="http://www.w3.org/2000/svg">
<path d="M281.5 97.9818V95.4818H279H260.339V7.54165V5.04165H257.839H225.462H224.282L223.532 5.95278L146.293 99.7818L145.724 100.474V101.371V128.693V131.193H148.224H220.423V161.099V163.599H222.923H257.839H260.339V161.099V131.193H279H281.5V128.693V97.9818ZM70.8114 166.353C92.9422 166.353 110.106 158.409 121.674 143.914C133.177 129.503 138.911 108.914 138.911 84.0028C138.911 59.1957 133.176 38.8114 121.664 24.5815C110.088 10.2722 92.9242 2.5 70.8114 2.5C48.5968 2.5 31.3797 10.2694 19.7756 24.5793C8.23559 38.8101 2.5 59.1958 2.5 84.0028C2.5 108.914 8.23457 129.504 19.7652 143.916C31.3619 158.412 48.5789 166.353 70.8114 166.353ZM70.8114 135.513C62.7537 135.513 56.0317 131.842 51.19 123.708C46.2565 115.42 43.2625 102.438 43.2625 84.0028C43.2625 65.6724 46.2569 52.9143 51.178 44.8206C56.0007 36.8886 62.7145 33.3401 70.8114 33.3401C78.7915 33.3401 85.4551 36.8785 90.2569 44.8158C95.1547 52.912 98.1488 65.6732 98.1488 84.0028C98.1488 102.438 95.1551 115.422 90.2449 123.713C85.4241 131.852 78.7522 135.513 70.8114 135.513ZM220.423 95.4818H191.77L220.423 60.1338V95.4818Z" stroke="white" stroke-opacity="0.15" stroke-width="5"/>
</svg>
