<svg width="40" height="40" viewBox="0 0 40 40" fill="none" xmlns="http://www.w3.org/2000/svg">
    <path d="M10 15L20 25L30 15" stroke-width="3.5" stroke-linecap="round" stroke-linejoin="round"/>
</svg>
