<svg width="20" height="20" viewBox="0 0 20 20" fill="none" xmlns="http://www.w3.org/2000/svg">
<rect width="20" height="20" fill="white" fill-opacity="0.01" style="mix-blend-mode:multiply"/>
<path d="M10 19.1666C10 19.1666 17.5 14.1666 17.5 8.33331C17.5 6.34419 16.7098 4.43653 15.3033 3.03001C13.8968 1.62349 11.9891 0.833313 10 0.833313C8.01088 0.833313 6.10322 1.62349 4.6967 3.03001C3.29018 4.43653 2.5 6.34419 2.5 8.33331C2.5 14.1666 10 19.1666 10 19.1666Z" stroke="#040E31" stroke-width="1.5" stroke-linecap="round" stroke-linejoin="round"/>
</svg>
