<svg width="40" height="41" viewBox="0 0 40 41" xmlns="http://www.w3.org/2000/svg">
<path d="M19.9998 12.7406C21.4241 12.7406 22.5827 13.843 22.5827 15.1983C22.5827 16.5525 21.4238 17.6549 19.9998 17.6549C18.5764 17.6549 17.4176 16.5525 17.4176 15.1983C17.4173 13.8427 18.5767 12.7406 19.9998 12.7406ZM19.9998 21.132C23.4402 21.132 26.238 18.4706 26.238 15.1983C26.238 11.9243 23.4405 9.26172 19.9998 9.26172C16.5597 9.26172 13.7616 11.9246 13.7616 15.1983C13.7616 18.4706 16.5597 21.132 19.9998 21.132ZM22.5235 25.9739C23.8068 25.6958 25.0315 25.2132 26.1458 24.5467C26.556 24.3011 26.8468 23.9105 26.9544 23.4608C27.062 23.0112 26.9774 22.5393 26.7193 22.1489C26.5917 21.9555 26.4252 21.7878 26.2295 21.6556C26.0337 21.5234 25.8124 21.4292 25.5784 21.3785C25.3443 21.3277 25.102 21.3213 24.8654 21.3597C24.6287 21.3981 24.4024 21.4805 24.1992 21.6023C21.6436 23.1312 18.3543 23.13 15.8007 21.6023C15.5976 21.4805 15.3713 21.3981 15.1346 21.3597C14.898 21.3212 14.6557 21.3276 14.4217 21.3784C14.1876 21.4292 13.9664 21.5234 13.7707 21.6556C13.5749 21.7878 13.4085 21.9554 13.2809 22.1489C13.0227 22.5392 12.9381 23.011 13.0455 23.4607C13.1528 23.9103 13.4435 24.301 13.8536 24.5467C14.9678 25.213 16.1922 25.6955 17.4752 25.9739L13.988 29.2928C13.6453 29.619 13.4528 30.0614 13.4529 30.5226C13.453 30.9839 13.6456 31.4262 13.9884 31.7523C14.3312 32.0784 14.7962 32.2616 15.2809 32.2615C15.7656 32.2614 16.2305 32.0781 16.5732 31.7519L19.9992 28.4912L23.4274 31.7522C23.5969 31.9137 23.7982 32.0419 24.0198 32.1293C24.2414 32.2167 24.4789 32.2617 24.7188 32.2617C24.9587 32.2617 25.1962 32.2167 25.4178 32.1293C25.6394 32.0419 25.8407 31.9137 26.0102 31.7522C26.1802 31.5909 26.3151 31.3993 26.4071 31.1883C26.4991 30.9774 26.5465 30.7512 26.5465 30.5228C26.5465 30.2943 26.4991 30.0682 26.4071 29.8572C26.3151 29.6462 26.1802 29.4546 26.0102 29.2933L22.5235 25.9739Z"/>
</svg>
