<svg viewBox="0 0 40 39" xmlns="http://www.w3.org/2000/svg">
<path d="M20.0001 20.1964C25.3793 20.1964 29.0536 22.6459 29.0536 26.4642C29.0536 29.1525 27.2653 30.6428 24.8751 30.6428H15.1251C12.7348 30.6428 10.9465 29.1525 10.9465 26.4642C10.9465 22.6459 14.6208 20.1964 20.0001 20.1964ZM31.1429 20.1964C34.9674 20.1964 37.4108 22.504 37.4108 25.4196C37.4108 27.7769 35.6104 29.2499 33.5804 29.2499H32.5358C31.7665 29.2499 31.1429 28.6263 31.1429 27.8571C31.1429 27.0878 31.7665 26.4642 32.5358 26.4642H33.5804C34.1814 26.4642 34.6251 26.1012 34.6251 25.4196C34.6251 24.0792 33.4634 22.9821 31.1429 22.9821C30.3737 22.9821 29.7501 22.3585 29.7501 21.5892C29.7501 20.82 30.3737 20.1964 31.1429 20.1964ZM8.85721 20.1964C9.62647 20.1964 10.2501 20.82 10.2501 21.5892C10.2501 22.3585 9.62647 22.9821 8.85721 22.9821C6.53675 22.9821 5.37507 24.0792 5.37507 25.4196C5.37507 26.1012 5.81876 26.4642 6.41971 26.4642H7.46436C8.23361 26.4642 8.85721 27.0878 8.85721 27.8571C8.85721 28.6263 8.23361 29.2499 7.46436 29.2499H6.41971C4.38972 29.2499 2.58936 27.7769 2.58936 25.4196C2.58936 22.504 5.03272 20.1964 8.85721 20.1964ZM20.0001 22.9821C15.9775 22.9821 13.7322 24.479 13.7322 26.4642C13.7322 27.4902 14.1724 27.8571 15.1251 27.8571H24.8751C25.8277 27.8571 26.2679 27.4902 26.2679 26.4642C26.2679 24.479 24.0226 22.9821 20.0001 22.9821ZM28.3572 8.35709C31.0496 8.35709 33.2322 10.5397 33.2322 13.2321C33.2322 15.9245 31.0496 18.1071 28.3572 18.1071C27.588 18.1071 26.9644 17.4835 26.9644 16.7142C26.9644 15.945 27.588 15.3214 28.3572 15.3214L28.5584 15.3118C29.6179 15.2106 30.4465 14.3181 30.4465 13.2321C30.4465 12.0782 29.5111 11.1428 28.3572 11.1428L28.1948 11.1334C27.5021 11.053 26.9644 10.4643 26.9644 9.74995C26.9644 8.98069 27.588 8.35709 28.3572 8.35709ZM11.6429 8.35709C12.4122 8.35709 13.0358 8.98069 13.0358 9.74995C13.0358 10.4643 12.4981 11.053 11.8054 11.1334L11.6429 11.1428C10.489 11.1428 9.55364 12.0782 9.55364 13.2321C9.55364 14.3181 10.3822 15.2106 11.4417 15.3118L11.6429 15.3214C12.4122 15.3214 13.0358 15.945 13.0358 16.7142C13.0358 17.4835 12.4122 18.1071 11.6429 18.1071C8.95054 18.1071 6.76793 15.9245 6.76793 13.2321C6.76793 10.5397 8.95054 8.35709 11.6429 8.35709ZM20.0001 6.96423C23.0771 6.96423 25.5715 9.45865 25.5715 12.5357C25.5715 15.6127 23.0771 18.1071 20.0001 18.1071C16.9231 18.1071 14.4286 15.6127 14.4286 12.5357C14.4286 9.45865 16.9231 6.96423 20.0001 6.96423ZM20.0001 9.74995C18.4616 9.74995 17.2144 10.9972 17.2144 12.5357C17.2144 14.0742 18.4616 15.3214 20.0001 15.3214C21.5386 15.3214 22.7858 14.0742 22.7858 12.5357C22.7858 10.9972 21.5386 9.74995 20.0001 9.74995Z" />
</svg>
