<svg width="224" height="192" viewBox="0 0 224 192" fill="none" xmlns="http://www.w3.org/2000/svg">
<path d="M51.3337 78.1484H46.5625V91.1458H51.3337V78.1484Z" fill="white"/>
<path d="M59.5524 78.1484H54.7812V91.1458H59.5524V78.1484Z" fill="white"/>
<path d="M67.7868 78.1484H63.0156V91.1458H67.7868V78.1484Z" fill="white"/>
<path d="M76.1774 78.1484H71.4062V91.1458H76.1774V78.1484Z" fill="white"/>
<path d="M84.3971 78.1484H79.2969V91.1458H84.3971V78.1484Z" fill="white"/>
<path d="M92.6315 78.1484H87.5312V91.1458H92.6315V78.1484Z" fill="white"/>
<path d="M100.677 78.1484H95.9062V91.1458H100.677V78.1484Z" fill="white"/>
<path d="M108.927 78.1484H104.156V91.1458H108.927V78.1484Z" fill="white"/>
<path d="M117.146 78.1484H112.375V91.1458H117.146V78.1484Z" fill="white"/>
<path d="M125.521 78.1484H120.75V91.1458H125.521V78.1484Z" fill="white"/>
<path d="M133.756 78.1484H128.656V91.1458H133.756V78.1484Z" fill="white"/>
<path d="M141.975 78.1484H136.875V91.1458H141.975V78.1484Z" fill="white"/>
<path d="M150.052 78.1484H145.281V91.1458H150.052V78.1484Z" fill="white"/>
<path d="M158.271 78.1484H153.5V91.1458H158.271V78.1484Z" fill="white"/>
<path d="M166.49 78.1484H161.719V91.1458H166.49V78.1484Z" fill="white"/>
<path d="M174.896 78.1484H170.125V91.1458H174.896V78.1484Z" fill="white"/>
<path d="M51.333 92.625H46.5618V97.7253H51.333V92.625Z" fill="white"/>
<path d="M59.5524 92.625H54.7812V97.7253H59.5524V92.625Z" fill="white"/>
<path d="M67.7868 92.625H63.0156V97.7253H67.7868V92.625Z" fill="white"/>
<path d="M76.1774 92.625H71.4062V97.7253H76.1774V92.625Z" fill="white"/>
<path d="M79.2969 92.625H84.3971V97.8898H79.2969V92.625Z" fill="white"/>
<path d="M87.5312 92.7895L92.6315 92.625V97.8898H87.5312V92.7895Z" fill="white"/>
<path d="M100.677 92.625H95.9062V97.7253H100.677V92.625Z" fill="white"/>
<path d="M108.927 92.625H104.156V97.7253H108.927V92.625Z" fill="white"/>
<path d="M117.146 92.625H112.375V97.7253H117.146V92.625Z" fill="white"/>
<path d="M125.521 92.625H120.75V97.7253H125.521V92.625Z" fill="white"/>
<path d="M128.657 92.625L133.757 92.7895V97.8898H128.657V92.625Z" fill="white"/>
<path d="M136.875 92.7895L141.975 92.625V97.8898H136.875V92.7895Z" fill="white"/>
<path d="M150.052 92.625H145.281V97.7253H150.052V92.625Z" fill="white"/>
<path d="M158.271 92.625H153.5V97.7253H158.271V92.625Z" fill="white"/>
<path d="M166.49 92.625H161.719V97.7253H166.49V92.625Z" fill="white"/>
<path d="M174.896 92.625H170.125V97.7253H174.896V92.625Z" fill="white"/>
<path d="M62.5259 67.9453H58.25V69.7543H62.5259V67.9453Z" fill="white"/>
<path d="M69.2693 67.9453H64.5V69.7543H69.2693V67.9453Z" fill="white"/>
<path d="M76.0192 67.9453H71.25V69.7543H76.0192V67.9453Z" fill="white"/>
<path d="M82.2603 67.9453H77.9844V69.7543H82.2603V67.9453Z" fill="white"/>
<path d="M115.488 67.9453H110.719V69.7543H115.488V67.9453Z" fill="white"/>
<path d="M108.738 67.9453H103.969V69.7543H108.738V67.9453Z" fill="white"/>
<path d="M101.995 67.9453H97.7188V69.7543H101.995V67.9453Z" fill="white"/>
<path d="M89.0037 67.9531H84.2344V69.7622H89.0037V67.9531Z" fill="white"/>
<path d="M95.7536 67.9453H90.9844V69.7543H95.7536V67.9453Z" fill="white"/>
<path d="M154.988 67.9453H150.219V69.7543H154.988V67.9453Z" fill="white"/>
<path d="M148.238 67.9453H143.469V69.7543H148.238V67.9453Z" fill="white"/>
<path d="M141.495 67.9453H137.219V69.7543H141.495V67.9453Z" fill="white"/>
<path d="M135.238 67.9531H130.469V69.7622H135.238V67.9531Z" fill="white"/>
<path d="M128.488 67.9453H123.719V69.7543H128.488V67.9453Z" fill="white"/>
<path d="M121.909 67.9453H117.469V69.7543H121.909V67.9453Z" fill="white"/>
<path d="M62.5259 61.6875H58.25V65.3055H62.5259V61.6875Z" fill="white"/>
<path d="M161.229 67.9453H156.953V69.7543H161.229V67.9453Z" fill="white"/>
<path d="M69.2693 61.6875H64.5V65.3055H69.2693V61.6875Z" fill="white"/>
<path d="M76.0192 61.6875H71.25V65.3055H76.0192V61.6875Z" fill="white"/>
<path d="M82.4247 61.6875H77.9844V65.3055H82.4247V61.6875Z" fill="white"/>
<path d="M89.0037 61.6875H84.2344V65.3055H89.0037V61.6875Z" fill="white"/>
<path d="M95.7536 61.6875H90.9844V65.3055H95.7536V61.6875Z" fill="white"/>
<path d="M101.995 61.6875H97.7188V65.3055H101.995V61.6875Z" fill="white"/>
<path d="M108.738 61.6875H103.969V65.3055H108.738V61.6875Z" fill="white"/>
<path d="M141.495 61.6875H137.219V65.3055H141.495V61.6875Z" fill="white"/>
<path d="M135.238 61.6875H130.469V65.3055H135.238V61.6875Z" fill="white"/>
<path d="M128.488 61.6875H123.719V65.3055H128.488V61.6875Z" fill="white"/>
<path d="M121.909 61.6875H117.469V65.3055H121.909V61.6875Z" fill="white"/>
<path d="M115.488 61.6875H110.719V65.3055H115.488V61.6875Z" fill="white"/>
<path d="M161.229 61.6875H156.953V65.3055H161.229V61.6875Z" fill="white"/>
<path d="M154.988 61.6875H150.219V65.3055H154.988V61.6875Z" fill="white"/>
<path d="M148.238 61.6875H143.469V65.3055H148.238V61.6875Z" fill="white"/>
<path d="M62.5259 54.9531H58.25V58.5712H62.5259V54.9531Z" fill="white"/>
<path d="M69.2693 54.9531H64.5V58.5712H69.2693V54.9531Z" fill="white"/>
<path d="M76.0192 54.9531H71.25V58.5712H76.0192V54.9531Z" fill="white"/>
<path d="M82.4247 54.9531H77.9844V58.5712H82.4247V54.9531Z" fill="white"/>
<path d="M89.0037 54.9529H84.2344V58.5709H89.0037V54.9529Z" fill="white"/>
<path d="M95.7536 54.9531H90.9844V58.5712H95.7536V54.9531Z" fill="white"/>
<path d="M101.995 54.9531H97.7188V58.5712H101.995V54.9531Z" fill="white"/>
<path d="M108.738 54.9531H103.969V58.5712H108.738V54.9531Z" fill="white"/>
<path d="M141.495 54.9531H137.219V58.5712H141.495V54.9531Z" fill="white"/>
<path d="M135.237 54.9529H130.468V58.5709H135.237V54.9529Z" fill="white"/>
<path d="M128.488 54.9531H123.719V58.5712H128.488V54.9531Z" fill="white"/>
<path d="M121.909 54.9531H117.469V58.5712H121.909V54.9531Z" fill="white"/>
<path d="M115.488 54.9531H110.719V58.5712H115.488V54.9531Z" fill="white"/>
<path d="M161.229 54.9531H156.953V58.5712H161.229V54.9531Z" fill="white"/>
<path d="M154.988 54.9531H150.219V58.5712H154.988V54.9531Z" fill="white"/>
<path d="M148.238 54.9531H143.469V58.5712H148.238V54.9531Z" fill="white"/>
<path d="M62.5259 48.5312H58.25V52.1493H62.5259V48.5312Z" fill="white"/>
<path d="M69.2693 48.5312H64.5V52.1493H69.2693V48.5312Z" fill="white"/>
<path d="M76.0192 48.5312H71.25V52.1493H76.0192V48.5312Z" fill="white"/>
<path d="M82.4247 48.5312H77.9844V52.1493H82.4247V48.5312Z" fill="white"/>
<path d="M89.0037 48.532H84.2344V52.15H89.0037V48.532Z" fill="white"/>
<path d="M95.7536 48.5312H90.9844V52.1493H95.7536V48.5312Z" fill="white"/>
<path d="M101.995 48.5312H97.7188V52.1493H101.995V48.5312Z" fill="white"/>
<path d="M108.738 48.5312H103.969V52.1493H108.738V48.5312Z" fill="white"/>
<path d="M141.495 48.5312H137.219V52.1493H141.495V48.5312Z" fill="white"/>
<path d="M135.237 48.532H130.468V52.15H135.237V48.532Z" fill="white"/>
<path d="M128.488 48.5312H123.719V52.1493H128.488V48.5312Z" fill="white"/>
<path d="M121.909 48.5312H117.469V52.1493H121.909V48.5312Z" fill="white"/>
<path d="M115.488 48.5312H110.719V52.1493H115.488V48.5312Z" fill="white"/>
<path d="M161.229 48.5312H156.953V52.1493H161.229V48.5312Z" fill="white"/>
<path d="M154.988 48.5312H150.219V52.1493H154.988V48.5312Z" fill="white"/>
<path d="M148.238 48.5312H143.469V52.1493H148.238V48.5312Z" fill="white"/>
<path d="M62.5259 41.9531H58.25V45.5712H62.5259V41.9531Z" fill="white"/>
<path d="M69.2693 41.9531H64.5V45.5712H69.2693V41.9531Z" fill="white"/>
<path d="M76.0192 41.9531H71.25V45.5712H76.0192V41.9531Z" fill="white"/>
<path d="M82.4247 41.9531H77.9844V45.5712H82.4247V41.9531Z" fill="white"/>
<path d="M89.0037 41.9541H84.2344V45.5721H89.0037V41.9541Z" fill="white"/>
<path d="M95.7536 41.9531H90.9844V45.5712H95.7536V41.9531Z" fill="white"/>
<path d="M101.995 41.9531H97.7188V45.5712H101.995V41.9531Z" fill="white"/>
<path d="M108.738 41.9531H103.969V45.5712H108.738V41.9531Z" fill="white"/>
<path d="M141.495 41.9531H137.219V45.5712H141.495V41.9531Z" fill="white"/>
<path d="M135.237 41.9541H130.468V45.5721H135.237V41.9541Z" fill="white"/>
<path d="M128.488 41.9531H123.719V45.5712H128.488V41.9531Z" fill="white"/>
<path d="M121.909 41.9531H117.469V45.5712H121.909V41.9531Z" fill="white"/>
<path d="M115.488 41.9531H110.719V45.5712H115.488V41.9531Z" fill="white"/>
<path d="M161.229 41.9531H156.953V45.5712H161.229V41.9531Z" fill="white"/>
<path d="M154.988 41.9531H150.219V45.5712H154.988V41.9531Z" fill="white"/>
<path d="M148.238 41.9531H143.469V45.5712H148.238V41.9531Z" fill="white"/>
<path d="M62.5259 35.2031H58.25V38.8212H62.5259V35.2031Z" fill="white"/>
<path d="M69.2693 35.2031H64.5V38.8212H69.2693V35.2031Z" fill="white"/>
<path d="M76.0192 35.2031H71.25V38.8212H76.0192V35.2031Z" fill="white"/>
<path d="M82.4247 35.2031H77.9844V38.8212H82.4247V35.2031Z" fill="white"/>
<path d="M89.0037 35.2031H84.2344V38.8212H89.0037V35.2031Z" fill="white"/>
<path d="M95.7536 35.2031H90.9844V38.8212H95.7536V35.2031Z" fill="white"/>
<path d="M101.995 35.2031H97.7188V38.8212H101.995V35.2031Z" fill="white"/>
<path d="M108.738 35.2031H103.969V38.8212H108.738V35.2031Z" fill="white"/>
<path d="M141.495 35.2031H137.219V38.8212H141.495V35.2031Z" fill="white"/>
<path d="M135.238 35.2031H130.469V38.8212H135.238V35.2031Z" fill="white"/>
<path d="M128.488 35.2031H123.719V38.8212H128.488V35.2031Z" fill="white"/>
<path d="M121.909 35.2031H117.469V38.8212H121.909V35.2031Z" fill="white"/>
<path d="M115.488 35.2031H110.719V38.8212H115.488V35.2031Z" fill="white"/>
<path d="M161.229 35.2031H156.953V38.8212H161.229V35.2031Z" fill="white"/>
<path d="M154.988 35.2031H150.219V38.8212H154.988V35.2031Z" fill="white"/>
<path d="M148.238 35.2031H143.469V38.8212H148.238V35.2031Z" fill="white"/>
<path d="M209.439 99.3727V68.1131H207.465V69.5938H201.213V67.9485H191.342V69.5938H184.596V68.1131H183.116V71.239L178.015 74.365H166.499V33.2339H168.144V23.3625H166.499V21.7172H145.11V20.072H140.01V21.7172H112.37V11.8457H108.751V5.10024H116.977V0H107.105V12.1748H103.979V22.0463H76.0102V20.401H70.91V22.0463H53.1413L51.4961 23.6915V34.0565H53.1413V27.311H54.6221V32.4113H56.2673V27.311H57.9125V32.4113H59.8868V27.311H61.0385V32.4113H63.0128V27.311H64.1645V32.4113H66.1388V27.311H67.784V32.4113H69.7583V27.311H70.91V32.4113H72.8843V27.311H74.036V32.4113H76.0102V27.311H77.6555V32.4113H79.6298V27.311H80.7815V32.4113H82.7557V27.311H83.9074V32.4113H85.8817V27.311H87.5269V32.4113H89.5012V27.311H90.6529V32.4113H92.6272V27.311H93.7789V32.4113H95.7531V27.311H97.3984V32.4113H99.3727V27.311H100.524V32.4113H102.499V27.311H103.65V32.4113H105.625V27.311H107.27V32.4113H109.244V27.311H110.396V32.4113H112.37V27.311H113.522V32.4113H115.496V27.311H116.977V32.4113H118.951V27.311H120.103V32.4113H122.077V27.311H123.229V32.4113H125.203V27.311H126.848V32.4113H128.823V27.311H129.974V32.4113H131.949V27.311H133.265V32.4113H135.239V27.311H136.884V32.4113H138.859V27.311H140.01V32.4113H141.984V27.311H143.136V32.4113H145.11V27.311H146.591V32.4113H148.565V27.311H149.717V32.4113H151.527V27.311H152.843V32.4113H154.817V27.311H156.463V32.4113H158.437V27.311H159.589V32.4113H161.563V27.311H162.715V32.4113H164.689V27.311H166.334V33.563H164.853V75.0231H161.234V71.5681H156.956V75.0231H154.982V71.5681H150.211V75.0231H148.236V71.5681H143.465V75.0231H141.491V71.5681H137.213V75.0231H135.239V71.5681H130.468V75.0231H128.493V71.5681H123.722V75.0231H121.748V71.5681H117.47V75.0231H115.496V71.5681H110.725V75.0231H108.751V71.5681H103.979V75.0231H102.005V71.5681H97.7274V75.0231H95.7531V71.5681H90.9819V75.0231H89.0077V71.5681H84.2364V75.0231H82.2622V71.5681H77.9845V75.0231H76.0102V71.5681H71.239V75.0231H69.2648V71.5681H64.4935V75.0231H62.5192V71.5681H58.2416V75.0231H54.6221V33.7275H53.1413L52.9768 75.0231H42.7763L37.8406 69.9228V68.2776H36.3599V69.7583H29.6144V68.2776H19.7429V69.9228H13.491V68.4421H11.5167V99.7017H0V102.828H217.172V99.7017L209.439 99.3727V99.3727ZM56.2673 25.8303H54.293V23.6915H56.2673V25.8303ZM59.7223 25.8303H57.7481V23.6915H59.7223V25.8303ZM63.0128 25.8303H61.0385V23.6915H63.0128V25.8303ZM66.1388 25.8303H64.1645V23.6915H66.1388V25.8303ZM69.5938 25.8303H67.6195V23.6915H69.5938V25.8303ZM72.8843 25.8303H70.91V23.6915H72.8843V25.8303ZM76.0102 25.8303H74.036V23.6915H76.0102V25.8303ZM79.4652 25.8303H77.491V23.6915H79.4652V25.8303ZM80.7815 25.8303V23.6915H82.7557V25.8303H80.7815ZM85.8817 25.8303H83.9074V23.6915H85.8817V25.8303ZM89.3367 25.8303H87.3624V23.6915H89.3367V25.8303ZM90.6529 25.8303V23.6915H92.6272V25.8303H90.6529ZM93.7789 25.8303V23.6915H95.7531V25.8303H93.7789ZM99.2082 25.8303H97.2339V23.6915H99.2082V25.8303ZM102.334 25.8303H100.36V23.6915H102.334V25.8303ZM105.625 25.8303H103.65V23.6915H105.625V25.8303ZM109.08 25.8303H107.105V23.6915H109.08V25.8303ZM105.625 20.5655V18.5912H110.396V20.5655H105.625ZM112.206 25.8303H110.231V23.6915H112.206V25.8303ZM113.522 25.8303V23.6915H115.496V25.8303H113.522ZM118.951 25.8303H116.977V23.6915H118.951V25.8303ZM122.077 25.8303H120.103V23.6915H122.077V25.8303ZM125.368 25.8303H123.393V23.6915H125.368V25.8303ZM128.823 25.8303H126.848V23.6915H128.823V25.8303ZM131.949 25.8303H129.974V23.6915H131.949V25.8303ZM135.239 25.8303H133.265V23.6915H135.239V25.8303ZM138.694 25.8303H136.72V23.6915H138.694V25.8303ZM141.82 25.8303H139.846V23.6915H141.82V25.8303ZM145.11 25.8303H143.136V23.6915H145.11V25.8303ZM148.565 25.8303H146.591V23.6915H148.565V25.8303ZM151.691 25.8303H149.717V23.6915H151.691V25.8303ZM154.982 25.8303H153.008V23.6915H154.982V25.8303ZM158.437 25.8303H156.463V23.6915H158.437V25.8303ZM161.563 25.8303H159.589V23.6915H161.563V25.8303ZM164.853 25.8303H162.879V23.6915H164.853V25.8303ZM33.3984 99.3727V76.5038H31.7532V99.3727H28.1337V74.5295H29.6144V73.0488H19.7429V74.694H21.7172V99.5372H18.2622V76.6683H16.617V99.5372H13.6555V71.5681H36.5244V99.5372L33.3984 99.3727V99.3727ZM177.851 99.3727H43.2699V76.5038H177.851V99.3727ZM204.339 99.3727V76.5038H202.365V99.3727H199.239V74.5295H201.213V72.8843H191.342V74.5295H192.987V99.3727H189.861V76.5038H187.722V99.3727H184.596V71.4036H207.465V99.3727H204.339V99.3727Z" fill="white"/>
<path d="M0.5 119.609H14.4846V137.213H11.0295V122.571H4.11956V137.213H0.5V119.609Z" fill="white"/>
<path d="M18.25 137.378V119.609H24.0084C26.1472 119.609 27.6278 119.774 28.2859 119.938C29.2731 120.267 30.0957 120.761 30.7538 121.748C31.4119 122.571 31.741 123.722 31.741 125.203C31.741 126.355 31.5765 127.177 31.0829 128C30.5893 128.823 30.2603 129.316 29.6022 129.81C28.9441 130.303 28.4505 130.468 27.7924 130.633C26.9698 130.797 25.6536 130.962 24.1728 130.962H21.8695V137.707H18.25V137.378ZM21.705 122.735V127.671H23.6793C25.16 127.671 25.9826 127.507 26.4762 127.342C26.9698 127.177 27.2988 126.848 27.6279 126.519C27.9569 126.19 27.9569 125.697 27.9569 125.203C27.9569 124.545 27.7924 124.052 27.4633 123.558C27.1343 123.064 26.6407 122.9 25.9826 122.735C25.489 122.735 24.6664 122.571 23.3502 122.571H21.705V122.735Z" fill="white"/>
<path d="M48.3624 137.378H44.5783L42.9331 133.265H35.8585L34.3778 137.213H30.5938L37.5037 119.609H41.2878L48.3624 137.378V137.378ZM41.9459 130.303L39.4781 123.722L37.0102 130.303H41.9459Z" fill="white"/>
<path d="M50.352 119.609H57.4266C58.7428 119.609 59.8944 119.609 60.5525 119.774C61.2106 119.938 61.8687 120.103 62.3623 120.432C62.8559 120.761 63.3494 121.255 63.6785 121.913C64.0075 122.571 64.1721 123.229 64.1721 124.052C64.1721 124.874 64.0076 125.697 63.514 126.355C63.0204 127.013 62.5268 127.507 61.7042 127.836C62.8559 128.165 63.6785 128.658 64.1721 129.481C64.6656 130.303 64.9947 131.126 64.9947 132.113C64.9947 132.936 64.8301 133.758 64.5011 134.417C64.172 135.239 63.6785 135.733 63.0204 136.226C62.3623 136.72 61.5397 136.884 60.5525 137.049C59.8944 137.049 58.5782 137.213 56.2749 137.213H50.1875V119.609H50.352ZM53.9715 122.571V126.684H58.9073C59.5654 126.684 60.0589 126.355 60.388 126.026C60.717 125.697 60.8816 125.203 60.8816 124.71C60.8816 124.216 60.717 123.722 60.388 123.393C60.0589 123.064 59.5654 122.9 59.0718 122.735H53.9715V122.571ZM53.9715 129.645V134.417H57.262C58.5782 134.417 59.4008 134.417 59.7299 134.252C60.2235 134.088 60.7171 133.923 61.0461 133.594C61.3752 133.265 61.5397 132.771 61.5397 132.113C61.5397 131.62 61.3751 131.126 61.2106 130.797C61.0461 130.468 60.5525 130.139 60.059 129.974C59.5654 129.81 58.5783 129.645 56.933 129.645H53.9715V129.645Z" fill="white"/>
<path d="M68.2812 119.609H71.5717V131.291L78.8108 119.609H82.4304V137.213H79.1399V125.697L72.0653 137.213H68.4458V119.609H68.2812Z" fill="white"/>
<path d="M89.8273 137.37V122.727H84.5625V119.766H98.5471V122.727H93.2823V137.37H89.8273Z" fill="white"/>
<path d="M101.016 137.378V119.609H114.178V122.571H104.635V126.519H113.519V129.481H104.635V134.252H114.507V137.213H101.016V137.378Z" fill="white"/>
<path d="M118.632 119.609H130.972V137.213H127.352V122.571H122.087V130.139C122.087 132.278 122.087 133.758 121.923 134.746C121.758 135.568 121.429 136.226 120.936 136.72C120.442 137.213 119.455 137.378 118.303 137.378C117.81 137.378 117.152 137.378 116 137.213V134.417H116.823C117.645 134.417 118.139 134.252 118.303 134.088C118.468 133.923 118.632 133.429 118.632 132.607V119.609V119.609Z" fill="white"/>
<path d="M134.758 119.609H138.378V126.684H143.149C145.452 126.684 147.098 127.177 148.085 128.329C149.072 129.316 149.565 130.632 149.565 132.113C149.565 133.265 149.236 134.417 148.578 135.239C147.92 136.062 147.262 136.72 146.44 136.884C145.617 137.213 144.465 137.378 142.985 137.378H134.594V119.609H134.758ZM138.378 134.417H141.833C142.985 134.417 143.807 134.417 144.136 134.252C144.63 134.088 144.959 133.923 145.288 133.429C145.617 133.1 145.781 132.607 145.781 131.949C145.781 131.126 145.452 130.468 144.959 130.139C144.301 129.81 143.314 129.645 141.997 129.645H138.378V134.417Z" fill="white"/>
<path d="M163.198 130.798L166.653 131.95C166.159 133.924 165.172 135.24 164.02 136.227C162.704 137.214 161.223 137.708 159.249 137.708C156.946 137.708 154.972 136.885 153.491 135.24C152.01 133.595 151.188 131.456 151.188 128.659C151.188 125.698 152.01 123.394 153.491 121.749C154.972 120.104 156.946 119.281 159.414 119.281C161.553 119.281 163.362 119.939 164.678 121.256C165.501 122.078 166.159 123.065 166.488 124.546L163.033 125.369C162.869 124.381 162.375 123.723 161.717 123.23C161.059 122.736 160.236 122.407 159.249 122.407C157.933 122.407 156.946 122.901 156.123 123.888C155.301 124.875 154.972 126.356 154.972 128.495C154.972 130.798 155.301 132.279 156.123 133.266C156.946 134.253 157.933 134.747 159.249 134.747C160.236 134.747 161.059 134.417 161.717 133.924C162.375 133.101 162.869 132.114 163.198 130.798V130.798Z" fill="white"/>
<path d="M173.077 137.37V122.727H167.812V119.766H181.797V122.727H176.532V137.37H173.077V137.37Z" fill="white"/>
<path d="M184.102 119.609H191.177C192.493 119.609 193.644 119.609 194.303 119.774C194.961 119.938 195.619 120.103 196.112 120.432C196.606 120.761 197.099 121.255 197.429 121.913C197.758 122.571 197.922 123.229 197.922 124.052C197.922 124.874 197.758 125.697 197.264 126.355C196.77 127.013 196.277 127.507 195.454 127.836C196.606 128.165 197.428 128.658 197.922 129.481C198.416 130.303 198.745 131.126 198.745 132.113C198.745 132.936 198.58 133.758 198.251 134.417C197.922 135.239 197.429 135.733 196.77 136.226C196.112 136.72 195.29 136.884 194.303 137.049C193.644 137.049 192.328 137.213 190.025 137.213H183.938V119.609H184.102ZM187.722 122.571V126.684H192.657C193.315 126.684 193.809 126.355 194.138 126.026C194.467 125.697 194.632 125.203 194.632 124.71C194.632 124.216 194.467 123.722 194.138 123.393C193.809 123.064 193.315 122.9 192.822 122.735H187.722V122.571ZM187.722 129.645V134.417H191.012C192.328 134.417 193.151 134.417 193.48 134.252C193.973 134.088 194.467 133.923 194.796 133.594C195.125 133.265 195.29 132.771 195.29 132.113C195.29 131.62 195.125 131.126 194.961 130.797C194.796 130.468 194.303 130.139 193.809 129.974C193.315 129.81 192.328 129.645 190.683 129.645H187.722V129.645Z" fill="white"/>
<path d="M200.719 128.659C200.719 126.849 201.048 125.369 201.541 124.052C201.87 123.23 202.529 122.407 203.187 121.585C203.845 120.926 204.667 120.268 205.49 119.939C206.642 119.446 207.793 119.281 209.274 119.281C211.906 119.281 213.881 120.104 215.526 121.749C217.007 123.394 217.829 125.533 217.829 128.495C217.829 131.292 217.007 133.595 215.526 135.24C214.045 136.885 211.906 137.708 209.274 137.708C206.642 137.708 204.503 136.885 203.022 135.24C201.377 133.595 200.719 131.456 200.719 128.659V128.659ZM204.338 128.495C204.338 130.469 204.832 131.95 205.654 133.101C206.642 134.088 207.793 134.582 209.109 134.582C210.59 134.582 211.742 134.088 212.564 133.101C213.552 132.114 213.881 130.469 213.881 128.495C213.881 126.52 213.387 125.04 212.564 123.888C211.742 122.901 210.426 122.407 209.109 122.407C207.629 122.407 206.477 122.901 205.49 123.888C204.832 124.875 204.338 126.52 204.338 128.495V128.495Z" fill="white"/>
<path d="M20.7188 162.878V145.109H26.4771C28.6159 145.109 30.0966 145.274 30.7547 145.438C31.7418 145.767 32.5645 146.261 33.2226 147.248C33.8807 148.071 34.2097 149.222 34.2097 150.703C34.2097 151.855 34.0452 152.677 33.5516 153.5C33.0581 154.323 32.729 154.816 32.0709 155.31C31.4128 155.803 30.9192 155.968 30.2611 156.132C29.4385 156.297 28.1223 156.462 26.6416 156.462H24.3383V162.878H20.7188V162.878ZM24.3383 148.235V153.171H26.3126C27.7933 153.171 28.6159 153.007 29.1095 152.842C29.603 152.677 29.9321 152.348 30.2611 152.019C30.5902 151.69 30.5902 151.197 30.5902 150.703C30.5902 150.045 30.4257 149.552 30.0966 149.058C29.7676 148.564 29.274 148.4 28.6159 148.235C28.1223 148.235 27.2997 148.071 25.9835 148.071H24.3383V148.235Z" fill="white"/>
<path d="M36.5156 154.159C36.5156 152.349 36.8447 150.869 37.3382 149.552C37.6673 148.73 38.3254 147.907 38.9835 147.085C39.6416 146.426 40.4642 145.768 41.2869 145.439C42.4385 144.946 43.5902 144.781 45.0709 144.781C47.7033 144.781 49.6776 145.604 51.3228 147.249C52.8035 148.894 53.6262 151.033 53.6262 153.995C53.6262 156.792 52.8035 159.095 51.3228 160.74C49.8421 162.385 47.7033 163.208 45.0709 163.208C42.4385 163.208 40.2997 162.385 38.819 160.74C37.3383 159.095 36.5156 156.956 36.5156 154.159V154.159ZM40.1352 153.995C40.1352 155.969 40.6287 157.45 41.4514 158.601C42.4385 159.588 43.5902 160.082 44.9064 160.082C46.3871 160.082 47.5388 159.588 48.3614 158.601C49.3485 157.614 49.6776 155.969 49.6776 153.995C49.6776 152.02 49.184 150.54 48.3614 149.388C47.5388 148.401 46.2226 147.907 44.9064 147.907C43.4257 147.907 42.274 148.401 41.2869 149.388C40.6288 150.375 40.1352 152.02 40.1352 153.995V153.995Z" fill="white"/>
<path d="M68.104 156.298L71.559 157.45C71.0655 159.424 70.0783 160.74 68.9266 161.727C67.6104 162.714 66.1297 163.208 64.1554 163.208C61.8521 163.208 59.8778 162.385 58.3971 160.74C56.9164 159.095 56.0938 156.956 56.0938 154.159C56.0938 151.198 56.9164 148.894 58.3971 147.249C59.8778 145.604 61.8521 144.781 64.32 144.781C66.4588 144.781 68.2685 145.439 69.5847 146.756C70.4073 147.578 71.0654 148.565 71.3945 150.046L67.9395 150.869C67.7749 149.881 67.2814 149.223 66.6233 148.73C65.9652 148.236 65.1426 147.907 64.1554 147.907C62.8392 147.907 61.8521 148.401 61.0295 149.388C60.2069 150.375 59.8778 151.856 59.8778 153.995C59.8778 156.298 60.2069 157.779 61.0295 158.766C61.8521 159.753 62.8392 160.247 64.1554 160.247C65.1426 160.247 65.9652 159.917 66.6233 159.424C67.2814 158.601 67.775 157.614 68.104 156.298Z" fill="white"/>
<path d="M86.2134 156.298L89.6684 157.45C89.1748 159.424 88.1877 160.74 87.036 161.727C85.7198 162.714 84.2391 163.208 82.2648 163.208C79.9615 163.208 77.9872 162.385 76.5065 160.74C75.0257 159.095 74.2031 156.956 74.2031 154.159C74.2031 151.198 75.0257 148.894 76.5065 147.249C77.9872 145.604 79.9615 144.781 82.4293 144.781C84.5682 144.781 86.3779 145.439 87.6941 146.756C88.5167 147.578 89.1748 148.565 89.5039 150.046L86.0488 150.869C85.8843 149.881 85.3908 149.223 84.7327 148.73C84.0746 148.236 83.252 147.907 82.2648 147.907C80.9486 147.907 79.9615 148.401 79.1389 149.388C78.3162 150.375 77.9872 151.856 77.9872 153.995C77.9872 156.298 78.3162 157.779 79.1389 158.766C79.9615 159.753 80.9486 160.247 82.2648 160.247C83.252 160.247 84.0746 159.917 84.7327 159.424C85.5553 158.601 86.0489 157.614 86.2134 156.298Z" fill="white"/>
<path d="M93.2812 145.109H96.5717V156.791L103.811 145.109H107.43V162.878H104.14V151.361L97.0653 162.878H93.4458V145.109H93.2812Z" fill="white"/>
<path d="M111.375 145.106H114.666V156.787L121.905 145.106H125.524V162.874H122.234V151.358L115.159 162.874H111.54V145.106H111.375ZM120.424 140.828H122.069C121.905 141.98 121.576 142.802 120.917 143.461C120.259 144.119 119.437 144.448 118.285 144.448C117.133 144.448 116.311 144.119 115.653 143.461C114.995 142.802 114.666 141.98 114.501 140.828H116.146C116.146 141.322 116.475 141.815 116.804 142.144C117.133 142.473 117.627 142.638 118.285 142.638C118.943 142.638 119.437 142.473 119.766 142.144C120.259 141.815 120.424 141.322 120.424 140.828V140.828Z" fill="white"/>
<path d="M140.667 156.298L144.122 157.45C143.628 159.424 142.641 160.74 141.489 161.727C140.173 162.714 138.692 163.208 136.718 163.208C134.415 163.208 132.44 162.385 130.96 160.74C129.479 159.095 128.656 156.956 128.656 154.159C128.656 151.198 129.479 148.894 130.96 147.249C132.44 145.604 134.415 144.781 136.882 144.781C139.021 144.781 140.831 145.439 142.147 146.756C142.97 147.578 143.628 148.565 143.957 150.046L140.502 150.869C140.337 149.881 139.844 149.223 139.186 148.73C138.528 148.236 137.705 147.907 136.718 147.907C135.402 147.907 134.415 148.401 133.592 149.388C132.769 150.375 132.44 151.856 132.44 153.995C132.44 156.298 132.769 157.779 133.592 158.766C134.415 159.753 135.402 160.247 136.718 160.247C137.705 160.247 138.528 159.917 139.186 159.424C139.844 158.601 140.337 157.614 140.667 156.298V156.298Z" fill="white"/>
<path d="M147.578 145.11H151.198V152.678C152.02 152.678 152.514 152.349 152.843 152.02C153.172 151.691 153.501 150.704 154.159 149.223C154.817 147.249 155.64 146.097 156.462 145.603C157.121 145.11 158.437 144.945 160.082 144.945H160.576V147.578H160.082C159.424 147.578 158.766 147.742 158.437 147.907C158.108 148.071 157.779 148.4 157.614 148.729C157.45 149.058 157.121 149.881 156.627 151.033C156.462 151.691 156.133 152.184 155.969 152.513C155.64 152.842 155.311 153.336 154.653 153.665C155.475 153.83 156.133 154.323 156.627 154.981C157.121 155.639 157.779 156.627 158.272 157.943L160.74 162.714H156.462L154.324 158.107C154.324 158.107 154.159 157.943 154.159 157.778C154.159 157.778 153.995 157.449 153.666 156.956C153.172 156.133 152.843 155.475 152.514 155.31C152.185 155.146 151.691 154.981 151.198 154.981V162.878H147.578V145.11V145.11Z" fill="white"/>
<path d="M162.219 154.159C162.219 152.349 162.548 150.869 163.041 149.552C163.37 148.73 164.029 147.907 164.687 147.085C165.345 146.426 166.167 145.768 166.99 145.439C168.142 144.946 169.293 144.781 170.774 144.781C173.406 144.781 175.381 145.604 177.026 147.249C178.507 148.894 179.329 151.033 179.329 153.995C179.329 156.792 178.507 159.095 177.026 160.74C175.545 162.385 173.406 163.208 170.774 163.208C168.142 163.208 166.003 162.385 164.522 160.74C163.041 159.095 162.219 156.956 162.219 154.159V154.159ZM166.003 153.995C166.003 155.969 166.496 157.45 167.319 158.601C168.306 159.588 169.458 160.082 170.774 160.082C172.255 160.082 173.406 159.588 174.229 158.601C175.216 157.614 175.545 155.969 175.545 153.995C175.545 152.02 175.052 150.54 174.229 149.388C173.406 148.401 172.09 147.907 170.774 147.907C169.293 147.907 168.142 148.401 167.154 149.388C166.496 150.375 166.003 152.02 166.003 153.995V153.995Z" fill="white"/>
<path d="M182.625 145.106H185.915V156.787L193.155 145.106H196.774V162.874H193.484V151.358L186.409 162.874H182.79V145.106H182.625ZM191.838 140.828H193.484C193.319 141.98 192.99 142.802 192.332 143.461C191.674 144.119 190.851 144.448 189.7 144.448C188.548 144.448 187.725 144.119 187.067 143.461C186.409 142.802 186.08 141.98 185.915 140.828H187.561C187.561 141.322 187.89 141.815 188.219 142.144C188.548 142.473 189.041 142.638 189.7 142.638C190.358 142.638 190.851 142.473 191.18 142.144C191.509 141.815 191.674 141.322 191.838 140.828V140.828Z" fill="white"/>
<path d="M40.9689 186.239V188.378H37.5139V186.239C34.717 186.075 32.7426 185.417 31.591 184.1C30.4393 182.784 29.7812 181.139 29.7812 179.329C29.7812 177.355 30.4393 175.71 31.591 174.393C32.7426 173.077 34.717 172.419 37.5139 172.419V170.609H40.9689V172.419C43.7658 172.584 45.7401 173.242 46.8918 174.558C48.0434 175.874 48.7016 177.519 48.7016 179.494C48.7016 181.468 48.0434 183.113 46.8918 184.265C45.7401 185.417 43.7658 186.239 40.9689 186.239ZM37.5139 183.278V175.381C36.0331 175.381 34.8815 175.71 34.2234 176.368C33.5653 177.026 33.2362 178.013 33.2362 179.329C33.2362 181.962 34.5524 183.278 37.5139 183.278ZM40.9689 183.278C41.956 183.278 42.7787 183.113 43.4368 182.784C44.0948 182.455 44.5884 182.126 44.9175 181.468C45.2465 180.974 45.4111 180.152 45.4111 179.165C45.4111 176.532 43.9303 175.381 41.1334 175.381V183.278H40.9689Z" fill="white"/>
<path d="M51.8281 188.378V170.773H64.9901V173.735H55.4476V177.683H64.332V180.645H55.4476V185.416H65.3191V188.378H51.8281Z" fill="white"/>
<path d="M70.08 170.609H82.2548V185.252H83.7355V191.998H80.7741V188.213H69.5864V191.998H66.625V185.252H68.1057C68.7638 183.771 69.2574 181.962 69.5864 179.987C69.7509 178.013 69.9155 175.545 69.9155 172.419V170.609H70.08ZM73.535 173.571C73.535 179 73.0414 182.784 72.0543 185.252H78.7998V173.571H73.535V173.571Z" fill="white"/>
<path d="M86.7031 188.378V170.773H99.8651V173.735H90.3227V177.683H99.207V180.645H90.3227V185.416H100.194V188.378H86.7031Z" fill="white"/>
<path d="M103.484 188.378V170.773H109.243C111.382 170.773 112.862 170.938 113.52 171.102C114.508 171.432 115.33 171.925 115.988 172.912C116.646 173.735 116.975 174.887 116.975 176.367C116.975 177.519 116.811 178.342 116.317 179.164C115.824 179.987 115.495 180.48 114.837 180.974C114.178 181.468 113.685 181.632 113.027 181.797C112.204 181.961 110.888 182.126 109.407 182.126H107.104V188.871H103.484V188.378ZM107.104 173.735V178.671H109.078C110.559 178.671 111.382 178.506 111.875 178.342C112.369 178.177 112.698 177.848 113.027 177.519C113.356 177.19 113.356 176.696 113.356 176.203C113.356 175.545 113.191 175.051 112.862 174.557C112.533 174.064 112.04 173.899 111.382 173.735C110.888 173.735 110.065 173.57 108.749 173.57H107.104V173.735Z" fill="white"/>
<path d="M134.081 188.378H130.133L128.652 184.429H121.577L120.097 188.378H116.312L123.223 170.773H127.007L134.081 188.378V188.378ZM127.5 181.303L125.032 174.722L122.564 181.303H127.5Z" fill="white"/>
<path d="M136.391 170.609H140.01V185.252H146.92V170.609H150.54V185.252H152.02V191.998H149.059V188.213H136.555V170.609H136.391Z" fill="white"/>
<path d="M154.812 170.609H158.103V182.291L165.342 170.609H168.962V188.213H165.671V176.697L158.597 188.213H154.812V170.609V170.609Z" fill="white"/>
<path d="M172.906 170.609H176.197V182.291L183.436 170.609H187.055V188.213H183.765V176.697L176.69 188.213H172.906V170.609V170.609Z" fill="white"/>
</svg>
