<svg width="40" height="41" viewBox="0 0 40 41" xmlns="http://www.w3.org/2000/svg">
<path fill-rule="evenodd" clip-rule="evenodd" d="M30.1772 15.2846C30.3256 14.7902 30.1772 14.4268 29.4714 14.4268H27.1375C26.5441 14.4268 26.2707 14.7407 26.1223 15.0869C26.1223 15.0869 24.9353 17.9798 23.254 19.8589C22.71 20.4028 22.4628 20.5757 22.166 20.5757C22.0177 20.5757 21.803 20.4028 21.803 19.9084V15.2846C21.803 14.6912 21.6307 14.4268 21.1361 14.4268H17.4686C17.0979 14.4268 16.8748 14.7022 16.8748 14.9632C16.8748 15.5258 17.7153 15.6555 17.802 17.2379V20.6749C17.802 21.4284 17.666 21.5651 17.3692 21.5651C16.5781 21.5651 14.6536 18.6591 13.512 15.3341C13.2883 14.6878 13.0639 14.4268 12.4674 14.4268H10.1336C9.46674 14.4268 9.33337 14.7407 9.33337 15.0869C9.33337 15.7051 10.1247 18.7711 13.0176 22.826C14.9464 25.595 17.6633 27.0964 20.1359 27.0964C21.6196 27.0964 21.803 26.763 21.803 26.1887V24.0957C21.803 23.4289 21.9435 23.2958 22.4131 23.2958C22.7595 23.2958 23.3528 23.4689 24.7376 24.804C26.32 26.3862 26.5807 27.0964 27.4709 27.0964H29.8048C30.4716 27.0964 30.8051 26.763 30.6127 26.105C30.4023 25.4492 29.6468 24.4979 28.6442 23.37C28.1003 22.727 27.2842 22.0347 27.0372 21.6886C26.6909 21.2435 26.7898 21.0458 27.0372 20.6504C27.0372 20.6504 29.8805 16.6446 30.1772 15.2846Z"/>
</svg>
