<svg width="309" height="181" viewBox="0 0 309 181" fill="none" xmlns="http://www.w3.org/2000/svg">
<path d="M224.905 127.236L224.589 125.103H222.432H174.382H171.693L171.888 127.784C173.417 148.802 181.668 165.575 195.676 177.06C209.646 188.514 229.086 194.5 252.649 194.5C272.931 194.5 292.396 189.783 306.873 180.249C321.433 170.661 330.94 156.179 330.94 137.015C330.94 116.928 320.785 102.266 305.399 95.0257C316.811 87.3154 325.491 72.1196 325.491 54.2887C325.491 38.0771 318.126 25.0161 305.619 16.0921C293.189 7.22242 275.79 2.5 255.621 2.5C231.875 2.5 212.205 7.83622 198.039 18.6144C183.803 29.4448 175.401 45.5625 173.87 66.4904L173.674 69.1729H176.363H224.413H226.746L226.907 66.846C227.484 58.538 230.675 52.9567 235.03 49.4178C239.438 45.8363 245.278 44.157 251.411 44.157C256.486 44.157 261.206 45.4321 264.582 47.8166C267.873 50.1416 269.964 53.5545 269.964 58.2517C269.964 63.4442 267.892 67.8259 263.661 70.9857C259.347 74.2076 252.573 76.3093 242.99 76.3093H234.816H232.316V78.8093V118.686V121.186H234.816H242.247C254.087 121.186 262.302 122.378 267.497 125.004C270.031 126.285 271.774 127.872 272.906 129.782C274.043 131.702 274.67 134.131 274.67 137.262C274.67 141.447 272.918 145.179 269.407 147.925C265.848 150.708 260.313 152.595 252.649 152.595C244.704 152.595 238.556 150.817 234.056 146.972C229.558 143.128 226.337 136.902 224.905 127.236ZM82.7722 194.5C109.048 194.5 129.256 185.201 142.833 168.302C156.345 151.485 163.044 127.449 163.044 98.3762C163.044 69.3033 156.345 45.3267 142.831 28.5703C129.251 11.7327 109.043 2.5 82.7722 2.5C56.6225 2.5 36.4171 11.7346 22.8085 28.568C9.26373 45.3225 2.5 69.2983 2.5 98.3762C2.5 127.454 9.26371 151.49 22.8056 168.305C36.4117 185.199 56.6167 194.5 82.7722 194.5ZM82.7722 152.595C79.2765 152.595 76.1269 151.782 73.3362 150.035C70.5374 148.283 67.9582 145.502 65.7536 141.353C61.3046 132.978 58.5225 119.291 58.5225 98.3762C58.5225 77.4615 61.3046 63.7744 65.7536 55.3997C67.9582 51.25 70.5374 48.4694 73.3362 46.7172C76.1269 44.9701 79.2765 44.157 82.7722 44.157C86.337 44.157 89.5362 44.9736 92.3615 46.7235C95.1936 48.4776 97.7931 51.2587 100.011 55.4057C104.487 63.7771 107.27 77.4603 107.27 98.3762C107.27 119.292 104.487 132.975 100.011 141.347C97.7931 145.494 95.1936 148.275 92.3615 150.029C89.5362 151.779 86.337 152.595 82.7722 152.595Z" stroke="white" stroke-opacity="0.13" stroke-width="5"/>
</svg>
