<svg width="96" height="96" viewBox="0 0 96 96" fill="none" xmlns="http://www.w3.org/2000/svg">
<path d="M31.0269 40.2187L27.8539 31.4108C26.7532 28.3557 26.2029 26.8281 24.966 25.959C23.7291 25.0898 22.1054 25.0898 18.858 25.0898H15.25V46.6994H22.8994V33.3189L27.6803 46.6994H34.3735L39.1544 33.3189V46.6994H46.8038V25.0898H43.1958C39.9484 25.0898 38.3247 25.0898 37.0878 25.959C35.8509 26.8281 35.3006 28.3557 34.2 31.4108L31.0269 40.2187Z" fill="white"/>
<path d="M67.3616 40.2187L64.1886 31.4108C63.088 28.3557 62.5376 26.8281 61.3007 25.959C60.0638 25.0898 58.4401 25.0898 55.1928 25.0898H51.5847V46.6994H59.2341V33.3189L64.015 46.6994H70.7083L75.4891 33.3189V46.6994H83.1386V25.0898H79.5305C76.2831 25.0898 74.6595 25.0898 73.4225 25.959C72.1856 26.8281 71.6353 28.3557 70.5347 31.4108L67.3616 40.2187Z" fill="white"/>
<path d="M15.25 51.4803H46.8038V58.1735H22.8994C22.8994 58.7062 22.8994 60.5025 22.9171 60.7272C23.1385 63.5405 25.373 65.775 28.1864 65.9965C28.4111 66.0141 28.6774 66.0141 29.2102 66.0141H46.8038V73.0898H36.8596C29.182 73.0898 25.3431 73.0898 22.4257 71.5619C20.0123 70.2979 18.042 68.3276 16.778 65.9141C15.25 62.9967 15.25 59.1579 15.25 51.4803Z" fill="white"/>
<path fill-rule="evenodd" clip-rule="evenodd" d="M76.4453 62.2851C76.4453 58.3647 72.2381 56.2612 67.3616 56.2612C62.4851 56.2612 58.278 58.3647 58.278 62.2851C58.278 66.2054 62.4851 68.309 67.3616 68.309C72.2381 68.309 76.4453 66.2054 76.4453 62.2851ZM67.3616 74.4285C77.4015 74.4285 84.0947 69.2651 84.0947 62.2851C84.0947 55.305 77.4015 50.1416 67.3616 50.1416C57.3218 50.1416 50.6285 55.305 50.6285 62.2851C50.6285 69.2651 57.3218 74.4285 67.3616 74.4285Z" fill="white"/>
</svg>
