<svg width="19" height="18" viewBox="0 0 19 18" fill="none" xmlns="http://www.w3.org/2000/svg">
<path d="M10.7778 15.2222H1M17 2.77778H14.3333H17ZM10.7778 1V4.55556V1ZM10.7778 2.77778H1H10.7778ZM4.55556 9H1H4.55556ZM8.11111 7.22222V10.7778V7.22222ZM17.8889 9H8.11111H17.8889ZM17 15.2222H14.3333H17ZM10.7778 13.4444V17V13.4444Z" stroke-width="2" stroke-linecap="round" stroke-linejoin="round"/>
</svg>
