<svg width="51" height="52" viewBox="0 0 51 52" fill="none" xmlns="http://www.w3.org/2000/svg">
<path d="M1.01503 0.577927C0.852628 0.638828 0.548118 0.821533 0.365412 1.00424C0.0203007 1.28845 0 2.7298 0 25.9335V50.5582L0.446615 50.8627C0.852628 51.1469 3.55262 51.1875 25.2743 51.1875C46.9961 51.1875 49.696 51.1469 50.1021 50.8627L50.5487 50.5582V42.377C50.5487 34.7034 50.5284 34.1755 50.1833 33.871C49.8584 33.5665 49.1479 33.5259 44.2961 33.5259H38.7743V32.0237V30.5011L42.8344 30.4402C46.387 30.3793 46.9149 30.3387 47.2397 30.0139C47.5645 29.6891 47.6051 29.0801 47.666 23.2132C47.7269 16.8997 47.7066 16.7373 47.3006 16.2094L46.8742 15.6613H42.8141H38.7743V12.9816V10.3019L34.166 5.6531C31.6081 3.09521 29.2939 0.882435 28.9894 0.720032C28.5224 0.476421 26.2488 0.435822 14.8804 0.456123C7.43005 0.456123 1.17744 0.517025 1.01503 0.577927ZM26.7969 7.23655C26.7969 11.1546 26.939 11.9869 27.7104 12.2914C27.8931 12.3523 29.7811 12.4132 31.8924 12.4132H35.7292V14.0373V15.6613H31.7096C27.8728 15.6613 27.6495 15.6816 27.2841 16.0876C26.9187 16.4937 26.8984 16.9606 26.8375 22.726C26.7766 29.344 26.8375 29.8515 27.7307 30.2575C28.0555 30.3996 29.639 30.4808 31.9736 30.4808H35.7292V32.0034V33.5259H30.1668C25.254 33.5259 24.5841 33.5665 24.3405 33.871C24.1172 34.1349 24.036 35.6778 23.9548 41.2199L23.8533 48.2439L13.3578 48.3048L2.84209 48.3454V25.9132V3.48092H14.8195H26.7969V7.23655ZM31.7706 7.54106L33.5976 9.36812H31.7096H29.842V7.54106C29.842 6.52602 29.8623 5.714 29.9029 5.714C29.9232 5.714 30.7758 6.52602 31.7706 7.54106ZM44.6615 22.9696V27.4357H37.2517H29.842V22.9696V18.5034H37.2517H44.6615V22.9696ZM47.7066 36.6725C47.7066 36.977 37.8608 42.0522 37.2517 42.0522C36.6427 42.0522 26.7969 36.977 26.7969 36.6725C26.7969 36.4086 28.0961 36.368 37.2517 36.368C46.4073 36.368 47.7066 36.4086 47.7066 36.6725ZM32.0751 42.8642C34.7547 44.2041 37.0893 45.3003 37.2517 45.3003C37.4141 45.3003 39.7487 44.2041 42.4284 42.8642C45.1081 41.5244 47.3818 40.4281 47.5036 40.4281C47.6254 40.4281 47.7066 41.8695 47.7066 44.3868V48.3454L37.3126 48.3048L26.8984 48.2439L26.8375 44.3259C26.7969 41.7477 26.8578 40.4281 26.9999 40.4281C27.1217 40.4281 29.3954 41.5244 32.0751 42.8642Z" fill="#0078C3"/>
<path d="M6.76014 9.77187C6.51653 9.87338 6.23232 10.1373 6.11051 10.3606C5.94811 10.6245 5.88721 15.1516 5.88721 24.4696V38.1928L7.61276 41.6439C9.07441 44.5672 9.41952 45.1153 9.88644 45.2169C10.9421 45.4808 11.3684 44.9935 13.1548 41.4815L14.8195 38.1725V28.3267V18.5012H16.2202H17.621L17.7022 22.5816C17.7631 26.5808 17.7631 26.662 18.2503 27.0477C18.9405 27.5959 19.7729 27.535 20.2804 26.9056C20.6864 26.3778 20.7067 26.1342 20.7067 19.9831V13.6087L20.1992 13.1215C19.0217 11.9237 17.6616 12.9388 17.6616 14.9688V15.6591H16.2405H14.8195V13.3245C14.8195 10.8275 14.6368 10.1373 13.8654 9.79218C13.2767 9.52827 7.43006 9.50797 6.76014 9.77187ZM11.7744 14.1365V15.6794L10.3128 15.6185L8.8308 15.5576L8.7699 14.0756L8.709 12.614H10.2519H11.7744V14.1365ZM11.7744 28.0425V37.5838L11.0436 39.0454L10.3128 40.5071L9.52103 39.0048L8.7496 37.4823L8.7293 28.1237C8.7293 22.9876 8.7902 18.7042 8.87141 18.6433C8.93231 18.5621 9.62253 18.5012 10.394 18.5012H11.7744V28.0425Z" fill="#0078C3"/>
</svg>
