<svg width="32" height="32" viewBox="0 0 32 32" fill="none" xmlns="http://www.w3.org/2000/svg">
<path d="M14.7573 21.7578L18.9999 26.0004L23.2426 21.7578"  stroke-linecap="round" stroke-linejoin="round"/>
<path d="M19 16V26"  stroke-linecap="round" stroke-linejoin="round"/>
<path d="M12 26H9.00003C8.00732 25.999 7.02618 25.7869 6.12172 25.3778C5.21725 24.9686 4.41016 24.3718 3.754 23.6268C3.09785 22.8819 2.60764 22.0059 2.31591 21.0571C2.02419 20.1082 1.93762 19.1081 2.06196 18.1232C2.1863 17.1384 2.51869 16.1912 3.03708 15.3446C3.55547 14.498 4.248 13.7713 5.06871 13.2128C5.88941 12.6544 6.81952 12.2768 7.79729 12.1053C8.77506 11.9338 9.77814 11.9722 10.7399 12.2179"  stroke-linecap="round" stroke-linejoin="round"/>
<path d="M10 15.999C10.0002 14.4146 10.3768 12.8528 11.0989 11.4425C11.821 10.0322 12.868 8.8136 14.1534 7.88723C15.4388 6.96086 16.926 6.35319 18.4923 6.11431C20.0587 5.87542 21.6594 6.01216 23.1625 6.51324C24.6656 7.01433 26.0282 7.86542 27.1379 8.99639C28.2476 10.1274 29.0726 11.5058 29.5451 13.0182C30.0175 14.5306 30.1239 16.1336 29.8553 17.6951C29.5867 19.2566 28.9509 20.732 28.0003 21.9996"  stroke-linecap="round" stroke-linejoin="round"/>
</svg>
