<svg width="51" height="48" viewBox="0 0 51 48" fill="none" xmlns="http://www.w3.org/2000/svg">
<path d="M21.2507 1.37137C20.8463 1.87686 20.8261 2.15993 20.8261 7.23502V12.573H10.9185H0.990754L0.505487 13.0784L0 13.5637V30.265V46.9663L0.505487 47.4515L0.990754 47.957H25.2743H49.5579L50.0432 47.4515L50.5487 46.9663V30.265V13.5637L50.0432 13.0784L49.5579 12.573H39.6302H29.7226V7.23502C29.7226 2.15993 29.7024 1.87686 29.298 1.37137L28.8936 0.845669H25.2743H21.6551L21.2507 1.37137ZM26.8515 5.29395L26.9121 6.83063L25.3754 6.81041H23.859V5.23329V3.65617L25.335 3.71683L26.7908 3.77749L26.8515 5.29395ZM26.2247 10.0253L26.7908 10.5106L26.8515 14.4736L26.9121 18.4366H25.3957H23.859V14.4129V10.369L24.3847 9.96465C25.0924 9.41872 25.5372 9.43894 26.2247 10.0253ZM20.8261 16.9201V18.4366H19.9364C18.7637 18.4366 17.9953 19.023 17.9953 19.9328C17.9953 20.3575 18.1571 20.7416 18.4199 20.9843C18.8243 21.3482 19.2287 21.3684 25.2743 21.3684C31.32 21.3684 31.7243 21.3482 32.1287 20.9843C32.3916 20.7416 32.5533 20.3575 32.5533 19.9328C32.5533 19.023 31.785 18.4366 30.6123 18.4366H29.7226V16.9201V15.4037L38.6798 15.4441L47.6169 15.5048V30.265V45.0252H25.2743H2.93182L2.87116 30.4672C2.85095 22.4603 2.87116 15.7879 2.93182 15.6463C2.99248 15.4643 4.99421 15.4037 11.9295 15.4037H20.8261V16.9201Z" fill="#0078C3"/>
<path d="M11.8486 21.7688C10.2109 22.3552 9.119 23.993 9.09879 25.8734C9.09879 27.6931 10.1906 29.25 11.9902 29.9173L12.9405 30.2812L11.7475 30.5238C9.38186 31.0091 7.21837 33.0108 6.47025 35.3967C5.90411 37.1963 5.88389 40.8156 6.45003 41.503L6.8342 41.9883H13.446H20.0577L20.4621 41.4828C20.8261 41.0177 20.8665 40.7549 20.7856 38.4499C20.7048 36.2055 20.6441 35.7809 20.1386 34.6688C19.1479 32.5054 16.9844 30.7867 14.7805 30.443L13.911 30.3014L14.8613 29.9375C16.6811 29.25 17.7932 27.6931 17.7932 25.8127C17.7932 22.7596 14.8007 20.7174 11.8486 21.7688ZM14.4569 24.8017C14.74 25.0646 14.9624 25.5296 14.9624 25.8127C14.9624 26.4799 14.1132 27.3292 13.446 27.3292C13.1629 27.3292 12.6979 27.1068 12.435 26.8237C12.1519 26.5608 11.9295 26.0958 11.9295 25.8127C11.9295 25.5296 12.1519 25.0646 12.435 24.8017C12.6979 24.5187 13.1629 24.2962 13.446 24.2962C13.729 24.2962 14.1941 24.5187 14.4569 24.8017ZM15.0231 33.4557C16.7417 34.1836 17.7325 35.6596 17.9347 37.7422L18.056 39.0565H13.4662H8.89659V38.2275C8.89659 36.1651 9.96822 34.3251 11.606 33.577C12.5765 33.1322 14.1132 33.0917 15.0231 33.4557Z" fill="#0078C3"/>
<path d="M27.2957 27.7338C26.77 28.2595 26.77 29.3716 27.2553 29.8164C27.599 30.1197 28.4685 30.1602 35.6464 30.1602C43.4106 30.1602 43.6937 30.1399 44.0779 29.7558C44.6238 29.2098 44.5834 28.4213 43.9768 27.8349L43.4915 27.3294H35.5857C27.963 27.3294 27.6799 27.3496 27.2957 27.7338Z" fill="#0078C3"/>
<path d="M27.3366 36.5475C27.0131 36.7699 26.8917 37.0529 26.8917 37.6393C26.8917 39.0749 26.7502 39.0547 35.6872 39.0547H43.6132L44.0378 38.5896C44.604 37.983 44.604 37.2147 44.0176 36.6688C43.5526 36.2239 43.4717 36.2239 35.667 36.2239C28.8732 36.2239 27.7207 36.2644 27.3366 36.5475Z" fill="#0078C3"/>
</svg>
