<svg width="30" height="30" viewBox="0 0 30 30" fill="none" xmlns="http://www.w3.org/2000/svg">
<circle cx="15" cy="15" r="14.5" stroke="white"/>
<rect width="16.1205" height="0.848449" rx="0.424225" transform="matrix(0.707151 -0.707062 0.707151 0.707062 9 20.3984)" fill="white"/>
<rect width="16.1205" height="0.848449" rx="0.424225" transform="matrix(0.707151 0.707062 -0.707151 0.707062 9.60059 9)" fill="white"/>
</svg>
