<svg width="32" height="32" viewBox="0 0 32 32" fill="none" xmlns="http://www.w3.org/2000/svg">
<path d="M12.0708 0.676406C11.8363 0.91091 11.824 1.0837 11.824 3.12018C11.824 5.10729 11.8487 5.35414 12.0461 5.52693C12.3547 5.8108 13.0088 5.78612 13.3051 5.4899C13.5272 5.26774 13.5519 5.08261 13.5519 3.15721C13.5519 1.24415 13.5272 1.05902 13.2927 0.75046C12.9842 0.355507 12.4287 0.31848 12.0708 0.676406Z" fill="#0078C3"/>
<path d="M19.2425 0.751994C19.008 1.06055 18.9833 1.24569 18.9833 3.04766C18.9833 5.42972 19.0821 5.73828 19.9214 5.73828C20.1559 5.73828 20.3904 5.63954 20.5385 5.47909C20.7483 5.24459 20.773 5.01009 20.773 3.06C20.773 0.937128 20.773 0.900101 20.4768 0.665598C20.0571 0.332356 19.5511 0.369383 19.2425 0.751994Z" fill="#0078C3"/>
<path d="M15.6016 2.55616C15.4411 2.77832 15.4041 3.23498 15.4041 4.93822C15.4041 6.98704 15.4165 7.06109 15.688 7.32028C16.0459 7.65353 16.5643 7.66587 16.8852 7.34497C17.1074 7.12281 17.132 6.93767 17.132 4.9629C17.132 2.4821 17.0703 2.28463 16.2681 2.28463C15.9101 2.28463 15.7374 2.35868 15.6016 2.55616Z" fill="#0078C3"/>
<path d="M14.2558 9.75018C10.4914 10.466 7.4305 12.774 5.77663 16.1682C4.90033 17.9455 4.61646 19.2167 4.61646 21.2902C4.61646 22.2036 4.67817 23.1909 4.75222 23.4625L4.87565 23.9808L4.18448 24.0549C2.22205 24.2771 0.91377 25.7335 0.926112 27.6465C0.926112 29.0906 1.58025 30.1643 2.82683 30.7815L3.59205 31.1641H16.1812C25.1787 31.1641 28.8938 31.127 29.227 31.0283C30.0169 30.7938 30.8438 30.0656 31.2635 29.251C31.5844 28.6339 31.6337 28.3994 31.6214 27.5971C31.6214 26.8319 31.5597 26.5357 31.3005 26.0297C30.7328 24.9312 29.696 24.2277 28.3877 24.0549C27.7212 23.9685 27.7212 23.9685 27.7953 23.5859C27.8323 23.3761 27.9064 22.6479 27.9434 21.9567C28.1532 18.6366 26.9684 15.4647 24.5986 13.0703C23.1052 11.5645 21.1181 10.429 19.094 9.93531C17.7116 9.58973 15.527 9.51567 14.2558 9.75018ZM18.6126 11.6139C19.7728 11.8977 21.7476 12.8975 22.6609 13.675C24.216 15.0203 25.3515 16.7976 25.9193 18.7847C26.3019 20.1547 26.3019 22.4257 25.9069 23.8204C25.3515 25.7952 24.1913 27.6589 22.7843 28.8314L22.0561 29.4361H16.2799H10.4914L9.80022 28.8684C8.9486 28.1649 7.91185 26.8196 7.33176 25.6471C5.80132 22.5615 6.06051 18.6737 8.01059 15.7732C8.56599 14.9463 9.78788 13.6997 10.5901 13.1443C12.9845 11.5151 15.8479 10.9597 18.6126 11.6139ZM5.94943 26.7949C6.20861 27.3009 6.72699 28.1155 7.09726 28.5845L7.76374 29.4361H5.90006C3.85124 29.4361 3.57971 29.3621 3.01196 28.6956C2.75277 28.387 2.69106 28.1772 2.69106 27.6712C2.69106 26.4863 3.36989 25.8569 4.66583 25.8569H5.46808L5.94943 26.7949ZM29.0789 26.1037C29.6096 26.4246 30.0169 27.3133 29.9058 27.8687C29.7701 28.4734 29.3874 29.0165 28.9308 29.2387C28.5975 29.3868 28.1038 29.4361 26.6351 29.4361H24.7591L25.2775 28.819C25.8699 28.1155 27.0054 26.2765 27.0054 26.0173C27.0054 25.7335 28.5852 25.8075 29.0789 26.1037Z" fill="#0078C3"/>
<path d="M15.7243 15.256C15.4528 15.4781 15.4034 15.6016 15.4034 16.2063C15.391 16.8975 15.391 16.9099 14.8603 17.2308C13.2065 18.2305 13.2065 20.7606 14.8356 21.7233C15.1442 21.8961 15.6749 22.0936 16.0205 22.143C16.7857 22.2664 17.1683 22.5996 17.1683 23.1551C17.1683 23.8215 16.4031 24.2165 15.7737 23.8832C15.6379 23.8092 15.4774 23.5253 15.391 23.2291C15.2059 22.5379 14.9591 22.2788 14.4654 22.2788C13.8729 22.2788 13.515 22.7724 13.6261 23.4513C13.7865 24.4016 14.453 25.3273 15.1565 25.5495C15.3664 25.6112 15.4034 25.7346 15.4034 26.3394C15.4034 27.1786 15.6873 27.5859 16.2673 27.5859C16.8721 27.5859 17.1313 27.2157 17.1313 26.3641C17.1313 25.6729 17.1437 25.6359 17.5016 25.4877C18.0323 25.2656 18.6741 24.4757 18.8592 23.8215C19.1925 22.612 18.6247 21.3161 17.4892 20.7483C17.1313 20.5755 16.6623 20.4274 16.4401 20.4274C16.2303 20.4274 15.9094 20.3163 15.7243 20.1682C14.9097 19.5264 15.7119 18.2798 16.6993 18.6501C16.9338 18.7489 17.2547 19.3289 17.2547 19.6622C17.2547 20.304 18.3409 20.5632 18.7728 20.0325C19.2789 19.4153 18.7111 17.9096 17.7237 17.2801C17.1437 16.9099 17.1437 16.9099 17.1437 16.2063C17.1313 15.6386 17.0819 15.4535 16.8598 15.2436C16.5142 14.9227 16.1439 14.9227 15.7243 15.256Z" fill="#0078C3"/>
</svg>
