<svg width="70" height="70" viewBox="0 0 70 70" xmlns="http://www.w3.org/2000/svg">
<path d="M59.5734 5.94976L36.9996 0.247859C35.6914 -0.0827412 34.3078 -0.0825953 32.9993 0.248151L10.428 5.94947C7.82424 6.60717 6.00098 8.92779 5.99426 11.5958V33.0113C5.95794 47.2707 13.892 60.3444 26.5281 66.8717C27.1012 67.1676 27.805 66.943 28.1007 66.3702C28.3966 65.7976 28.1721 65.0935 27.5994 64.7976C15.6787 58.6399 8.29431 46.4624 8.3286 33.0142V11.5987C8.33254 10.0013 9.43113 8.60886 10.9998 8.21276L33.5712 2.51144C34.5058 2.27523 35.4938 2.27508 36.4282 2.51114L59.0019 8.21319C60.5698 8.6093 61.6679 10.0016 61.6719 11.5959V33.0174C61.7137 49.4399 50.6289 63.7022 34.7159 67.7008C34.0908 67.8579 33.7111 68.492 33.8683 69.1172C34.0261 69.7455 34.6631 70.1212 35.2846 69.9647C52.2398 65.7042 64.0505 50.5084 64.0061 33.0142V11.5927C63.9994 8.92779 62.1766 6.60732 59.5734 5.94976Z" />
<path d="M43.9972 57.1061C52.0472 51.8076 56.8386 42.8827 56.8141 33.2352V17.3472C56.8088 15.2327 55.3633 13.3919 53.2988 12.8703L36.557 8.64155C35.5385 8.38418 34.4615 8.38433 33.4423 8.64184L16.7023 12.8703C14.6374 13.3919 13.1916 15.2328 13.1862 17.3502V33.2323C13.1528 46.3478 22.0061 57.7383 34.7156 60.9321C35.3392 61.0889 35.9746 60.7109 36.132 60.0846C36.2891 59.4594 35.9096 58.8252 35.2843 58.6682C23.617 55.7363 15.4898 45.2792 15.5204 33.2354V17.3531C15.5232 16.3065 16.244 15.3936 17.2738 15.1336L34.0137 10.9053C34.6589 10.7423 35.3407 10.742 35.9852 10.905L52.7271 15.1339C53.7562 15.3939 54.4768 16.3066 54.4796 17.3504V33.2384C54.502 42.0985 50.1037 50.2924 42.7136 55.1565C42.1753 55.5109 42.026 56.2347 42.3804 56.7732C42.7351 57.3113 43.4587 57.4608 43.9972 57.1061Z" />
<path d="M26.196 30.7085L29.6975 23.7054C29.9858 23.1289 29.7521 22.4278 29.1757 22.1395C28.5991 21.8514 27.8979 22.0848 27.6098 22.6616L25.1522 27.5767L22.6945 22.6616C22.4062 22.085 21.7051 21.8513 21.1286 22.1395C20.5522 22.4278 20.3185 23.1289 20.6068 23.7054L24.1083 30.7085C24.5375 31.5668 25.7662 31.5679 26.196 30.7085Z" />
<path d="M34.4895 30.1866V29.0194H35.6567C37.5873 29.0194 39.1582 27.4487 39.1582 25.5179C39.1582 23.5871 37.5873 22.0164 35.6567 22.0164H33.3223C32.6778 22.0164 32.1552 22.539 32.1552 23.1836V30.1866C32.1552 30.8312 32.6778 31.3538 33.3223 31.3538C33.9669 31.3538 34.4895 30.8312 34.4895 30.1866ZM34.4895 24.3507H35.6567C36.3002 24.3507 36.8238 24.8744 36.8238 25.5179C36.8238 26.1615 36.3002 26.6851 35.6567 26.6851H34.4895V24.3507Z" />
<path d="M43.8268 30.1866V26.3192L47.6124 30.6996C48.3181 31.516 49.6627 31.0147 49.6627 29.9364V23.1834C49.6627 22.5389 49.1401 22.0163 48.4955 22.0163C47.8509 22.0163 47.3283 22.5389 47.3283 23.1834V26.8006L43.5428 22.4203C42.8387 21.6051 41.4925 22.1032 41.4925 23.1834V30.1864C41.4925 30.831 42.0151 31.3536 42.6597 31.3536C43.3042 31.3536 43.8268 30.8312 43.8268 30.1866Z" />
<path d="M39.1582 46.8187C39.8027 46.8187 40.3253 46.2961 40.3253 45.6516V43.0254H43.3891V45.6516C43.3891 46.2961 43.9117 46.8187 44.5563 46.8187C45.2009 46.8187 45.7235 46.2961 45.7235 45.6516V41.8583C45.7235 41.2137 45.2009 40.6911 44.5563 40.6911H32.4529C31.9265 38.5174 29.9657 36.8978 27.6324 36.8978C24.8971 36.8978 22.6719 39.123 22.6719 41.8583C22.6719 44.5935 24.8971 46.8187 27.6324 46.8187C29.9655 46.8187 31.9264 45.1991 32.4529 43.0254H37.991V45.6516C37.991 46.2961 38.5136 46.8187 39.1582 46.8187ZM27.6324 44.4844C26.1844 44.4844 25.0063 43.3063 25.0063 41.8583C25.0063 40.4102 26.1844 39.2321 27.6324 39.2321C29.0804 39.2321 30.2585 40.4102 30.2585 41.8583C30.2585 43.3063 29.0804 44.4844 27.6324 44.4844Z" />
</svg>
