<svg width="20" height="20" viewBox="0 0 20 20" xmlns="http://www.w3.org/2000/svg">
<path fill-rule="evenodd" clip-rule="evenodd" d="M4.62534 1.53972C5.03546 1.1296 5.5917 0.8992 6.17169 0.8992H16.2929C16.8729 0.8992 17.4291 1.1296 17.8393 1.53972C18.2494 1.94984 18.4798 2.50608 18.4798 3.08607V16.581C18.4798 17.161 18.2494 17.7173 17.8393 18.1274C17.4291 18.5375 16.8729 18.7679 16.2929 18.7679H2.79795C2.21796 18.7679 1.66172 18.5375 1.2516 18.1274C0.841485 17.7173 0.611084 17.161 0.611084 16.581V8.99011C0.611084 7.78619 1.59403 6.80324 2.79795 6.80324H3.98482V3.08607C3.98482 2.50608 4.21522 1.94984 4.62534 1.53972ZM3.98482 7.80324H2.79795C2.14632 7.80324 1.61108 8.33847 1.61108 8.99011V16.581C1.61108 16.8958 1.73613 17.1977 1.95871 17.4203C2.18129 17.6428 2.48318 17.7679 2.79795 17.7679C3.11273 17.7679 3.41462 17.6428 3.6372 17.4203C3.85978 17.1977 3.98482 16.8958 3.98482 16.581V7.80324ZM4.63474 17.7679C4.86151 17.4169 4.98482 17.0053 4.98482 16.581V3.08607C4.98482 2.77129 5.10987 2.46941 5.33245 2.24683C5.55503 2.02425 5.85691 1.8992 6.17169 1.8992H16.2929C16.6077 1.8992 16.9096 2.02425 17.1321 2.24683C17.3547 2.46941 17.4798 2.77129 17.4798 3.08607V16.581C17.4798 16.8958 17.3547 17.1977 17.1321 17.4203C16.9096 17.6428 16.6077 17.7679 16.2929 17.7679H4.63474ZM7.35856 4.77292C7.35856 4.49677 7.58242 4.27292 7.85856 4.27292H14.606C14.8822 4.27292 15.106 4.49677 15.106 4.77292V8.14665C15.106 8.4228 14.8822 8.64665 14.606 8.64665H7.85856C7.58242 8.64665 7.35856 8.4228 7.35856 8.14665V4.77292ZM8.35856 5.27292V7.64665H14.106V5.27292H8.35856ZM7.35856 11.5204C7.35856 11.2443 7.58242 11.0204 7.85856 11.0204H14.606C14.8822 11.0204 15.106 11.2443 15.106 11.5204C15.106 11.7966 14.8822 12.0204 14.606 12.0204H7.85856C7.58242 12.0204 7.35856 11.7966 7.35856 11.5204ZM7.35856 14.8942C7.35856 14.618 7.58242 14.3942 7.85856 14.3942H12.0757C12.3519 14.3942 12.5757 14.618 12.5757 14.8942C12.5757 15.1703 12.3519 15.3942 12.0757 15.3942H7.85856C7.58242 15.3942 7.35856 15.1703 7.35856 14.8942Z"/>
</svg>
