<svg width="70" height="70" viewBox="0 0 70 70" fill="none" xmlns="http://www.w3.org/2000/svg">
<path fill-rule="evenodd" clip-rule="evenodd" d="M4.78461 22.5859C3.26674 22.5859 2.02539 23.8275 2.02539 25.3426V47.4482C2.02539 48.9647 3.26804 50.2087 4.78461 50.2087H37.2497C37.802 50.2087 38.2497 50.6564 38.2497 51.2087C38.2497 51.7609 37.802 52.2087 37.2497 52.2087H4.78461C2.16215 52.2087 0.0253906 50.068 0.0253906 47.4482V25.3426C0.0253906 22.7216 2.16345 20.5859 4.78461 20.5859H49.6397C50.192 20.5859 50.6397 21.0337 50.6397 21.5859C50.6397 22.1382 50.192 22.5859 49.6397 22.5859H4.78461ZM53.3717 21.5859C53.3717 21.0337 53.8194 20.5859 54.3717 20.5859H65.2152C67.8319 20.5859 69.9746 22.7209 69.9746 25.3426V47.4482C69.9746 50.0687 67.8332 52.2087 65.2152 52.2087H54.4495L56.9623 54.8355C56.9685 54.842 56.9746 54.8486 56.9806 54.8552C57.2245 55.1243 57.3535 55.4921 57.2924 55.8807C57.2367 56.2347 57.0421 56.4944 56.861 56.6586L56.8601 56.6595L51.9926 61.0628L51.9816 61.0726C51.7976 61.2342 51.5202 61.3951 51.1676 61.4125C50.788 61.4313 50.4419 61.276 50.1976 61.0139L44.9955 55.5756L43.5463 56.8816L43.5431 56.8845C43.1922 57.198 42.6965 57.3123 42.2327 57.1443C41.7801 56.9804 41.4978 56.6038 41.3826 56.2113C41.3629 56.1442 41.3502 56.0752 41.3449 56.0055L40.5312 45.3245C40.5293 45.2992 40.5283 45.2739 40.5283 45.2485C40.5283 45.2442 40.5283 45.2392 40.5283 45.2338C40.5281 45.1783 40.5279 45.0703 40.5385 44.9727C40.5493 44.8732 40.589 44.5566 40.856 44.2896C40.8702 44.2754 40.8849 44.2616 40.8999 44.2483C41.0613 44.1052 41.2335 44.0396 41.3597 44.0088C41.4783 43.9798 41.5803 43.9757 41.6371 43.9751C41.7257 43.9741 41.8276 43.9827 41.8788 43.9871C41.8854 43.9876 41.8911 43.9881 41.8958 43.9885C41.9275 43.991 41.959 43.9951 41.9902 44.0007L52.5433 45.8789C52.6133 45.8914 52.6818 45.9113 52.7477 45.9383C53.1195 46.0909 53.4699 46.4052 53.5892 46.8755C53.7124 47.361 53.5412 47.8413 53.1979 48.1553L53.1953 48.1577L51.7926 49.4312L52.5363 50.2087H65.2152C66.7287 50.2087 67.9746 48.964 67.9746 47.4482V25.3426C67.9746 23.8282 66.73 22.5859 65.2152 22.5859H54.3717C53.8194 22.5859 53.3717 22.1382 53.3717 21.5859ZM51.3634 51.8758L49.6378 50.072C49.4514 49.877 49.3516 49.6151 49.3611 49.3455C49.3706 49.0759 49.4886 48.8216 49.6883 48.6403L50.8285 47.6051L42.5991 46.1405L43.2338 54.4709L44.3777 53.4401C44.7794 53.0781 45.396 53.101 45.7698 53.4917L51.1561 59.1226L54.9834 55.6602L51.4085 51.923C51.393 51.9078 51.3779 51.892 51.3634 51.8758ZM56.4296 31.3712C56.935 31.5938 57.1642 32.1841 56.9415 32.6895L53.7714 39.8851C53.5488 40.3905 52.9585 40.6197 52.4531 40.3971C51.9477 40.1744 51.7185 39.5842 51.9412 39.0788L55.1113 31.8831C55.3339 31.3777 55.9241 31.1485 56.4296 31.3712ZM61.739 31.3712C62.2444 31.5938 62.4737 32.1841 62.251 32.6895L59.0809 39.8851C58.8582 40.3905 58.268 40.6197 57.7626 40.3971C57.2572 40.1744 57.028 39.5842 57.2506 39.0788L60.4207 31.8831C60.6434 31.3777 61.2336 31.1485 61.739 31.3712ZM17.779 32.2863C17.779 31.734 18.2267 31.2863 18.779 31.2863H24.0303C24.5825 31.2863 25.0303 31.734 25.0303 32.2863C25.0303 32.8386 24.5825 33.2863 24.0303 33.2863H22.4027V39.482C22.4027 40.0342 21.955 40.482 21.4027 40.482C20.8504 40.482 20.4027 40.0342 20.4027 39.482V33.2863H18.779C18.2267 33.2863 17.779 32.8386 17.779 32.2863ZM26.4756 32.2863C26.4756 31.734 26.9233 31.2863 27.4756 31.2863H32.727C33.2793 31.2863 33.727 31.734 33.727 32.2863C33.727 32.8386 33.2793 33.2863 32.727 33.2863H31.1033V39.482C31.1033 40.0342 30.6556 40.482 30.1033 40.482C29.551 40.482 29.1033 40.0342 29.1033 39.482V33.2863H27.4756C26.9233 33.2863 26.4756 32.8386 26.4756 32.2863ZM9.1561 31.2863C9.70838 31.2863 10.1561 31.734 10.1561 32.2863V34.8841H13.4075V32.2863C13.4075 31.734 13.8552 31.2863 14.4075 31.2863C14.9598 31.2863 15.4075 31.734 15.4075 32.2863V39.482C15.4075 40.0342 14.9598 40.482 14.4075 40.482C13.8552 40.482 13.4075 40.0342 13.4075 39.482V36.8841H10.1561V39.482C10.1561 40.0342 9.70838 40.482 9.1561 40.482C8.60381 40.482 8.1561 40.0342 8.1561 39.482V32.2863C8.1561 31.734 8.60381 31.2863 9.1561 31.2863ZM36.1684 31.8207C36.4893 31.3119 37.0298 31.2863 37.211 31.2863H40.7105C41.6008 31.2863 42.2012 31.8376 42.5279 32.4176C42.8446 32.9798 42.972 33.6586 42.972 34.277C42.972 34.8953 42.8446 35.5741 42.5279 36.1363C42.2012 36.7163 41.6008 37.2676 40.7105 37.2676H37.994L37.9977 39.4803C37.9986 40.0326 37.5516 40.481 36.9994 40.482C36.4471 40.4829 35.9986 40.0359 35.9977 39.4836L35.9861 32.5515V32.5498C35.9861 32.5477 35.986 32.5452 35.986 32.5423C35.9859 32.5082 35.9857 32.4193 35.9953 32.3298C36.0061 32.2299 36.0373 32.0284 36.1684 31.8207ZM37.9906 35.2676H40.7017C40.7158 35.2552 40.7468 35.2231 40.7853 35.1547C40.8892 34.9704 40.972 34.6539 40.972 34.277C40.972 33.9 40.8892 33.5835 40.7853 33.3992C40.7468 33.3308 40.7158 33.2987 40.7017 33.2863H37.9873L37.9906 35.2676ZM47.6399 32.4559C48.1922 32.4559 48.6399 32.9036 48.6399 33.4559V33.4675C48.6399 34.0198 48.1922 34.4675 47.6399 34.4675C47.0876 34.4675 46.6399 34.0198 46.6399 33.4675V33.4559C46.6399 32.9036 47.0876 32.4559 47.6399 32.4559ZM47.6399 36.7508C48.1922 36.7508 48.6399 37.1985 48.6399 37.7508V37.7624C48.6399 38.3147 48.1922 38.7624 47.6399 38.7624C47.0876 38.7624 46.6399 38.3147 46.6399 37.7624V37.7508C46.6399 37.1985 47.0876 36.7508 47.6399 36.7508Z" fill="url(#paint0_linear_142_28446)"/>
<defs>
<linearGradient id="paint0_linear_142_28446" x1="69.5565" y1="40.8985" x2="3.60781" y2="25.5279" gradientUnits="userSpaceOnUse">
<stop stop-color="#312782"/>
<stop offset="0.04" stop-color="#3A2582"/>
<stop offset="0.51" stop-color="#951180"/>
<stop offset="0.84" stop-color="#CF057E"/>
<stop offset="1" stop-color="#E5007E"/>
</linearGradient>
</defs>
</svg>
