<svg width="16" height="16" viewBox="0 0 16 16" fill="none" xmlns="http://www.w3.org/2000/svg">
<g clip-path="url(#clip0_19_3313)">
<path d="M15.25 7.25H8.75V0.75C8.75 0.551088 8.67098 0.360322 8.53033 0.21967C8.38968 0.0790176 8.19891 0 8 0C7.80109 0 7.61032 0.0790176 7.46967 0.21967C7.32902 0.360322 7.25 0.551088 7.25 0.75V7.25H0.75C0.551088 7.25 0.360322 7.32902 0.21967 7.46967C0.0790176 7.61032 0 7.80109 0 8C0 8.19891 0.0790176 8.38968 0.21967 8.53033C0.360322 8.67098 0.551088 8.75 0.75 8.75H7.25V15.25C7.25 15.4489 7.32902 15.6397 7.46967 15.7803C7.61032 15.921 7.80109 16 8 16C8.19891 16 8.38968 15.921 8.53033 15.7803C8.67098 15.6397 8.75 15.4489 8.75 15.25V8.75H15.25C15.4489 8.75 15.6397 8.67098 15.7803 8.53033C15.921 8.38968 16 8.19891 16 8C16 7.80109 15.921 7.61032 15.7803 7.46967C15.6397 7.32902 15.4489 7.25 15.25 7.25Z" fill="url(#paint0_linear_19_3313)"/>
</g>
<defs>
<linearGradient id="paint0_linear_19_3313" x1="15.9044" y1="7.96024" x2="0.288986" y2="5.83594" gradientUnits="userSpaceOnUse">
<stop stop-color="#312782"/>
<stop offset="0.04" stop-color="#3A2582"/>
<stop offset="0.51" stop-color="#951180"/>
<stop offset="0.84" stop-color="#CF057E"/>
<stop offset="1" stop-color="#E5007E"/>
</linearGradient>
<clipPath id="clip0_19_3313">
<rect width="16" height="16" fill="white"/>
</clipPath>
</defs>
</svg>
