<svg width="20" height="20" viewBox="0 0 20 20" xmlns="http://www.w3.org/2000/svg">
<path fill-rule="evenodd" clip-rule="evenodd" d="M1.42944 9.40531C1.41601 9.60181 1.40918 9.80012 1.40918 10C1.40918 14.2648 4.51673 17.8037 8.591 18.4759V15.4546C8.591 15.105 8.45212 14.7697 8.20491 14.5225C7.9577 14.2753 7.62242 14.1364 7.27282 14.1364C6.658 14.1364 6.06836 13.8922 5.63361 13.4574C5.19887 13.0227 4.95463 12.433 4.95463 11.8182V10.9091C4.95463 10.5595 4.81576 10.2242 4.56855 9.97702C4.32134 9.72982 3.98606 9.59094 3.63645 9.59094H1.81827C1.66124 9.59094 1.52111 9.51854 1.42944 9.40531ZM1.50696 8.69965C1.59237 8.6316 1.70057 8.59094 1.81827 8.59094H3.63645C4.25127 8.59094 4.84091 8.83517 5.27565 9.26992C5.7104 9.70466 5.95463 10.2943 5.95463 10.9091V11.8182C5.95463 12.1678 6.09351 12.5031 6.34072 12.7503C6.58793 12.9975 6.92321 13.1364 7.27282 13.1364C7.88764 13.1364 8.47728 13.3806 8.91202 13.8154C9.34676 14.2501 9.591 14.8398 9.591 15.4546V18.5814C9.72656 18.5877 9.86295 18.5909 10.0001 18.5909C10.7751 18.5909 11.5262 18.4883 12.2404 18.2959C12.2319 18.2593 12.2274 18.2211 12.2274 18.1818V14.5455C12.2274 13.9307 12.4716 13.341 12.9063 12.9063C13.3411 12.4715 13.9307 12.2273 14.5455 12.2273H18.1819C18.2211 12.2273 18.2593 12.2318 18.296 12.2404C18.4884 11.5261 18.591 10.7751 18.591 10C18.591 8.89321 18.3817 7.83528 18.0005 6.86366H15.4546C15.105 6.86366 14.7697 7.00254 14.5225 7.24975C14.2753 7.49696 14.1365 7.83224 14.1365 8.18185C14.1365 8.79667 13.8922 9.3863 13.4575 9.82105C13.0227 10.2558 12.4331 10.5 11.8183 10.5C11.2035 10.5 10.6138 10.2558 10.1791 9.82105C9.74433 9.38631 9.50009 8.79667 9.50009 8.18185C9.50009 7.83224 9.36121 7.49696 9.114 7.24975C8.86973 7.00548 8.53946 6.86698 8.19435 6.86372C7.50129 6.89961 6.81497 6.71113 6.23731 6.32602C5.65524 5.93797 5.21501 5.3713 4.98295 4.71135C4.96421 4.65806 4.95463 4.60197 4.95463 4.54548V3.04606C3.13824 4.36623 1.85906 6.38071 1.50696 8.69965ZM5.87783 2.4609C5.92648 2.53802 5.95463 2.62937 5.95463 2.7273V4.45568C6.12089 4.87858 6.41284 5.24119 6.79201 5.49397C7.19372 5.76178 7.67157 5.89181 8.15359 5.86447C8.16302 5.86393 8.17246 5.86366 8.18191 5.86366C8.79673 5.86366 9.38637 6.1079 9.82111 6.54264C10.2559 6.97739 10.5001 7.56703 10.5001 8.18185C10.5001 8.53145 10.639 8.86673 10.8862 9.11394C11.1334 9.36115 11.4687 9.50003 11.8183 9.50003C12.1679 9.50003 12.5032 9.36115 12.7504 9.11394C12.9976 8.86674 13.1365 8.53145 13.1365 8.18185C13.1365 7.56703 13.3807 6.97739 13.8154 6.54264C14.2502 6.1079 14.8398 5.86366 15.4546 5.86366H17.5315C16.07 3.20836 13.2452 1.40912 10.0001 1.40912C8.50629 1.40912 7.10154 1.79038 5.87783 2.4609ZM17.9642 13.2273H14.5455C14.1959 13.2273 13.8607 13.3662 13.6134 13.6134C13.3662 13.8606 13.2274 14.1959 13.2274 14.5455V17.9642C15.3763 17.0925 17.0925 15.3763 17.9642 13.2273ZM9.25733 19.5626C9.50245 19.5814 9.75016 19.5909 10.0001 19.5909C15.297 19.5909 19.591 15.2969 19.591 10C19.591 4.70311 15.297 0.409119 10.0001 0.409119C4.70318 0.409119 0.40918 4.70311 0.40918 10C0.40918 14.9028 4.08797 18.9464 8.83577 19.521C8.91048 19.5654 8.99776 19.5909 9.091 19.5909C9.14932 19.5909 9.2053 19.581 9.25733 19.5626Z"/>
</svg>
