<svg width="70" height="70" viewBox="0 0 70 70" fill="none" xmlns="http://www.w3.org/2000/svg">
<g clip-path="url(#clip0_145_3165)">
<path fill-rule="evenodd" clip-rule="evenodd" d="M35 2.36719C16.9613 2.36719 2.36719 16.964 2.36719 35C2.36719 53.0388 16.964 67.6328 35 67.6328C41.8715 67.6328 48.2403 65.5158 53.4942 61.8984C53.9491 61.5852 54.5718 61.7001 54.885 62.155C55.1982 62.6099 55.0833 63.2325 54.6284 63.5457C49.051 67.3858 42.2887 69.6328 35 69.6328C15.8595 69.6328 0.367188 54.1435 0.367188 35C0.367188 15.8595 15.8567 0.367188 35 0.367188C54.1405 0.367188 69.6328 15.8566 69.6328 35C69.6328 42.2883 67.3859 49.0506 63.5457 54.6284C63.2325 55.0833 62.6099 55.1982 62.155 54.885C61.7001 54.5718 61.5852 53.9492 61.8984 53.4943C65.5159 48.2398 67.6328 41.8711 67.6328 35C67.6328 16.9613 53.0361 2.36719 35 2.36719ZM20.183 14.1496C24.3677 11.1664 29.4758 9.39067 35 9.39067C49.123 9.39067 60.6094 20.8771 60.6094 35C60.6094 40.5242 58.8336 45.6323 55.8504 49.817C55.6797 50.0565 55.4122 50.2087 55.1191 50.2331C54.826 50.2575 54.537 50.1516 54.329 49.9437L20.0564 15.671C19.8484 15.463 19.7425 15.1741 19.7669 14.881C19.7913 14.5879 19.9435 14.3204 20.183 14.1496ZM22.3271 15.1133L54.8867 47.673C57.2364 44.0065 58.6094 39.6639 58.6094 35C58.6094 21.9816 48.0184 11.3907 35 11.3907C30.3361 11.3907 25.9935 12.7636 22.3271 15.1133ZM14.881 19.767C15.1741 19.7426 15.463 19.8485 15.671 20.0564L49.9437 54.3291C50.1516 54.5371 50.2575 54.826 50.2331 55.1191C50.2087 55.4123 50.0565 55.6797 49.817 55.8505C45.6323 58.8337 40.5241 60.6094 35 60.6094C20.8771 60.6094 9.39067 49.1231 9.39067 35.0001C9.39067 29.4759 11.1664 24.3678 14.1496 20.1831C14.3204 19.9436 14.5879 19.7914 14.881 19.767ZM15.1133 22.3272C12.7636 25.9936 11.3907 30.3362 11.3907 35.0001C11.3907 48.0185 21.9816 58.6094 35 58.6094C39.6638 58.6094 44.0065 57.2365 47.673 54.8868L15.1133 22.3272Z" fill="white"/>
<path d="M60.1563 58.7891C60.1563 59.5441 59.544 60.1563 58.7891 60.1563C58.0341 60.1563 57.4219 59.5441 57.4219 58.7891C57.4219 58.0342 58.0341 57.4219 58.7891 57.4219C59.544 57.4219 60.1563 58.0342 60.1563 58.7891Z" fill="white"/>
</g>
<defs>
<clipPath id="clip0_145_3165">
<rect width="70" height="70" fill="white"/>
</clipPath>
</defs>
</svg>
