<svg width="70" height="70" viewBox="0 0 70 70" xmlns="http://www.w3.org/2000/svg">
<path d="M16.3333 58.3333H14C12.7113 58.3333 11.6667 59.378 11.6667 60.6667V63C11.6667 64.2887 12.7113 65.3333 14 65.3333H16.3333C17.622 65.3333 18.6667 64.2887 18.6667 63V60.6667C18.6667 59.378 17.622 58.3333 16.3333 58.3333ZM14 63V60.6667H16.3333V63H14Z" />
<path d="M25.6667 58.3333H23.3333C22.0447 58.3333 21 59.378 21 60.6667V63C21 64.2887 22.0447 65.3333 23.3333 65.3333H25.6667C26.9553 65.3333 28 64.2887 28 63V60.6667C28 59.378 26.9553 58.3333 25.6667 58.3333ZM23.3333 63V60.6667H25.6667V63H23.3333Z" />
<path d="M35 58.3333H32.6667C31.378 58.3333 30.3333 59.378 30.3333 60.6667V63C30.3333 64.2887 31.378 65.3333 32.6667 65.3333H35C36.2887 65.3333 37.3333 64.2887 37.3333 63V60.6667C37.3333 59.378 36.2887 58.3333 35 58.3333ZM32.6667 63V60.6667H35V63H32.6667Z" />
<path d="M44.3333 58.3333H42C40.7113 58.3333 39.6667 59.378 39.6667 60.6667V63C39.6667 64.2887 40.7113 65.3333 42 65.3333H44.3333C45.622 65.3333 46.6667 64.2887 46.6667 63V60.6667C46.6667 59.378 45.622 58.3333 44.3333 58.3333ZM42 63V60.6667H44.3333V63H42Z" />
<path d="M25.6667 35H32.6667C33.311 35 33.8333 34.4777 33.8333 33.8333C33.8333 33.189 33.311 32.6667 32.6667 32.6667H25.6667C25.0223 32.6667 24.5 33.189 24.5 33.8333C24.5 34.4777 25.0223 35 25.6667 35Z" />
<path d="M31.5 37.3333C31.5 36.689 30.9777 36.1667 30.3333 36.1667H28C27.3557 36.1667 26.8333 36.689 26.8333 37.3333C26.8333 37.9777 27.3557 38.5 28 38.5H30.3333C30.9777 38.5 31.5 37.9777 31.5 37.3333Z" />
<path d="M65.3963 -7.9144e-06H65.2703C63.3649 -0.0152585 61.7988 1.49943 61.7505 3.40433L60.9198 33.8333H58.3333C58.3295 30.6133 55.7201 28.0038 52.5 28H5.83333C2.61327 28.0038 0.00385714 30.6133 0 33.8333V64.1667C0.00385714 67.3867 2.61327 69.9961 5.83333 70H52.5C55.7201 69.9961 58.3295 67.3867 58.3333 64.1667V43.1667H60.6667C60.6667 43.7865 60.9133 44.3809 61.3521 44.8186C61.791 45.2564 62.386 45.5015 63.0058 45.5H67.6515C68.284 45.5043 68.8912 45.2517 69.334 44.7999C69.7767 44.3481 70.0171 43.736 70 43.1037L68.9162 3.40549C68.8685 1.50014 67.3022 -0.015246 65.3963 -7.9144e-06ZM56 64.1667C56 66.0997 54.433 67.6667 52.5 67.6667H5.83333C3.90034 67.6667 2.33333 66.0997 2.33333 64.1667V33.8333C2.33333 31.9003 3.90034 30.3333 5.83333 30.3333H52.5C54.433 30.3333 56 31.9003 56 33.8333V64.1667ZM58.3333 36.1667H60.8557L60.7285 40.8333H58.3333V36.1667ZM63 43.1667L64.0838 3.46849C64.101 2.82871 64.6304 2.32221 65.2703 2.33333H65.3963C66.0363 2.32221 66.5657 2.82871 66.5828 3.46849L67.6562 43.1667H63Z" />
<path d="M12.5813 14.1995C16.5596 9.16609 22.6226 6.23004 29.0383 6.23004C35.4541 6.23004 41.5171 9.16609 45.4953 14.1995C45.9002 14.6878 46.621 14.7631 47.1181 14.3691C47.6152 13.9751 47.7064 13.2562 47.3235 12.7505C42.9026 7.15858 36.1661 3.89689 29.0378 3.89689C21.9094 3.89689 15.1729 7.15858 10.752 12.7505C10.3519 13.2556 10.437 13.9895 10.9422 14.3897C11.4473 14.7898 12.1812 14.7046 12.5813 14.1995Z" />
<path d="M40.0167 18.5407C40.2751 18.8695 40.6898 19.0348 41.1036 18.974C41.5174 18.9132 41.867 18.6355 42.0199 18.2461C42.1728 17.8568 42.1055 17.4155 41.8437 17.0893C38.7456 13.1793 34.0305 10.8995 29.0418 10.8995C24.0532 10.8995 19.3381 13.1793 16.24 17.0893C15.8433 17.5941 15.9289 18.3245 16.4316 18.7238C16.9343 19.1231 17.6651 19.0412 18.067 18.5407C20.7224 15.1878 24.7648 13.2328 29.0418 13.2328C33.3188 13.2328 37.3612 15.1878 40.0167 18.5407Z" />
<path d="M29.0383 17.8967C26.1832 17.8855 23.4837 19.1962 21.7268 21.4468C21.3293 21.9549 21.4189 22.689 21.9269 23.0866C22.435 23.4841 23.1691 23.3946 23.5667 22.8865C24.8885 21.2091 26.9062 20.2302 29.0418 20.2302C31.1774 20.2302 33.1952 21.2091 34.517 22.8865C34.7742 23.2145 35.1868 23.3804 35.5995 23.3217C36.0121 23.263 36.3622 22.9886 36.5176 22.6019C36.6731 22.2152 36.6105 21.7749 36.3533 21.4468C34.5957 19.1953 31.8947 17.8844 29.0383 17.8967Z" />
</svg>
