<svg width="70" height="70" viewBox="0 0 70 70" fill="none" xmlns="http://www.w3.org/2000/svg">
<g clip-path="url(#clip0_145_3161)">
<path d="M60.2178 5.93355C60.2141 5.93355 60.2107 5.93355 60.207 5.93355C60.174 5.93268 60.141 5.93432 60.1083 5.93847L60.1017 5.93929L60.0773 5.94203C50.1724 7.22254 41.9668 5.30533 35.6888 0.243727L35.6802 0.237028C35.6603 0.221169 35.6423 0.20818 35.6255 0.197243C35.4295 0.0601252 35.1939 -0.00902715 34.9549 0.000354538C34.7158 0.00973623 34.4864 0.0971359 34.3017 0.249196C29.0437 4.58209 20.8116 6.4941 9.83531 5.93478C9.545 5.92012 9.26075 6.02134 9.04504 6.21618C8.82933 6.41102 8.69981 6.68354 8.68496 6.97384V6.98027C8.68414 6.99531 8.68359 7.01158 8.68359 7.02976C8.68359 7.02976 8.69453 41.255 8.71326 41.3354C8.88469 44.9472 9.90033 48.4686 11.6787 51.6169C13.4571 54.7653 15.9486 57.4529 18.9535 59.4643L34.389 69.8151C34.5689 69.9358 34.7806 70.0004 34.9972 70.0007C35.2138 70.001 35.4257 69.9369 35.6058 69.8166C35.6071 69.8162 35.6082 69.8157 35.6094 69.8151L35.6233 69.8058L51.0452 59.4643C54.208 57.3474 56.7999 54.4831 58.5911 51.1252C60.3824 47.7672 61.3178 44.0193 61.3144 40.2135V7.02935C61.3144 6.88539 61.286 6.74283 61.2309 6.60984C61.1758 6.47684 61.095 6.35602 60.9932 6.25425C60.8913 6.15249 60.7704 6.07179 60.6374 6.01677C60.5044 5.96174 60.3618 5.93346 60.2178 5.93355ZM49.8238 57.6429L34.9987 67.5844L20.1736 57.6429C17.3098 55.7262 14.963 53.1328 13.3411 50.0924C11.7192 47.052 10.8723 43.6585 10.8753 40.2125V8.17314C11.7641 8.20541 12.6364 8.22186 13.4921 8.2225C17.5885 8.2225 21.2897 7.85336 24.5313 7.11795C28.6564 6.18279 32.1726 4.62529 35.0014 2.48633C40.2978 6.49957 46.7692 8.52054 54.3076 8.52054C55.9158 8.51745 57.5228 8.43038 59.122 8.25968V40.2125C59.1251 43.6585 58.2781 47.052 56.6562 50.0924C55.0343 53.1328 52.6875 55.7262 49.8238 57.6429Z" fill="white"/>
<path d="M49.6868 20.4214C49.6793 20.4118 49.6731 20.4018 49.6649 20.3924C49.6402 20.3631 49.6141 20.3351 49.5866 20.3084C47.7782 18.2583 45.5577 16.6125 43.0702 15.4786C40.5827 14.3448 37.884 13.7482 35.1503 13.728C35.0498 13.7125 34.9475 13.7125 34.8471 13.728C24.1756 13.8101 15.519 22.511 15.519 33.1968V33.2098C15.5181 37.8535 17.1848 42.3431 20.2155 45.8614C20.2801 45.9705 20.3645 46.0666 20.4642 46.1447C22.2889 48.1965 24.5276 49.8385 27.0328 50.9625C29.538 52.0865 32.2529 52.6671 34.9987 52.6659C45.7355 52.6659 54.471 43.9388 54.4781 33.2091V33.1961C54.4821 28.4979 52.7794 23.9582 49.6868 20.4214ZM46.1549 32.1099C46.0411 29.6935 45.5369 27.3115 44.662 25.0563C46.0761 24.3864 47.4172 23.5719 48.6637 22.626C50.7862 25.3545 52.0363 28.6597 52.2508 32.1099H46.1549ZM36.0946 49.2824V45.6581C36.0946 45.3675 35.9791 45.0887 35.7736 44.8832C35.5681 44.6777 35.2893 44.5622 34.9987 44.5622C34.708 44.5622 34.4293 44.6777 34.2237 44.8832C34.0182 45.0887 33.9027 45.3675 33.9027 45.6581V49.2824C31.5446 47.4459 29.6134 45.1192 28.2426 42.4632C32.6129 40.9098 37.3849 40.9085 41.756 42.4597C40.3852 45.1171 38.4536 47.445 36.0946 49.2824ZM34.9987 39.1054C32.3886 39.107 29.7988 39.5641 27.3458 40.456C26.591 38.4855 26.1493 36.4089 26.0368 34.3017H33.9025V36.2997C33.9025 36.5904 34.0179 36.8692 34.2235 37.0747C34.429 37.2802 34.7077 37.3957 34.9984 37.3957C35.2891 37.3957 35.5678 37.2802 35.7733 37.0747C35.9789 36.8692 36.0943 36.5904 36.0943 36.2997V34.3017H43.96C43.8476 36.4074 43.4064 38.4826 42.6525 40.4519C40.1986 39.5625 37.6087 39.1069 34.9987 39.1054ZM17.7472 34.3017H23.8424C23.9574 36.6999 24.457 39.0641 25.3221 41.3038C23.9074 41.9787 22.5665 42.7985 21.3208 43.75C19.2097 41.0298 17.9647 37.7381 17.7472 34.3017ZM36.0949 32.1099V30.0918C36.0949 29.8011 35.9794 29.5223 35.7739 29.3168C35.5684 29.1113 35.2896 28.9958 34.9989 28.9958C34.7083 28.9958 34.4295 29.1113 34.224 29.3168C34.0185 29.5223 33.903 29.8011 33.903 30.0918V32.1093H26.0361C26.148 29.9741 26.5979 27.8701 27.3691 25.8759C29.8278 26.7689 32.4232 27.227 35.039 27.2294C37.6295 27.2275 40.2 26.7772 42.6369 25.8985C43.4029 27.8862 43.8499 29.9825 43.9614 32.1099H36.0949ZM33.9027 17.1094V20.7723C33.9027 21.063 34.0182 21.3417 34.2237 21.5473C34.4293 21.7528 34.708 21.8683 34.9987 21.8683C35.2893 21.8683 35.5681 21.7528 35.7736 21.5473C35.9791 21.3417 36.0946 21.063 36.0946 20.7723V17.1094C38.442 18.9374 40.3665 21.2512 41.7363 23.8922C39.5843 24.6487 37.3199 25.0359 35.0389 25.0377C32.733 25.0362 30.4442 24.6425 28.2705 23.8734C29.6399 21.2401 31.5609 18.933 33.9027 17.1094ZM38.5238 16.2795C41.8147 16.9669 44.8334 18.5995 47.2101 20.9771C46.1342 21.7804 44.982 22.476 43.77 23.0539C42.4664 20.4836 40.6862 18.1847 38.5238 16.2795ZM31.4738 16.2795C29.3192 18.1779 27.5437 20.4674 26.2413 23.0267C25.9679 22.8949 25.6963 22.7591 25.429 22.615C25.3023 22.5451 25.1629 22.501 25.0189 22.4853C24.875 22.4695 24.7294 22.4825 24.5905 22.5233C24.4516 22.5642 24.3221 22.6322 24.2096 22.7234C24.0972 22.8146 24.0039 22.9272 23.9352 23.0546C23.8665 23.1821 23.8237 23.3219 23.8093 23.4659C23.7949 23.61 23.8093 23.7555 23.8514 23.894C23.8936 24.0325 23.9629 24.1613 24.0551 24.2729C24.1473 24.3845 24.2608 24.4767 24.3889 24.5443C24.7033 24.7141 25.0235 24.8736 25.3459 25.0278C24.4642 27.2914 23.9562 29.6833 23.842 32.1099H17.746C17.9901 28.3337 19.4645 24.7414 21.9436 21.8826C24.4227 19.0237 27.7702 17.0557 31.4738 16.2795ZM22.7726 45.4006C23.8478 44.5921 24.9999 43.8914 26.2124 43.3088C27.5174 45.8913 29.3034 48.2009 31.4745 50.1137C28.1762 49.4247 25.1515 47.7868 22.7726 45.4006ZM38.5226 50.1133C40.6953 48.199 42.4823 45.8873 43.7875 43.3025C44.1859 43.4939 44.5781 43.6986 44.9642 43.9166C45.0895 43.9874 45.2275 44.0328 45.3704 44.0503C45.5132 44.0677 45.6581 44.0569 45.7968 44.0184C45.9354 43.9798 46.0651 43.9144 46.1785 43.8257C46.2918 43.737 46.3866 43.6269 46.4574 43.5016C46.5282 43.3763 46.5736 43.2383 46.5911 43.0955C46.6085 42.9526 46.5977 42.8077 46.5592 42.6691C46.5206 42.5304 46.4551 42.4007 46.3665 42.2874C46.2778 42.174 46.1677 42.0792 46.0424 42.0084C45.5951 41.7557 45.1397 41.5193 44.6764 41.2991C45.5406 39.0608 46.0398 36.6983 46.1549 34.3017H52.2505C52.0023 38.0745 50.5261 41.6622 48.0473 44.5172C45.5686 47.3722 42.2231 49.3379 38.5226 50.1133Z" fill="white"/>
</g>
<defs>
<clipPath id="clip0_145_3161">
<rect width="70" height="70" fill="white"/>
</clipPath>
</defs>
</svg>
