<svg width="500" height="447" viewBox="0 0 500 447" fill="none" xmlns="http://www.w3.org/2000/svg">
<path opacity="0.2" d="M385.044 303.572H114.955L164.509 160.715H335.491L385.044 303.572Z" fill="#009FDF"/>
<path d="M482.143 410.714H441.295L306.696 23.8839C304.245 16.9015 299.685 10.8529 293.647 6.57435C287.609 2.29577 280.391 -0.00153085 272.991 7.65355e-07H227.009C219.609 -0.00153085 212.391 2.29577 206.353 6.57435C200.315 10.8529 195.755 16.9015 193.304 23.8839L58.7054 410.714H17.8571C13.1211 410.714 8.5791 412.596 5.23024 415.944C1.88137 419.293 0 423.835 0 428.571C0 433.307 1.88137 437.849 5.23024 441.198C8.5791 444.547 13.1211 446.429 17.8571 446.429H482.143C486.879 446.429 491.421 444.547 494.77 441.198C498.119 437.849 500 433.307 500 428.571C500 423.835 498.119 419.293 494.77 415.944C491.421 412.596 486.879 410.714 482.143 410.714ZM177.232 178.571H322.768L360.045 285.714H139.955L177.232 178.571ZM227.009 35.7143H272.991L310.268 142.857H189.732L227.009 35.7143ZM127.679 321.429H372.321L403.348 410.714H96.6518L127.679 321.429Z" fill="#009FDF"/>
</svg>
