<svg width="454" height="104" viewBox="0 0 454 104" fill="none" xmlns="http://www.w3.org/2000/svg">
<path d="M0 51.9408C0 80.592 23.2216 103.881 51.7273 103.881C80.2334 103.881 103.455 80.592 103.455 51.9408C103.455 23.289 80.2334 0 51.7273 0C23.2211 0 0 23.289 0 51.9408ZM1.76151 51.9408C1.76151 24.2493 24.1819 1.76059 51.7277 1.76059C79.2731 1.76059 101.694 24.3298 101.694 51.9408C101.694 79.6318 79.2731 102.12 51.7277 102.12C24.1829 102.12 1.76198 79.6318 1.76198 51.9408H1.76151ZM16.0951 37.6951C29.3064 28.9717 43.9601 23.9294 68.7827 28.1714C70.144 27.371 70.8647 26.6507 71.2653 24.9701C65.0996 22.7291 58.3732 21.9288 49.6452 22.0888C41.8785 22.3288 27.7854 25.2101 20.3388 29.692L22.661 26.8107C27.9455 23.7694 41.5579 19.6074 51.8073 19.4479C59.0139 19.2875 62.7774 19.6879 71.3454 22.0083C70.6247 20.4882 68.7827 19.7678 66.2204 18.6471C57.893 14.886 42.3586 14.5656 29.627 20.1682C31.2284 19.1275 32.8299 18.0872 34.8319 17.2069C38.9956 15.2859 45.8821 13.4453 54.4496 13.5253C61.336 13.6058 69.4233 16.0062 74.4683 20.9681C75.269 21.9288 75.7491 22.9691 75.9897 23.8494C79.9128 25.8504 82.235 27.771 83.5163 29.932C84.077 31.0522 84.237 32.3329 83.997 33.6936C85.6785 34.6538 86.3992 35.5341 87.1999 36.5744C87.7601 37.4547 88.2407 38.4954 88.3207 39.4557C88.4808 40.7359 88.6408 42.0966 87.3599 43.6972C88.7213 44.3376 89.7621 46.2581 89.9222 47.0584C90.5629 50.0197 88.6408 52.981 86.0786 55.222C83.1962 57.7829 76.7904 60.8242 71.5854 62.1849C61.176 64.8257 52.0474 65.946 44.7608 67.2267C48.0437 68.027 52.448 69.0673 59.7346 69.0673C75.189 69.0673 88.8814 61.7045 88.8814 61.7045C88.8814 61.7045 88.5608 62.6648 88.2407 63.5451C78.3919 69.4677 62.7774 72.0286 56.1315 71.7086C49.3251 71.3882 43.64 70.3479 38.0349 68.6673C36.3534 69.1472 34.6719 69.6276 32.9904 70.3479C41.6379 74.4295 48.0437 75.3098 55.3308 75.8701C62.6974 76.4305 74.9484 74.5895 85.3579 70.8279C84.8777 71.3082 84.6372 72.0286 84.157 72.5089C78.872 75.3098 67.6618 78.1111 62.0567 78.3511C56.4516 78.591 49.6452 78.3511 43.72 77.2308C38.5955 76.2701 34.4313 74.5895 30.1076 72.6689C29.3069 73.2288 28.9063 74.0291 28.7462 74.8294C45.6415 83.7933 61.6566 84.0332 79.7528 78.3511L78.0713 79.9517C58.0531 88.1148 42.4386 84.9135 30.3477 79.0714C29.9475 78.9114 29.4669 78.671 29.1468 78.511C30.2676 80.5121 39.4763 87.2345 49.8057 88.1148C56.9322 88.6751 65.5797 87.4744 70.7847 85.3939L67.7419 86.9945C65.2596 88.1948 58.6137 90.9961 49.4051 90.4357C37.0741 89.6354 30.1876 84.1132 27.0647 81.2324C25.6233 79.8717 24.9026 78.3511 24.5025 76.4305C21.6997 74.9899 19.9382 73.4692 18.4968 71.1483C17.616 69.7876 17.7761 68.3469 18.0166 67.0667C18.0967 66.6663 18.1767 66.2664 18.3367 65.946C16.9754 64.9857 15.614 63.9454 15.0538 62.9047C13.8525 60.6642 14.5732 58.8232 15.4539 57.3025C14.7332 56.5022 14.013 55.6219 13.7729 54.8216C13.4523 53.7813 13.3723 52.8211 13.4523 51.7803C13.6924 49.9398 14.6532 48.2591 15.9346 46.7385C18.6573 43.6172 22.821 41.2163 30.1071 38.8154C37.2337 36.4944 40.0369 36.094 45.4019 34.8938C51.6472 33.4531 59.0939 32.9732 65.4197 30.8122C48.0437 27.531 29.8675 30.3319 15.1338 40.576L16.0951 37.6951V37.6951ZM75.5091 26.8907C75.269 27.771 74.3882 28.7317 73.7476 29.4516C75.6691 29.932 77.5911 30.6523 79.4327 31.3726C79.1926 29.692 77.1905 28.0109 75.5091 26.8907V26.8907ZM21.7797 61.9444C20.6589 61.3041 19.8582 60.9042 18.9774 60.1838C18.4968 61.3041 19.458 62.5048 20.4188 63.0652C20.899 62.6648 21.3796 62.3448 21.7797 61.9444ZM80.5535 39.0553C81.8349 39.6957 82.9557 40.176 83.997 40.8964C84.7977 39.3757 84.3171 38.415 82.6356 36.9748C82.0749 37.7746 81.3542 38.415 80.5535 39.0553ZM76.8704 41.2963C74.3077 42.497 70.7047 43.6972 65.4197 45.0579C61.176 46.0982 50.6865 47.6188 39.4763 50.0997C35.8727 50.9 26.264 53.141 21.5397 57.2225C22.821 58.2633 23.7018 58.5832 25.1432 59.3835C27.1448 58.1028 29.7875 56.9026 33.7106 55.8623C40.5971 54.0213 45.7216 53.221 51.9674 52.2607C58.1331 51.2204 69.6639 48.8195 76.0697 46.4986C78.1513 45.7782 80.0734 44.738 81.5148 43.6172C81.1142 43.1373 77.0305 41.1363 76.8704 41.2963V41.2963ZM28.3461 68.2669C29.3069 67.7066 30.4277 67.1467 31.709 66.5863C29.9475 65.866 28.1055 64.9857 26.184 64.1854C25.3032 64.7458 24.5825 65.3056 24.0219 65.866L28.3461 68.2669V68.2669ZM22.4204 68.8273C22.4204 69.9476 23.0611 70.9883 24.6625 72.2685C24.8226 71.6282 25.1432 71.1483 25.6238 70.5879C24.5025 70.108 23.3812 69.4677 22.4204 68.8273ZM31.1484 47.4588C43.8 43.7772 57.0123 42.577 70.4646 39.0553C65.1796 37.6151 62.2968 36.9748 56.7717 37.6151C48.6844 38.5754 39.8764 40.336 32.2697 42.577C29.3069 43.4573 13.6924 47.9392 18.1767 54.1813C18.1767 54.2617 20.8189 50.5001 31.1484 47.4588V47.4588ZM78.4719 34.4934C76.3898 33.5331 73.8276 32.6528 71.1048 31.933C69.904 32.8932 68.4626 33.7735 66.461 34.5739C69.904 35.2137 72.3862 36.0945 75.269 36.9748C75.7491 37.2147 78.0713 34.9738 78.4719 34.4934V34.4934ZM84.7177 46.6585C84.3171 46.9785 83.917 47.2989 83.4363 47.6988C80.5535 49.9398 76.0697 51.7003 69.8239 53.381C56.8517 56.9026 47.4035 57.3825 36.6735 60.0239C34.5919 60.5038 32.4298 61.2241 30.3477 62.1044C32.3497 63.1451 34.5114 64.0254 36.7535 64.9057C41.0777 63.625 43.2394 63.0652 49.4851 62.0244C51.8873 61.6245 59.3344 60.3438 64.619 59.1436C74.3077 57.0626 88.4808 52.5806 84.7177 46.6585V46.6585Z" fill="#05326E"/>
<path fill-rule="evenodd" clip-rule="evenodd" d="M151.082 48.4219H160.691L161.812 41.4591H168.378L169.499 48.4219H179.108L171.021 8.08594H159.17L151.082 48.4219V48.4219ZM165.095 20.331L166.937 32.5757H163.333L165.095 20.331ZM188.237 23.9327C188.797 24.0122 189.357 23.9327 189.838 23.7722C190.318 23.6123 190.799 23.2923 191.279 22.9724C191.68 22.652 192 22.1716 192.24 21.6917C192.48 21.2113 192.64 20.651 192.64 20.1711C192.64 19.6907 192.48 19.1303 192.32 18.6504C192.092 18.1848 191.764 17.7749 191.359 17.4497C190.959 17.1298 190.478 16.8898 189.998 16.7294C189.517 16.5694 188.957 16.5694 188.477 16.5694C186.715 16.5694 184.954 16.9698 183.272 17.6897V9.12667C185.994 8.40635 188.717 8.08594 191.52 8.08594C199.206 8.08594 202.73 13.2882 202.73 18.25C202.81 20.1711 202.249 22.0916 201.128 23.7722C200.087 25.3729 198.486 26.6536 196.644 27.3739V27.7738C198.646 28.3342 200.328 29.6148 201.528 31.295C202.73 32.9761 203.29 35.0566 203.13 37.1376C203.13 44.5004 197.765 48.5019 190.879 48.5019C187.756 48.6624 184.713 47.942 181.991 46.5014L182.151 38.4178C184.153 39.2981 186.235 39.6985 188.397 39.6185C188.957 39.699 189.437 39.6185 189.918 39.4585C190.398 39.2986 190.879 39.0582 191.279 38.6582C191.68 38.3378 192 37.8579 192.24 37.3775C192.48 36.8976 192.56 36.4173 192.56 35.8569C192.56 33.6964 191.119 32.1758 187.836 32.1758H184.153V23.9317H188.237V23.9327ZM207.534 8.16592H233.318V48.5019H223.869V17.8501H216.983V48.5019H207.534V8.16592V8.16592ZM238.763 48.4219H248.131V35.137H251.334C260.703 35.137 263.586 26.8135 263.586 21.5313C263.586 16.2495 260.303 8.08594 251.334 8.08594H238.763V48.4219ZM248.051 17.0498H250.293C252.455 17.0498 253.816 18.33 253.816 21.6113C253.816 26.0132 251.575 26.2532 250.293 26.2532H248.051V17.0503V17.0498ZM281.042 48.5819C292.252 48.5819 296.015 38.4983 296.015 28.4141C296.015 18.33 292.252 8.2459 281.042 8.2459C269.911 8.2459 266.068 18.33 266.068 28.4141C266.068 38.4983 269.831 48.5819 281.042 48.5819ZM281.042 39.0582C277.678 39.0582 275.997 35.297 275.997 28.3337C275.997 21.3718 277.678 17.6097 281.042 17.6097C284.405 17.6097 286.086 21.3713 286.086 28.3342C286.086 35.297 284.405 39.0586 281.042 39.0586V39.0582ZM337.173 48.262H348.463C350.145 48.342 351.906 48.022 353.508 47.3817C355.109 46.7413 356.551 45.7811 357.752 44.5004C358.953 43.3001 359.834 41.779 360.474 40.1789C361.035 38.5782 361.275 36.8177 361.115 35.137C361.115 24.893 353.188 23.1319 348.063 23.1319H346.461V17.8501H359.033V8.2459H337.253V48.342H337.173V48.262ZM346.381 40.2589V31.135H347.743C348.863 31.135 351.826 31.135 351.826 35.297C351.826 39.4585 348.863 40.3388 347.743 40.3388L346.381 40.2584V40.2589ZM395.066 8.16592H404.274V22.652H410.84V8.16592H420.129V48.4219H410.84V32.2557H404.274V48.342H395.066V8.16592V8.16592ZM426.375 8.16592H435.583V22.652H437.585L442.87 8.16592H452.959L445.752 27.2134L454 48.342H443.11L437.825 32.1758H435.583V48.342H426.375V8.16592V8.16592ZM132.666 8.24638H152.043V18.25H142.274V48.342H132.666V8.2459V8.24638ZM300.579 8.16592H308.586L315.633 17.6897L322.76 8.16592H330.767V48.5019H321.319V23.8522L315.633 30.8951L309.948 23.8527V48.4219H300.499V8.16592H300.579V8.16592ZM362.956 48.5019H372.565L373.687 41.5395H380.332L381.453 48.5019H391.063L382.975 8.16592H371.124L362.956 48.5019V48.5019ZM376.969 20.411L378.731 32.6557H375.127L376.969 20.411ZM347.75 55.8647V77.5536L356.238 55.8647H364.886V96.0407H356.318V74.3523L347.75 96.0407H339.182V55.8647H347.75V55.8647ZM282.331 55.8647V96.0407H290.898L299.466 74.3523V96.0407H308.034V55.8647H299.466L290.978 77.5536V55.8647H282.331V55.8647ZM254.144 55.5448V77.6336C254.144 84.7564 253.184 86.437 251.182 86.437C250.461 86.357 249.741 86.277 249.02 86.1166V95.5604C250.221 96.0407 251.502 96.2807 252.864 96.2807C262.953 96.2807 262.953 86.597 262.953 81.1548V65.2285H266.636V95.7208H275.444V55.5448H254.144ZM315.481 71.471V79.9545H319.324C322.527 79.9545 323.968 81.3952 323.968 83.6357C323.968 84.196 323.808 84.6764 323.568 85.1563C323.328 85.6367 323.008 86.0366 322.608 86.437C322.207 86.7569 321.727 87.0773 321.246 87.2373C320.766 87.3973 320.205 87.4773 319.725 87.3973C317.563 87.4773 315.401 87.0773 313.479 86.197L313.319 94.2802C316.041 95.7208 319.164 96.4411 322.287 96.2807C329.093 96.2807 334.538 92.1992 334.538 84.8364C334.698 82.7554 334.138 80.7548 332.937 79.0742C331.736 77.3931 330.054 76.1129 328.052 75.5526V75.1526C329.894 74.4323 331.416 73.0717 332.456 71.471C333.497 69.7904 333.978 67.8694 333.898 65.8688C333.898 60.827 330.454 55.6248 322.688 55.6248C319.885 55.6248 317.162 55.9447 314.44 56.665V65.0685C316.121 64.3482 317.883 64.0283 319.645 64.1082C320.125 64.0283 320.685 64.1082 321.166 64.2682C321.646 64.4282 322.127 64.6681 322.527 64.9885C322.928 65.3085 323.248 65.7889 323.488 66.1888C323.728 66.6691 323.808 67.1495 323.808 67.7094C323.728 68.7502 323.248 69.7904 322.447 70.5107C321.646 71.2311 320.605 71.551 319.485 71.551H315.481V71.471V71.471ZM403.161 95.9608H412.77V65.8688H422.539V55.7847H403.161V95.9608V95.9608ZM371.612 95.9608H380.821V79.9545H387.387V96.0407H396.675V55.7847H387.387V70.2708H380.821V55.7847H371.612V95.9608ZM163.502 95.3204H174.392C176.233 95.3204 177.915 95.0005 179.356 94.4401C180.798 93.8798 182.079 93.0794 183.04 92.1192C184.08 91.0789 184.801 89.9582 185.362 88.598C185.922 87.2373 186.163 85.7967 186.163 84.196C186.163 83.1558 186.083 82.115 185.842 81.0748C185.602 80.0345 185.282 79.0742 184.881 78.1935C184.401 77.3132 183.84 76.5128 183.2 75.873C182.479 75.2326 181.678 74.6723 180.637 74.3523C180.798 74.3523 181.038 74.1119 181.518 73.872C181.999 73.552 182.479 73.0717 183.04 72.5113C183.6 71.8714 184 71.0711 184.481 70.0304C184.881 68.9901 185.122 67.7094 185.122 66.2688C185.122 64.8286 184.881 63.3879 184.321 62.1072C183.851 60.844 183.114 59.6974 182.159 58.746C181.198 57.7857 180.077 57.0654 178.715 56.505C177.355 55.9447 175.833 55.7047 174.152 55.7047H163.502V95.3204V95.3204ZM172.55 71.2311V64.1882H173.911C174.632 64.1882 175.192 64.5082 175.593 65.0685C175.993 65.6289 176.233 66.5092 176.233 67.7094C176.233 68.9101 175.993 69.7904 175.593 70.4308C175.192 70.9907 174.632 71.3111 173.911 71.3111H172.55V71.2311V71.2311ZM172.55 86.8369V78.9138H174.152C174.952 78.9138 175.593 79.2342 176.153 79.9545C176.714 80.5949 176.954 81.6351 176.954 82.9153C176.954 84.196 176.714 85.1563 176.153 85.8766C175.593 86.517 174.952 86.9169 174.152 86.9169H172.55V86.8369V86.8369ZM189.445 55.7847V65.6289H197.133V95.3204H206.421V65.6289H214.108V55.7847H189.445V55.7847ZM231.965 55.5448C242.854 55.5448 246.538 65.7089 246.538 75.873C246.538 86.0366 242.854 96.2007 231.965 96.2007C221.075 96.2007 217.391 86.0366 217.391 75.873C217.391 65.7089 221.075 55.5448 231.965 55.5448V55.5448ZM231.965 65.1485C228.762 65.1485 227.08 68.9101 227.08 75.873C227.08 82.8354 228.762 86.597 231.965 86.597C235.248 86.597 236.849 82.8354 236.849 75.873C236.849 68.9101 235.168 65.1485 231.965 65.1485ZM152.131 55.7847L159.979 95.4004H150.61L149.489 88.598H143.083L141.962 95.4004H132.593L140.441 55.7847H152.131V55.7847ZM144.605 79.7946H148.048L146.286 67.7094L144.605 79.7946Z" fill="#05326E"/>
</svg>
