<svg width="285" height="83" viewBox="0 0 285 83" fill="none" xmlns="http://www.w3.org/2000/svg">
<path d="M274.123 83H11.1599C5.37732 83 0.641357 78.3761 0.641357 72.7303V11.1123C0.641357 5.46656 5.37732 0.842638 11.1599 0.842638H274.123C279.905 0.842638 284.641 5.46656 284.641 11.1123V72.7303C284.641 78.3761 279.905 83 274.123 83Z" fill="black"/>
<path d="M274.123 2.48835C278.993 2.48835 282.956 6.35745 282.956 11.1123V72.7303C282.956 77.4852 278.993 81.3543 274.123 81.3543H11.1599C6.2898 81.3543 2.32695 77.4852 2.32695 72.7303V11.1123C2.32695 6.35745 6.2898 2.48835 11.1599 2.48835H274.123ZM274.123 0.842638H11.1599C5.37732 0.842638 0.641357 5.46656 0.641357 11.1123V72.7303C0.641357 78.3761 5.37732 83 11.1599 83H274.123C279.905 83 284.641 78.3761 284.641 72.7303V11.1123C284.641 5.46656 279.905 0.842638 274.123 0.842638Z" fill="#A6A6A6"/>
<path d="M100.394 21.8772C100.394 23.5923 99.8677 24.9658 98.8316 25.9902C97.6404 27.2046 96.0889 27.8157 94.1877 27.8157C92.3706 27.8157 90.8191 27.1944 89.5464 25.9697C88.271 24.7271 87.6346 23.202 87.6346 21.3766C87.6346 19.5512 88.271 18.0261 89.5464 16.7937C90.8191 15.5588 92.3706 14.9375 94.1877 14.9375C95.0923 14.9375 95.9548 15.1198 96.7779 15.4587C97.5983 15.8002 98.2662 16.2623 98.7501 16.8323L97.6509 17.9157C96.8068 16.9427 95.6576 16.4625 94.1877 16.4625C92.8624 16.4625 91.7132 16.9144 90.7376 17.8258C89.7725 18.7398 89.2887 19.9234 89.2887 21.3766C89.2887 22.8297 89.7725 24.0236 90.7376 24.9376C91.7132 25.8388 92.8624 26.3009 94.1877 26.3009C95.5945 26.3009 96.7779 25.8388 97.7114 24.9273C98.3267 24.324 98.6765 23.4921 98.7685 22.4292H94.1877V20.9453H100.299C100.373 21.2662 100.394 21.5768 100.394 21.8772V21.8772Z" fill="white" stroke="white" stroke-width="0.16" stroke-miterlimit="10"/>
<path d="M110.089 16.7427H104.349V20.6452H109.524V22.1291H104.349V26.0316H110.089V27.5438H102.724V15.2305H110.089V16.7427Z" fill="white" stroke="white" stroke-width="0.16" stroke-miterlimit="10"/>
<path d="M116.932 27.5438H115.307V16.7427H111.785V15.2305H120.455V16.7427H116.932V27.5438V27.5438Z" fill="white" stroke="white" stroke-width="0.16" stroke-miterlimit="10"/>
<path d="M126.729 27.5438V15.2305H128.352V27.5438H126.729Z" fill="white" stroke="white" stroke-width="0.16" stroke-miterlimit="10"/>
<path d="M135.544 27.5438H133.932V16.7427H130.398V15.2305H139.078V16.7427H135.544V27.5438Z" fill="white" stroke="white" stroke-width="0.16" stroke-miterlimit="10"/>
<path d="M155.493 25.9492C154.249 27.1944 152.708 27.8157 150.87 27.8157C149.021 27.8157 147.48 27.1944 146.236 25.9492C144.995 24.7065 144.377 23.1815 144.377 21.3766C144.377 19.5717 144.995 18.0466 146.236 16.804C147.48 15.5588 149.021 14.9375 150.87 14.9375C152.697 14.9375 154.238 15.5588 155.482 16.8143C156.734 18.0672 157.352 19.582 157.352 21.3766C157.352 23.1815 156.734 24.7065 155.493 25.9492ZM147.438 24.9171C148.374 25.8388 149.513 26.3009 150.87 26.3009C152.216 26.3009 153.365 25.8388 154.291 24.9171C155.224 23.9953 155.698 22.8118 155.698 21.3766C155.698 19.9414 155.224 18.7578 154.291 17.8361C153.365 16.9144 152.216 16.4523 150.87 16.4523C149.513 16.4523 148.374 16.9144 147.438 17.8361C146.504 18.7578 146.031 19.9414 146.031 21.3766C146.031 22.8118 146.504 23.9953 147.438 24.9171V24.9171Z" fill="white" stroke="white" stroke-width="0.16" stroke-miterlimit="10"/>
<path d="M159.632 27.5438V15.2305H161.604L167.736 24.8069H167.807L167.736 22.4398V15.2305H169.359V27.5438H167.665L161.243 17.4949H161.172L161.243 19.8724V27.5438H159.632V27.5438Z" fill="white" stroke="white" stroke-width="0.16" stroke-miterlimit="10"/>
<path d="M143.977 45.5212C139.036 45.5212 135 49.1926 135 54.2581C135 59.2826 139.036 62.9925 143.977 62.9925C148.929 62.9925 152.965 59.2826 152.965 54.2581C152.965 49.1926 148.929 45.5212 143.977 45.5212ZM143.977 59.5521C141.266 59.5521 138.934 57.3673 138.934 54.2581C138.934 51.1079 141.266 48.9615 143.977 48.9615C146.689 48.9615 149.032 51.1079 149.032 54.2581C149.032 57.3673 146.689 59.5521 143.977 59.5521V59.5521ZM124.389 45.5212C119.438 45.5212 115.412 49.1926 115.412 54.2581C115.412 59.2826 119.438 62.9925 124.389 62.9925C129.338 62.9925 133.367 59.2826 133.367 54.2581C133.367 49.1926 129.338 45.5212 124.389 45.5212ZM124.389 59.5521C121.675 59.5521 119.335 57.3673 119.335 54.2581C119.335 51.1079 121.675 48.9615 124.389 48.9615C127.1 48.9615 129.433 51.1079 129.433 54.2581C129.433 57.3673 127.1 59.5521 124.389 59.5521ZM101.08 48.199V51.9115H110.16C109.895 53.986 109.185 55.511 108.096 56.5739C106.771 57.8576 104.706 59.2826 101.08 59.2826C95.4923 59.2826 91.1166 54.8794 91.1166 49.4237C91.1166 43.9679 95.4923 39.5648 101.08 39.5648C104.102 39.5648 106.3 40.7176 107.923 42.2118L110.602 39.5956C108.333 37.4801 105.314 35.8549 101.08 35.8549C93.4175 35.8549 86.9775 41.9422 86.9775 49.4237C86.9775 56.9051 93.4175 62.9925 101.08 62.9925C105.222 62.9925 108.333 61.6677 110.778 59.1824C113.284 56.7357 114.065 53.2953 114.065 50.5174C114.065 49.6547 113.992 48.8614 113.86 48.199H101.08ZM196.394 51.0771C195.655 49.1233 193.375 45.5212 188.731 45.5212C184.129 45.5212 180.298 49.0617 180.298 54.2581C180.298 59.1516 184.09 62.9925 189.173 62.9925C193.283 62.9925 195.655 60.5457 196.63 59.1208L193.58 57.1362C192.562 58.5894 191.177 59.5521 189.173 59.5521C187.182 59.5521 185.754 58.6612 184.839 56.9051L196.807 52.0707L196.394 51.0771V51.0771ZM184.192 53.986C184.09 50.6175 186.872 48.8922 188.865 48.8922C190.427 48.8922 191.752 49.6547 192.194 50.7459L184.192 53.986V53.986ZM174.465 62.461H178.399V36.7868H174.465V62.461ZM168.023 47.4673H167.891C167.008 46.4455 165.322 45.5212 163.187 45.5212C158.706 45.5212 154.609 49.3621 154.609 54.2864C154.609 59.1824 158.706 62.9925 163.187 62.9925C165.322 62.9925 167.008 62.0605 167.891 61.0079H168.023V62.2608C168.023 65.601 166.195 67.3956 163.247 67.3956C160.844 67.3956 159.353 65.7011 158.737 64.2762L155.316 65.6703C156.302 67.9861 158.914 70.8359 163.247 70.8359C167.86 70.8359 171.752 68.1864 171.752 61.7396V46.0527H168.023V47.4673V47.4673ZM163.523 59.5521C160.812 59.5521 158.543 57.3365 158.543 54.2864C158.543 51.208 160.812 48.9615 163.523 48.9615C166.195 48.9615 168.301 51.208 168.301 54.2864C168.301 57.3365 166.195 59.5521 163.523 59.5521V59.5521ZM214.812 36.7868H205.403V62.461H209.326V52.7331H214.812C219.169 52.7331 223.442 49.6547 223.442 44.7587C223.442 39.8652 219.158 36.7868 214.812 36.7868V36.7868ZM214.914 49.1618H209.326V40.3581H214.914C217.844 40.3581 219.516 42.733 219.516 44.7587C219.516 46.7459 217.844 49.1618 214.914 49.1618ZM239.167 45.4724C236.333 45.4724 233.385 46.6945 232.172 49.4031L235.654 50.8281C236.404 49.4031 237.781 48.941 239.238 48.941C241.274 48.941 243.338 50.1349 243.369 52.2427V52.5123C242.659 52.1118 241.14 51.5187 239.27 51.5187C235.52 51.5187 231.699 53.5341 231.699 57.2954C231.699 60.7357 234.771 62.9514 238.223 62.9514C240.863 62.9514 242.32 61.7884 243.235 60.4353H243.369V62.4199H247.159V52.5713C247.159 48.0193 243.677 45.4724 239.167 45.4724ZM238.694 59.5419C237.411 59.5419 235.623 58.9206 235.623 57.3673C235.623 55.3801 237.852 54.6176 239.783 54.6176C241.51 54.6176 242.32 54.9898 243.369 55.4802C243.062 57.8576 240.966 59.5419 238.694 59.5419V59.5419ZM260.964 46.0347L256.454 57.1644H256.32L251.658 46.0347H247.427L254.432 61.5881L250.435 70.2429H254.535L265.329 46.0347H260.964V46.0347ZM225.598 62.461H229.532V36.7868H225.598V62.461Z" fill="white"/>
<path d="M22.5936 16.3299C21.9757 16.9615 21.618 17.9448 21.618 19.2182V64.641C21.618 65.9144 21.9757 66.8977 22.5936 67.5293L22.7462 67.668L48.8163 42.2249V41.6241L22.7462 16.181L22.5936 16.3299Z" fill="url(#paint0_linear_1303_5528)"/>
<path d="M57.4963 50.7109L48.8159 42.2256V41.6248L57.5068 33.1395L57.7014 33.2499L67.9938 38.9676C70.9311 40.5902 70.9311 43.2603 67.9938 44.8932L57.7014 50.6005L57.4963 50.7109V50.7109Z" fill="url(#paint1_linear_1303_5528)"/>
<path d="M57.7017 50.6002L48.8162 41.9249L22.5935 67.5297C23.5691 68.531 25.16 68.6517 26.9692 67.6504L57.7017 50.6002" fill="url(#paint2_linear_1303_5528)"/>
<path d="M57.7017 33.2427L26.9692 16.1924C25.16 15.2014 23.5691 15.3221 22.5935 16.3234L48.8162 41.918L57.7017 33.2427Z" fill="url(#paint3_linear_1303_5528)"/>
<defs>
<linearGradient id="paint0_linear_1303_5528" x1="46.5016" y1="65.114" x2="12.0415" y2="29.8189" gradientUnits="userSpaceOnUse">
<stop stop-color="#00A0FF"/>
<stop offset="0.0066" stop-color="#00A1FF"/>
<stop offset="0.2601" stop-color="#00BEFF"/>
<stop offset="0.5122" stop-color="#00D2FF"/>
<stop offset="0.7604" stop-color="#00DFFF"/>
<stop offset="1" stop-color="#00E3FF"/>
</linearGradient>
<linearGradient id="paint1_linear_1303_5528" x1="71.8187" y1="41.9224" x2="20.9156" y2="41.9224" gradientUnits="userSpaceOnUse">
<stop stop-color="#FFE000"/>
<stop offset="0.4087" stop-color="#FFBD00"/>
<stop offset="0.7754" stop-color="#FFA500"/>
<stop offset="1" stop-color="#FF9C00"/>
</linearGradient>
<linearGradient id="paint2_linear_1303_5528" x1="52.87" y1="37.2088" x2="6.13935" y2="-10.6542" gradientUnits="userSpaceOnUse">
<stop stop-color="#FF3A44"/>
<stop offset="1" stop-color="#C31162"/>
</linearGradient>
<linearGradient id="paint3_linear_1303_5528" x1="15.9927" y1="82.6348" x2="36.86" y2="61.262" gradientUnits="userSpaceOnUse">
<stop stop-color="#32A071"/>
<stop offset="0.0685" stop-color="#2DA771"/>
<stop offset="0.4762" stop-color="#15CF74"/>
<stop offset="0.8009" stop-color="#06E775"/>
<stop offset="1" stop-color="#00F076"/>
</linearGradient>
</defs>
</svg>
