<svg width="17" height="14" viewBox="0 0 17 14" fill="none" xmlns="http://www.w3.org/2000/svg">
<path d="M14.1517 1.10891C14.4388 0.835626 14.8208 0.684545 15.2171 0.687544C15.6134 0.690543 15.9931 0.847387 16.2759 1.12498C16.5588 1.40258 16.7228 1.77921 16.7333 2.1754C16.7438 2.5716 16.5999 2.95637 16.3321 3.24852L8.20156 13.4168C8.06175 13.5674 7.89301 13.6882 7.70544 13.7721C7.51786 13.856 7.31529 13.9012 7.10985 13.905C6.9044 13.9088 6.7003 13.8711 6.50975 13.7942C6.31919 13.7174 6.1461 13.6028 6.00081 13.4575L0.608981 8.06571C0.458828 7.9258 0.338394 7.75707 0.254863 7.5696C0.171333 7.38213 0.126417 7.17976 0.122796 6.97456C0.119176 6.76935 0.156925 6.56552 0.23379 6.37522C0.310655 6.18492 0.425062 6.01205 0.570187 5.86693C0.715311 5.7218 0.888179 5.60739 1.07848 5.53053C1.26878 5.45366 1.47261 5.41592 1.67782 5.41954C1.88302 5.42316 2.08539 5.46807 2.27286 5.5516C2.46033 5.63513 2.62906 5.75557 2.76897 5.90572L7.03598 10.1707L14.113 1.15374C14.1257 1.13805 14.1394 1.12308 14.1538 1.10891H14.1517Z" fill="white"/>
</svg>
