<svg width="37" height="44" viewBox="0 0 37 44" fill="none" xmlns="http://www.w3.org/2000/svg">
<path d="M6.73559 43.4247C6.28375 43.2741 5.75661 43.1988 5.30477 43.0482C2.51843 42.0692 0.786377 39.5841 0.786377 36.5718C0.786377 29.9448 0.786377 23.3932 0.786377 16.7662C0.786377 13.6033 0.786377 10.4405 0.786377 7.27759C0.861684 3.9641 3.04557 1.25306 6.28375 0.650613C6.66028 0.575306 7.11212 0.5 7.56396 0.5C15.0946 0.5 22.55 0.5 30.0806 0.5C33.8459 0.5 36.8582 3.43695 36.8582 7.20228C36.8582 14.2058 36.8582 21.2093 36.8582 28.2128C36.8582 29.1918 36.2557 29.8695 35.3521 30.0201C34.599 30.0954 33.7706 29.6436 33.5447 28.8152C33.4694 28.5893 33.4694 28.2881 33.4694 28.0622C33.4694 21.2093 33.4694 14.3564 33.4694 7.50351C33.4694 5.77146 32.5657 4.49125 30.9843 4.03941C30.6831 3.9641 30.3065 3.88879 29.93 3.88879C22.4746 3.88879 15.0193 3.88879 7.56396 3.88879C5.53069 3.88879 4.09986 5.31962 4.09986 7.35289C4.09986 17.1427 4.09986 26.8573 4.09986 36.6471C4.09986 38.6804 5.53068 40.1112 7.63927 40.1112C15.0193 40.1112 22.3993 40.1112 29.8547 40.1112C31.9633 40.1112 33.3188 38.831 33.4694 36.7224C33.5447 35.4422 34.8249 34.6891 35.8792 35.2916C36.557 35.6681 36.7829 36.1953 36.7829 36.9483C36.7076 40.1865 34.2978 42.9729 31.0596 43.4247C30.9843 43.4247 30.909 43.5 30.8337 43.5C22.8512 43.4247 14.7934 43.4247 6.73559 43.4247Z" fill="#181919"/>
<path d="M17.628 19.0146C19.2278 19.0146 20.7514 19.0146 22.2751 19.0146C23.6463 19.0146 24.332 19.7764 24.2558 21.1477C23.9511 25.1853 21.2847 28.2326 17.3232 28.9944C12.9808 29.8324 8.40992 26.6328 7.72428 22.2904C6.88627 17.4147 10.0859 13.0724 14.9616 12.4629C15.2663 12.3867 15.571 12.3867 15.8758 12.3867C16.8661 12.3867 17.628 13.0724 17.628 14.1389C17.628 15.5864 17.628 17.11 17.628 18.5575C17.628 18.7098 17.628 18.8622 17.628 19.0146ZM14.1998 16.1196C12.2952 16.5767 10.6954 18.9384 10.9239 21.0715C11.1525 23.6617 13.1332 25.5662 15.6472 25.7186C17.8565 25.871 20.142 24.2711 20.5229 22.4428C20.3705 22.4428 20.2182 22.4428 20.0658 22.4428C18.6945 22.4428 17.3994 22.4428 16.0281 22.4428C14.8092 22.4428 14.1998 21.7571 14.1998 20.5382C14.1998 19.0907 14.1998 17.6433 14.1998 16.1196Z" fill="#C8181E"/>
<path d="M25.0075 16.7263C23.941 16.7263 22.8744 16.7263 21.8079 16.7263C20.7413 16.7263 19.9795 16.0407 19.9795 14.898C19.9795 12.7649 19.9795 10.6318 19.9795 8.42247C19.9795 7.35592 20.6651 6.5941 21.8079 6.67028C26.3026 6.67028 30.0355 10.4032 30.0355 14.898C30.0355 15.9645 29.3499 16.6501 28.2833 16.6501C27.2168 16.7263 26.1502 16.7263 25.0075 16.7263ZM23.4077 13.2981C24.3981 13.2981 25.3884 13.2981 26.3026 13.2981C25.9979 12.0792 24.4742 10.5556 23.4077 10.4032C23.4077 11.3936 23.4077 12.3078 23.4077 13.2981Z" fill="#C8181E"/>
<path d="M18.8605 35.4497C16.6512 35.4497 14.442 35.4497 12.2327 35.4497C11.4709 35.4497 10.8614 34.9926 10.6329 34.3069C10.4043 33.6213 10.5567 32.8595 11.1661 32.4786C11.4709 32.25 11.928 32.0977 12.3089 32.0977C16.6512 32.0977 20.9936 32.0977 25.336 32.0977C26.4026 32.0977 27.0882 32.8595 27.0882 33.7737C27.0882 34.764 26.3264 35.4497 25.2598 35.4497C23.2029 35.4497 20.9936 35.4497 18.8605 35.4497Z" fill="#181919"/>
</svg>
