<svg width="44" height="45" viewBox="0 0 44 45" fill="none" xmlns="http://www.w3.org/2000/svg">
<path d="M41.8525 0.981445C41.1742 0.981445 40.4958 0.981445 39.8175 0.981445C38.913 1.05682 38.0085 1.20756 37.1041 1.28293C33.8631 1.81054 30.7728 2.79038 28.1348 4.90081C26.2505 6.40825 24.8184 8.14182 24.2154 10.4784C23.8385 12.0612 23.9893 13.5686 24.5169 15.0761C24.5923 15.3022 24.5923 15.4529 24.3661 15.6037C23.3863 16.7343 22.4065 17.8648 21.502 18.9954C21.4266 19.0708 21.4266 19.0708 21.4266 19.0708C20.6729 17.9402 19.9946 16.8096 19.1655 15.7544C18.6378 15.0007 17.9595 14.3977 17.2811 13.7194C17.1304 13.5686 17.055 13.4179 17.1304 13.1918C18.5625 9.49852 17.2811 6.40825 14.4924 4.14708C12.5327 2.48889 10.1961 1.6598 7.70886 1.20756C7.03051 1.20756 6.20142 1.05682 5.37232 0.981445C4.46785 0.981445 3.63876 0.981445 2.80966 0.981445C2.58355 0.981445 2.35743 1.05682 2.05594 1.05682C1.15147 1.13219 0.548492 1.50905 0.171631 2.41352C0.171631 2.71501 0.171631 3.0165 0.171631 3.31799C0.322376 4.22246 0.47312 5.12692 0.699237 6.03139C1.37759 9.04628 2.58355 11.8351 4.69397 14.0962C5.9753 15.4529 7.48275 16.4328 9.29168 16.885C11.176 17.3372 12.9096 16.9604 14.6431 16.2067C14.9446 16.0559 15.02 16.1313 15.2461 16.282C16.9797 17.9402 17.8088 19.9753 18.9393 22.1611C18.9393 22.1611 19.7684 23.367 21.4266 23.367C23.0848 23.367 23.6124 22.1611 23.6124 22.1611C24.4415 20.8044 25.1952 19.523 26.2505 18.3925C27.1549 18.8447 27.984 19.3723 28.8885 19.6738C31.7526 20.5029 34.466 19.8999 36.8026 18.091C39.2145 16.282 40.7219 13.7947 41.7018 11.006C42.4555 8.97091 42.8324 6.86049 42.9831 4.67469C42.9831 4.52395 43.0585 4.3732 43.0585 4.29783C43.0585 3.61948 43.0585 2.94113 43.0585 2.26278C42.9831 1.6598 42.5309 1.20756 41.8525 0.981445ZM14.417 11.0813C13.4372 10.2522 12.4573 9.49852 11.4775 8.74479C11.2514 8.59405 11.0252 8.36793 10.7991 8.21719C10.0454 7.61421 8.99019 7.76495 8.46259 8.51868C7.93498 9.2724 8.01035 10.2522 8.6887 10.8552C9.66854 11.6843 10.7238 12.5134 11.779 13.3425C11.8543 13.4179 12.0051 13.4933 12.1558 13.644C11.0252 14.0209 10.0454 13.7947 9.06556 13.3425C7.63349 12.5888 6.65365 11.4582 5.82455 10.1015C4.76934 8.29256 4.16636 6.40825 3.7895 4.29783C4.46785 4.29783 5.1462 4.3732 5.74918 4.3732C7.93498 4.59932 9.97003 5.05155 11.8543 6.33288C12.9096 7.01123 13.814 7.9157 14.2663 9.12166C14.4924 9.72464 14.5677 10.403 14.417 11.0813ZM39.516 6.70974C39.2145 8.59405 38.6869 10.3276 37.7824 12.0612C36.9533 13.5686 35.9735 14.9253 34.466 15.8298C32.8832 16.8096 31.225 17.1111 29.4161 16.3574C29.2653 16.282 29.19 16.2067 28.9639 16.1313C29.4161 15.7544 29.793 15.4529 30.2452 15.0761C31.3758 14.1716 32.5817 13.2671 33.7123 12.438C34.2399 11.9858 34.466 11.4582 34.3153 10.7045C34.1645 10.0261 33.7123 9.57389 33.034 9.42315C32.5064 9.2724 31.9787 9.49852 31.6019 9.80001C30.3959 10.7798 29.1146 11.6843 27.9086 12.6642C27.7579 12.7395 27.6825 12.8903 27.4564 13.041C27.3057 12.438 27.381 11.9104 27.5318 11.3075C27.9086 9.80001 28.8885 8.66942 30.0944 7.68958C31.9787 6.18214 34.1645 5.35304 36.5011 4.82544C37.5563 4.59932 38.6115 4.52395 39.8175 4.29783C39.6667 5.2023 39.5914 5.95602 39.516 6.70974Z" fill="#C8181E"/>
<path d="M35.9735 24.8743C31.8281 24.8743 27.758 24.8743 23.6125 24.8743C23.4617 24.8743 23.311 24.8743 23.0095 24.8743H19.5424C17.5073 25.1004 16.0753 26.0802 15.1708 27.8892C13.5126 26.3817 11.9298 24.9496 10.347 23.4422C9.74398 22.9146 9.21638 22.387 8.6134 21.8594C7.18132 20.6534 5.52313 20.2766 3.7142 20.8795C1.82989 21.4825 0.774677 22.8392 0.322443 24.7989C0.322443 24.8743 0.24707 24.9496 0.24707 25.1004C0.24707 25.5526 0.24707 25.9295 0.24707 26.3817C0.322443 26.5325 0.322443 26.6832 0.397815 26.8339C0.623932 27.8138 1.07617 28.6429 1.82989 29.3212C5.0709 32.3361 8.23654 35.351 11.5529 38.2905C15.2462 41.5315 19.5424 43.3405 24.4416 43.8681C24.8938 43.9435 25.2707 43.9435 25.7229 44.0188C31.1497 44.0188 36.5012 44.0188 41.928 44.0188C42.6063 43.7927 43.0585 43.3405 43.2847 42.6621C43.2847 42.436 43.2847 42.2099 43.2847 41.9838C42.9078 41.0039 42.2295 40.6271 41.1742 40.6271C36.5765 40.6271 31.9788 40.6271 27.3057 40.6271C21.7282 40.6271 16.9044 38.7428 12.8342 34.8988C9.9701 32.2608 7.18132 29.6227 4.31717 26.9847C3.48808 26.231 3.41271 25.2511 4.09106 24.4974C4.76941 23.8191 5.74925 23.8191 6.57834 24.4974C9.89473 27.5123 13.2111 30.6026 16.5275 33.6175C17.432 34.4466 18.5625 34.8988 19.8439 34.9742C22.6326 34.9742 25.4968 34.9742 28.2856 34.9742C29.2654 34.9742 30.0191 34.2204 30.0191 33.316C30.0191 32.3361 29.2654 31.6578 28.2856 31.6578C25.5722 31.6578 22.7834 31.6578 20.07 31.6578C18.864 31.6578 17.9596 30.6026 18.3364 29.472C18.5625 28.7936 19.1655 28.3414 19.9946 28.3414C21.5774 28.3414 23.1603 28.3414 24.7431 28.3414C28.4363 28.3414 32.1296 28.3414 35.7474 28.3414C38.2347 28.3414 39.8929 29.9996 39.8929 32.4869C39.8929 32.9391 39.8929 33.3913 39.8929 33.8436C39.8929 34.748 40.4205 35.4264 41.2496 35.5771C42.0787 35.7279 42.8324 35.2756 43.1339 34.3712C43.1339 34.2958 43.2093 34.2958 43.2093 34.2204C43.2093 33.2406 43.2093 32.3361 43.2093 31.3563C43.1339 31.0548 43.0585 30.7533 42.9832 30.4518C42.2295 27.2108 39.3653 24.9496 35.9735 24.8743Z" fill="#181919"/>
</svg>
