<svg width="30" height="17" viewBox="0 0 30 17" fill="none" xmlns="http://www.w3.org/2000/svg">
<path d="M14.5736 11.8081L25.5905 0.782468C26.406 -0.0329582 27.7245 -0.0329582 28.5313 0.782468C29.338 1.59789 29.338 2.91646 28.5313 3.73189L16.0483 16.2235C15.2589 17.0129 13.9924 17.0303 13.177 16.2843L0.607233 3.74056C0.199521 3.33285 0 2.79502 0 2.26585C0 1.73669 0.199521 1.19886 0.607233 0.791143C1.42266 -0.0242817 2.74123 -0.0242817 3.54798 0.791143L14.5736 11.8081Z" fill="#181919"/>
</svg>
