<svg xmlns="http://www.w3.org/2000/svg" viewBox="0 0 22.871 40">
    <path d="M20.007,15.976,35.132.84a2.846,2.846,0,0,1,4.037,0,2.883,2.883,0,0,1,0,4.049L22.032,22.038a2.853,2.853,0,0,1-3.942.083L.834,4.9A2.859,2.859,0,0,1,4.871.852Z" transform="translate(0 40) rotate(-90)"/>
</svg>
