<svg width="48" height="35" viewBox="0 0 48 35" fill="none" xmlns="http://www.w3.org/2000/svg">
<path d="M48 29.3333C48 30.7478 47.4381 32.1044 46.4379 33.1046C45.4377 34.1048 44.0812 34.6667 42.6667 34.6667H5.33333C3.91885 34.6667 2.56229 34.1048 1.5621 33.1046C0.561903 32.1044 0 30.7478 0 29.3333V24H48V29.3333Z" fill="#CE2028"/>
<path d="M0 10.6665H48V23.9998H0V10.6665Z" fill="#22408C"/>
<path d="M42.6667 0H5.33333C3.91885 0 2.56229 0.561903 1.5621 1.5621C0.561903 2.56229 0 3.91885 0 5.33333L0 10.6667H48V5.33333C48 3.91885 47.4381 2.56229 46.4379 1.5621C45.4377 0.561903 44.0812 0 42.6667 0V0Z" fill="#EEEEEE"/>
</svg>
