<svg width="15" height="15" viewBox="0 0 15 15" fill="none" xmlns="http://www.w3.org/2000/svg">
<path d="M0.882788 13.474C0.892284 13.6681 1.04479 13.8237 1.2393 13.8415C1.24001 13.8416 1.24069 13.8417 1.24143 13.8418L4.35931 14.1161C4.56003 14.1337 4.74213 13.9999 4.78162 13.8058L5.00899 12.6881L6.14678 12.4644C6.30304 12.4337 6.42516 12.3136 6.45641 12.1601L6.68391 11.0423L7.82118 10.819C7.9584 10.792 8.07084 10.6957 8.11671 10.5658L8.58245 9.248C10.0899 9.67241 11.7264 9.26801 12.8474 8.16643C14.5404 6.50278 14.5404 3.79576 12.8474 2.13211C12.0273 1.32618 10.9368 0.882351 9.77696 0.882351C7.37605 0.882351 5.43468 2.79556 5.43468 5.14928C5.43468 5.60303 5.5065 6.04585 5.6444 6.46548L0.998906 10.9855C0.924011 11.0584 0.881893 11.1576 0.881893 11.2612V13.4554C0.881893 13.4617 0.882499 13.4678 0.882788 13.474ZM9.77694 1.65815C10.726 1.65807 11.6181 2.02121 12.2892 2.6806C13.6744 4.04178 13.6744 6.25658 12.2892 7.61778C11.612 8.28312 10.7051 8.63739 9.78007 8.63739C9.3439 8.63739 8.9035 8.55855 8.48162 8.39639C8.27319 8.31628 8.0384 8.4225 7.96492 8.63036L7.445 10.1016L6.27108 10.3321C6.11479 10.3628 5.9926 10.4829 5.96134 10.6364L5.73382 11.7543L4.59599 11.9781C4.43973 12.0088 4.31759 12.1288 4.28636 12.2824L4.07688 13.3123L2.15741 13.1434L7.26361 8.16754C7.41877 8.01631 7.41935 7.76968 7.26477 7.61783C5.04313 5.43475 6.60999 1.65815 9.77694 1.65815ZM1.67139 11.4229L5.98286 7.22788C6.11311 7.4566 6.26529 7.6745 6.43887 7.87869L1.67139 12.5244V11.4229Z" fill="white"/>
<path d="M10.1472 5.29413C10.877 5.29413 11.4707 4.70038 11.4707 3.9706C11.4707 3.24082 10.877 2.64707 10.1472 2.64707C9.41739 2.64707 8.82364 3.24082 8.82364 3.9706C8.82364 4.70038 9.41736 5.29413 10.1472 5.29413ZM10.1472 3.52941C10.3904 3.52941 10.5884 3.72734 10.5884 3.9706C10.5884 4.21386 10.3904 4.41179 10.1472 4.41179C9.90391 4.41179 9.70599 4.21386 9.70599 3.9706C9.70602 3.72734 9.90388 3.52941 10.1472 3.52941Z" fill="white"/>
</svg>
