<svg width="181" height="60" viewBox="0 0 181 60" fill="none" xmlns="http://www.w3.org/2000/svg">
<g clip-path="url(#clip0_290_2030)">
<path fill-rule="evenodd" clip-rule="evenodd" d="M28.5593 21.0418C29.508 20.7727 31.3886 20.346 32.7384 20.0937C34.6 19.7456 35.9546 19.6565 38.352 19.7251C40.7157 19.7928 41.9138 19.9431 43.108 20.3221C43.986 20.6007 45.4783 21.2052 46.4244 21.6655C47.3703 22.1258 48.9051 23.1064 49.8351 23.8448C50.7649 24.5831 52.1805 25.9109 52.9809 26.795C53.9011 27.8119 54.6256 28.8682 54.9518 29.6688C55.2865 30.4908 55.4867 31.4403 55.5226 32.3769C55.575 33.7378 55.63 33.8779 56.4954 34.8498C56.9999 35.4164 57.712 36.4715 58.0777 37.1945C58.4435 37.9175 58.926 39.1317 59.1502 39.8929C59.3743 40.6539 59.6507 42.0749 59.7645 43.0502C59.9006 44.2184 59.9037 45.4009 59.7734 46.5154C59.6648 47.4459 59.1358 49.767 58.5978 51.6738C58.06 53.5806 57.5732 55.1368 57.5163 55.1327C57.4594 55.1283 56.7765 54.0842 55.9988 52.8121C55.2213 51.54 54.0297 49.8305 53.3511 49.0131C52.6724 48.1957 51.654 47.1598 51.0876 46.711C50.5213 46.2624 49.5112 45.6659 48.8432 45.3856C48.1268 45.0852 47.0845 44.8679 46.3029 44.856C45.5739 44.8448 44.6105 44.9803 44.162 45.1569C43.7135 45.3335 43.0104 45.7634 42.5996 46.1125C42.1886 46.4614 41.5717 47.2396 41.2284 47.842C40.8852 48.4441 40.4189 49.5828 40.1922 50.3723C39.9653 51.1617 39.6779 52.8038 39.5529 54.0214C39.4245 55.2745 39.3866 57.1314 39.4653 58.3004C39.5417 59.4362 39.7448 61.1878 39.9164 62.1928C40.0883 63.1978 41.7829 69.0965 43.6827 75.301C45.5822 81.5055 47.0939 86.6327 47.0417 86.695C46.9897 86.7573 44.6512 84.8556 41.8451 82.4691C39.0392 80.0825 35.8209 77.4432 34.6932 76.6037C33.5654 75.7641 31.4276 74.3196 29.9422 73.3937C28.4569 72.4678 26.233 71.1969 25.0001 70.5697C23.7672 69.9426 21.8866 69.0522 20.821 68.5914C19.7554 68.1304 17.66 67.3259 16.1643 66.8033C14.6688 66.281 12.1002 65.5264 10.4562 65.1267C8.81253 64.727 6.36664 64.228 5.02117 64.0178C3.67571 63.8076 0.775825 63.5413 -1.42319 63.4257C-4.29637 63.2749 -5.5868 63.1131 -6.01001 62.8504C-6.33373 62.6494 -6.79914 62.2283 -7.04377 61.9145C-7.28861 61.6007 -7.58685 61.0358 -7.70631 60.6592C-7.82598 60.2826 -7.92383 59.5601 -7.92383 59.0538C-7.92383 58.3877 -7.45027 56.9976 -6.20938 54.0216C-5.26633 51.7604 -3.85196 48.7606 -3.0665 47.3556C-2.28083 45.9507 -1.0112 43.8719 -0.245098 42.7363C0.521002 41.6007 2.06523 39.5713 3.18645 38.2267C4.30767 36.8822 6.00479 35.0328 6.95783 34.1168C7.91087 33.2009 9.97493 31.4376 11.5446 30.1984C13.1143 28.9594 15.316 27.3348 16.4372 26.5884C17.5585 25.8423 19.4545 24.7437 20.6508 24.1477C21.8472 23.5514 23.7278 22.7187 24.8299 22.2973C25.9321 21.8757 27.6103 21.3108 28.5593 21.0418ZM45.7282 23.612C44.8365 23.1519 43.2935 22.5698 42.2997 22.3187C41.3057 22.0674 39.7128 21.8117 38.7597 21.7504C37.8067 21.6891 36.7058 21.6765 36.3134 21.7222C35.921 21.7682 34.7743 21.9268 33.7652 22.0749C32.7561 22.2231 31.2883 22.4995 30.5035 22.6895C29.7186 22.8792 28.205 23.3229 27.1398 23.6757C26.0746 24.0282 24.169 24.7899 22.9051 25.3682C21.6409 25.9467 19.6036 27.0322 18.3774 27.7807C17.1514 28.529 14.9485 30.0617 13.4823 31.1861C12.016 32.3108 9.88483 34.0828 8.74628 35.1238C7.60753 36.1647 5.75099 38.1112 4.62039 39.4492C3.48959 40.7872 1.98205 42.7385 1.27018 43.7853C0.558104 44.8324 -0.705002 46.9046 -1.53674 48.3903C-2.36869 49.8762 -3.73332 52.7418 -4.56914 54.7583C-5.48466 56.9665 -6.0891 58.7283 -6.0891 59.1883C-6.0891 59.6085 -5.91562 60.2079 -5.7034 60.5203C-5.33442 61.0642 -5.16175 61.0961 -1.6772 61.2601C0.325094 61.3545 3.14507 61.6062 4.5892 61.8201C6.03354 62.0337 8.41868 62.4852 9.88951 62.8233C11.3606 63.1615 13.5942 63.7651 14.8535 64.1645C16.1127 64.564 18.1309 65.2797 19.3383 65.7551C20.5458 66.2304 22.6804 67.1721 24.0819 67.8477C25.4835 68.5235 27.8798 69.8207 29.4071 70.7308C30.9346 71.6406 32.9987 72.9555 33.9939 73.6525C34.9894 74.3493 36.9963 75.8899 38.4539 77.0759C39.9115 78.2619 41.678 79.73 42.379 80.3382L43.6542 81.4444L42.9633 79.179C42.5835 77.9329 41.522 74.4736 40.6046 71.491C39.6873 68.5087 38.8109 65.5529 38.657 64.9226C38.5031 64.2925 38.2297 62.8462 38.0497 61.7089C37.8619 60.5227 37.7196 58.3356 37.7158 56.579C37.7111 54.2965 37.8179 52.9717 38.1353 51.3765C38.3695 50.1993 38.8543 48.5801 39.2127 47.778C39.5709 46.9759 40.2803 45.8228 40.7893 45.2153C41.2984 44.6079 42.2194 43.8342 42.8365 43.4961C43.676 43.0356 44.3988 42.8555 45.7109 42.7792C46.9722 42.7059 47.7988 42.7937 48.6583 43.0918C49.3151 43.3197 50.2769 43.7627 50.7957 44.0765C51.3143 44.3901 52.3738 45.2506 53.1499 45.9884C53.926 46.7263 55.1102 48.1169 55.7815 49.0788L57.0022 50.8272L57.478 49.0306C57.7395 48.0424 58.0019 46.4677 58.061 45.5311C58.1326 44.3967 58.058 43.2689 57.838 42.1527C57.6564 41.2314 57.1834 39.7411 56.7871 38.8413C56.3908 37.9414 55.8059 36.907 55.4873 36.5428L54.908 35.8803L53.4465 36.5095C52.6429 36.8554 51.2799 37.2313 50.418 37.3446C49.5561 37.458 48.1829 37.4643 47.3664 37.3585C46.5502 37.2527 45.6874 37.0923 45.4493 37.0021C45.1537 36.8902 44.5581 37.1176 43.57 37.7198C42.7743 38.2044 41.7016 38.6676 41.186 38.7491C40.5684 38.8466 39.8389 38.7549 39.0474 38.4802C38.1304 38.1623 37.6128 37.7852 36.861 36.888C35.9844 35.8417 35.902 35.6546 36.112 35.1863C36.2419 34.8968 36.2965 34.4144 36.2333 34.1139C36.1701 33.8137 35.9263 33.2766 35.6915 32.9202L35.2646 32.2726H32.2575C30.4217 32.2726 28.5069 32.4249 27.342 32.6638C26.2926 32.8788 24.7398 33.3045 23.8915 33.6094C23.0433 33.9144 20.0651 35.1637 17.2737 36.3856C14.4822 37.6076 12.167 38.57 12.1287 38.5245C12.0906 38.4788 13.549 37.4531 15.3694 36.245C17.1901 35.0369 19.5243 33.5965 20.5564 33.0438C21.5885 32.4913 23.515 31.6092 24.8374 31.0834C26.1599 30.5577 28.1937 29.9388 29.3574 29.7082C30.9776 29.3873 32.1708 29.3197 34.4538 29.4197C36.5336 29.5109 37.9223 29.7046 39.048 30.0602C39.9352 30.3407 41.0819 30.8635 41.5962 31.2219C42.1103 31.5802 43.0564 32.4701 43.6986 33.1994C44.5725 34.192 45.085 34.5759 45.7372 34.7262C46.2162 34.8369 47.2504 34.9306 48.0353 34.9345C48.8201 34.9381 50.0586 34.7754 50.7874 34.5727C51.5162 34.3698 52.5024 34.0283 52.9788 33.8135C53.7482 33.4666 53.8452 33.3362 53.8452 32.6479C53.8452 32.222 53.5929 31.2795 53.2846 30.5536C52.8926 29.6308 52.257 28.7582 51.1704 27.6515C50.316 26.7811 49.1068 25.7044 48.4834 25.2587C47.8598 24.8133 46.6201 24.072 45.7282 23.612Z" fill="white"/>
<path fill-rule="evenodd" clip-rule="evenodd" d="M3.44849 9.01288V14.9013L11.664 19.8283V30.3592L13.3525 29.0511C17.2657 26.0197 21.5155 23.69 25.9651 22.1214V0L3.44849 9.01288ZM10.5483 31.2323C6.5579 34.4325 3.00736 38.3082 0 42.7178V14.4206L10.5483 20.6695V31.2323ZM39.3211 56C39.3418 54.6444 39.4559 53.3242 39.6734 52.0908C40.3588 48.2045 41.9436 45.623 44.5261 44.9191V56H39.3211ZM44.5261 21.0896C41.4289 19.9188 38.1528 19.5526 34.9197 20.0213L33.8295 20.1793C31.5451 20.5105 29.2901 21.0349 27.0808 21.7454V5.88841L44.5261 13.9399V21.0896ZM45.9461 44.7218V55.7597H52.1331V47.6599C49.9842 45.5342 47.8963 44.6802 45.9461 44.7218ZM52.1331 26.1967C50.3054 24.2788 48.2119 22.7539 45.9461 21.6895V19.3476L52.1331 16.7039V26.1967ZM53.1474 48.7542C53.9365 49.6772 54.7322 50.7767 55.5306 52.0711L57.39 55.0855L58.9934 49.5847C60.4998 44.4166 59.4403 38.6791 56.252 34.7399C55.9836 34.4082 55.6544 34.1753 55.3005 34.0493C55.3639 33.8215 55.3975 33.5798 55.3973 33.3317L55.397 32.9037C55.3956 30.9017 54.6909 28.9916 53.4536 27.6358L53.1474 27.3002V16.7039L64 21.3906V55.8904H53.1474V48.7542Z" fill="white"/>
</g>
<path d="M82.432 47.456V48.368H77.788V51.092H81.952V52.004H77.788V56H76.78V47.456H82.432ZM87.2336 53.312V49.808H88.1936V56H87.2816V55.076C86.8096 55.788 86.1616 56.144 85.3376 56.144C84.6496 56.144 84.1136 55.956 83.7296 55.58C83.3456 55.204 83.1536 54.676 83.1536 53.996V49.808H84.1136V53.9C84.1136 54.82 84.5856 55.28 85.5296 55.28C85.9776 55.28 86.3736 55.112 86.7176 54.776C87.0616 54.44 87.2336 53.952 87.2336 53.312ZM92.3461 49.808V50.648H91.0741V54.668C91.0741 55.02 91.3101 55.196 91.7821 55.196H92.3461V56C92.0821 56.024 91.8541 56.036 91.6621 56.036C90.6301 56.036 90.1141 55.608 90.1141 54.752V50.648H89.0941V49.808H90.1141V48.056H91.0741V49.808H92.3461ZM97.4406 53.312V49.808H98.4006V56H97.4886V55.076C97.0166 55.788 96.3686 56.144 95.5446 56.144C94.8566 56.144 94.3206 55.956 93.9366 55.58C93.5526 55.204 93.3606 54.676 93.3606 53.996V49.808H94.3206V53.9C94.3206 54.82 94.7926 55.28 95.7366 55.28C96.1846 55.28 96.5806 55.112 96.9246 54.776C97.2686 54.44 97.4406 53.952 97.4406 53.312ZM102.745 49.712C102.905 49.712 103.013 49.716 103.069 49.724V50.648H102.829C102.189 50.648 101.689 50.808 101.329 51.128C100.977 51.44 100.801 51.888 100.801 52.472V56H99.8411V49.808H100.753V50.9C101.169 50.108 101.833 49.712 102.745 49.712ZM109.003 52.904V53.24H104.299C104.347 53.912 104.535 54.42 104.863 54.764C105.191 55.1 105.639 55.268 106.207 55.268C107.063 55.268 107.611 54.884 107.851 54.116H108.847C108.679 54.74 108.367 55.236 107.911 55.604C107.455 55.964 106.879 56.144 106.183 56.144C105.327 56.144 104.635 55.852 104.107 55.268C103.571 54.684 103.303 53.896 103.303 52.904C103.303 51.928 103.567 51.144 104.095 50.552C104.615 49.96 105.303 49.664 106.159 49.664C107.047 49.664 107.743 49.972 108.247 50.588C108.751 51.204 109.003 51.976 109.003 52.904ZM106.159 50.54C105.655 50.54 105.243 50.7 104.923 51.02C104.603 51.332 104.403 51.784 104.323 52.376H107.971C107.923 51.832 107.739 51.392 107.419 51.056C107.099 50.712 106.679 50.54 106.159 50.54ZM117.083 50.696V47.456H118.043V56H117.131V55.04C116.635 55.776 115.927 56.144 115.007 56.144C114.135 56.144 113.439 55.848 112.919 55.256C112.391 54.664 112.127 53.88 112.127 52.904C112.127 51.912 112.391 51.124 112.919 50.54C113.431 49.956 114.127 49.664 115.007 49.664C115.895 49.664 116.587 50.008 117.083 50.696ZM113.135 52.952C113.135 53.688 113.315 54.26 113.675 54.668C114.035 55.076 114.519 55.28 115.127 55.28C115.735 55.28 116.219 55.068 116.579 54.644C116.939 54.228 117.119 53.648 117.119 52.904C117.119 52.168 116.939 51.588 116.579 51.164C116.219 50.74 115.735 50.528 115.127 50.528C114.527 50.528 114.043 50.748 113.675 51.188C113.315 51.62 113.135 52.208 113.135 52.952ZM124.882 52.904V53.24H120.178C120.226 53.912 120.414 54.42 120.742 54.764C121.07 55.1 121.518 55.268 122.086 55.268C122.942 55.268 123.49 54.884 123.73 54.116H124.726C124.558 54.74 124.246 55.236 123.79 55.604C123.334 55.964 122.758 56.144 122.062 56.144C121.206 56.144 120.514 55.852 119.986 55.268C119.45 54.684 119.182 53.896 119.182 52.904C119.182 51.928 119.446 51.144 119.974 50.552C120.494 49.96 121.182 49.664 122.038 49.664C122.926 49.664 123.622 49.972 124.126 50.588C124.63 51.204 124.882 51.976 124.882 52.904ZM122.038 50.54C121.534 50.54 121.122 50.7 120.802 51.02C120.482 51.332 120.282 51.784 120.202 52.376H123.85C123.802 51.832 123.618 51.392 123.298 51.056C122.978 50.712 122.558 50.54 122.038 50.54ZM128.872 52.556L129.892 49.808H130.924L128.488 56H127.48L125.056 49.808H126.1L127.12 52.568C127.624 53.92 127.916 54.72 127.996 54.968C128.14 54.544 128.432 53.74 128.872 52.556ZM136.741 52.904V53.24H132.037C132.085 53.912 132.273 54.42 132.601 54.764C132.929 55.1 133.377 55.268 133.945 55.268C134.801 55.268 135.349 54.884 135.589 54.116H136.585C136.417 54.74 136.105 55.236 135.649 55.604C135.193 55.964 134.617 56.144 133.921 56.144C133.065 56.144 132.373 55.852 131.845 55.268C131.309 54.684 131.041 53.896 131.041 52.904C131.041 51.928 131.305 51.144 131.833 50.552C132.353 49.96 133.041 49.664 133.897 49.664C134.785 49.664 135.481 49.972 135.985 50.588C136.489 51.204 136.741 51.976 136.741 52.904ZM133.897 50.54C133.393 50.54 132.981 50.7 132.661 51.02C132.341 51.332 132.141 51.784 132.061 52.376H135.709C135.661 51.832 135.477 51.392 135.157 51.056C134.837 50.712 134.417 50.54 133.897 50.54ZM138.84 56H137.88V47.456H138.84V56ZM145.143 55.256C144.575 55.848 143.855 56.144 142.983 56.144C142.111 56.144 141.391 55.848 140.823 55.256C140.263 54.672 139.983 53.888 139.983 52.904C139.983 51.92 140.263 51.136 140.823 50.552C141.391 49.96 142.111 49.664 142.983 49.664C143.855 49.664 144.575 49.96 145.143 50.552C145.703 51.136 145.983 51.92 145.983 52.904C145.983 53.888 145.703 54.672 145.143 55.256ZM141.531 54.644C141.891 55.068 142.375 55.28 142.983 55.28C143.591 55.28 144.075 55.068 144.435 54.644C144.795 54.228 144.975 53.648 144.975 52.904C144.975 52.152 144.795 51.568 144.435 51.152C144.075 50.736 143.591 50.528 142.983 50.528C142.375 50.528 141.891 50.736 141.531 51.152C141.171 51.568 140.991 52.152 140.991 52.904C140.991 53.648 141.171 54.228 141.531 54.644ZM150.162 49.664C151.034 49.664 151.734 49.956 152.262 50.54C152.782 51.132 153.042 51.92 153.042 52.904C153.042 53.88 152.782 54.664 152.262 55.256C151.734 55.848 151.034 56.144 150.162 56.144C149.274 56.144 148.582 55.8 148.086 55.112V58.352H147.126V49.808H148.038V50.768C148.534 50.032 149.242 49.664 150.162 49.664ZM150.042 55.28C150.642 55.28 151.122 55.064 151.482 54.632C151.85 54.192 152.034 53.6 152.034 52.856C152.034 52.128 151.854 51.56 151.494 51.152C151.142 50.736 150.658 50.528 150.042 50.528C149.434 50.528 148.95 50.736 148.59 51.152C148.23 51.568 148.05 52.152 148.05 52.904C148.05 53.648 148.23 54.228 148.59 54.644C148.95 55.068 149.434 55.28 150.042 55.28ZM160.697 49.664C161.369 49.664 161.889 49.86 162.257 50.252C162.633 50.636 162.821 51.152 162.821 51.8V56H161.861V51.896C161.861 50.984 161.429 50.528 160.565 50.528C160.109 50.528 159.729 50.712 159.425 51.08C159.129 51.44 158.981 51.952 158.981 52.616V56H158.021V51.896C158.021 50.984 157.589 50.528 156.725 50.528C156.277 50.528 155.901 50.712 155.597 51.08C155.293 51.44 155.141 51.952 155.141 52.616V56H154.181V49.808H155.093V50.72C155.501 50.016 156.097 49.664 156.881 49.664C157.809 49.664 158.445 50.052 158.789 50.828C159.221 50.052 159.857 49.664 160.697 49.664ZM169.659 52.904V53.24H164.955C165.003 53.912 165.191 54.42 165.519 54.764C165.847 55.1 166.295 55.268 166.863 55.268C167.719 55.268 168.267 54.884 168.507 54.116H169.503C169.335 54.74 169.023 55.236 168.567 55.604C168.111 55.964 167.535 56.144 166.839 56.144C165.983 56.144 165.291 55.852 164.763 55.268C164.227 54.684 163.959 53.896 163.959 52.904C163.959 51.928 164.223 51.144 164.751 50.552C165.271 49.96 165.959 49.664 166.815 49.664C167.703 49.664 168.399 49.972 168.903 50.588C169.407 51.204 169.659 51.976 169.659 52.904ZM166.815 50.54C166.311 50.54 165.899 50.7 165.579 51.02C165.259 51.332 165.059 51.784 164.979 52.376H168.627C168.579 51.832 168.395 51.392 168.075 51.056C167.755 50.712 167.335 50.54 166.815 50.54ZM173.654 49.664C174.342 49.664 174.878 49.852 175.262 50.228C175.646 50.604 175.838 51.132 175.838 51.812V56H174.878V51.908C174.878 50.988 174.406 50.528 173.462 50.528C173.014 50.528 172.618 50.696 172.274 51.032C171.93 51.368 171.758 51.856 171.758 52.496V56H170.798V49.808H171.71V50.732C172.182 50.02 172.83 49.664 173.654 49.664ZM179.756 49.808V50.648H178.484V54.668C178.484 55.02 178.72 55.196 179.192 55.196H179.756V56C179.492 56.024 179.264 56.036 179.072 56.036C178.04 56.036 177.524 55.608 177.524 54.752V50.648H176.504V49.808H177.524V48.056H178.484V49.808H179.756Z" fill="white"/>
<path d="M90.008 27.092V34.848C90.008 36.6587 89.4947 37.9747 88.468 38.796C87.46 39.5987 85.7613 40 83.372 40H76.96C76.7733 40 76.68 39.9067 76.68 39.72V22.22C76.68 22.0333 76.7733 21.94 76.96 21.94H83.372C85.7613 21.94 87.46 22.3507 88.468 23.172C89.4947 23.9747 90.008 25.2813 90.008 27.092ZM86.368 34.848V27.092C86.368 26.3453 86.1627 25.8507 85.752 25.608C85.3413 25.3653 84.4547 25.244 83.092 25.244H80.32V36.696H83.092C84.4547 36.696 85.3413 36.5747 85.752 36.332C86.1627 36.0893 86.368 35.5947 86.368 34.848ZM107.516 36.976V39.72C107.516 39.9067 107.423 40 107.236 40H96.0361C95.8494 40 95.7561 39.9067 95.7561 39.72V37.508C95.7561 37.3773 95.7841 37.256 95.8401 37.144L101.16 28.044C101.925 26.7187 102.523 25.7853 102.952 25.244H96.3721C96.1854 25.244 96.0921 25.1507 96.0921 24.964V22.22C96.0921 22.0333 96.1854 21.94 96.3721 21.94H106.9C107.087 21.94 107.18 22.0333 107.18 22.22V24.432C107.18 24.5627 107.152 24.684 107.096 24.796L101.776 33.896C101.011 35.2213 100.413 36.1547 99.9841 36.696H107.236C107.423 36.696 107.516 36.7893 107.516 36.976ZM125.379 25.244H117.595V29.22H124.539C124.726 29.22 124.819 29.3133 124.819 29.5V32.244C124.819 32.4307 124.726 32.524 124.539 32.524H117.595V36.696H125.379C125.566 36.696 125.659 36.7893 125.659 36.976V39.72C125.659 39.9067 125.566 40 125.379 40H114.235C114.048 40 113.955 39.9067 113.955 39.72V22.22C113.955 22.0333 114.048 21.94 114.235 21.94H125.379C125.566 21.94 125.659 22.0333 125.659 22.22V24.964C125.659 25.1507 125.566 25.244 125.379 25.244ZM143.958 22.22V24.964C143.958 25.1507 143.865 25.244 143.678 25.244H139.422V39.72C139.422 39.9067 139.329 40 139.142 40H136.062C135.875 40 135.782 39.9067 135.782 39.72V25.244H131.526C131.339 25.244 131.246 25.1507 131.246 24.964V22.22C131.246 22.0333 131.339 21.94 131.526 21.94H143.678C143.865 21.94 143.958 22.0333 143.958 22.22ZM161.679 39.692L161.707 39.804C161.707 39.9347 161.623 40 161.455 40H158.235C158.067 40 157.955 39.9253 157.899 39.776L156.807 36.5H150.983L149.891 39.776C149.835 39.9253 149.723 40 149.555 40H146.335C146.129 40 146.055 39.8973 146.111 39.692L152.159 22.164C152.215 22.0147 152.327 21.94 152.495 21.94H155.295C155.463 21.94 155.575 22.0147 155.631 22.164L161.679 39.692ZM152.075 33.252H155.715L154.987 31.04C154.483 29.4907 154.119 28.1933 153.895 27.148C153.671 28.1933 153.307 29.4907 152.803 31.04L152.075 33.252Z" fill="white"/>
<defs>
<clipPath id="clip0_290_2030">
<rect width="64" height="56" fill="white"/>
</clipPath>
</defs>
</svg>
