<svg width="712" height="712" viewBox="0 0 712 712" fill="none" xmlns="http://www.w3.org/2000/svg">
<circle cx="356" cy="356" r="354.42" stroke="white" stroke-width="1.5" stroke-dasharray="4 10"/>
</svg>
