<svg width="15" height="15" viewBox="0 0 15 15" fill="none" xmlns="http://www.w3.org/2000/svg">
<path d="M13.5937 1.87494H1.40626C0.6308 1.87494 0 2.50574 0 3.2812V11.7187C0 12.4942 0.6308 13.125 1.40626 13.125H13.5937C14.3692 13.125 15 12.4942 15 11.7187V3.2812C15 2.50574 14.3692 1.87494 13.5937 1.87494ZM13.5937 2.81243C13.6574 2.81243 13.718 2.82565 13.7734 2.84872L7.5 8.28592L1.22656 2.84872C1.28195 2.82568 1.34254 2.81243 1.40623 2.81243H13.5937ZM13.5937 12.1874H1.40626C1.14763 12.1874 0.937496 11.9773 0.937496 11.7187V3.8392L7.19283 9.26049C7.2812 9.33692 7.3906 9.37494 7.5 9.37494C7.6094 9.37494 7.7188 9.33696 7.80717 9.26049L14.0625 3.8392V11.7187C14.0625 11.9773 13.8524 12.1874 13.5937 12.1874Z" fill="#111010"/>
</svg>
