<svg width="255" height="6" viewBox="0 0 255 6" fill="none" xmlns="http://www.w3.org/2000/svg">
<rect opacity="0.05" x="254.717" y="0.0137024" width="5.49315" height="4.11986" rx="0.549315" transform="rotate(90 254.717 0.0137024)" fill="white"/>
<rect opacity="0.05" x="245.104" y="0.0137024" width="5.49315" height="4.11986" rx="0.549315" transform="rotate(90 245.104 0.0137024)" fill="white"/>
<rect opacity="0.05" x="235.49" y="0.0137024" width="5.49315" height="4.11986" rx="0.549315" transform="rotate(90 235.49 0.0137024)" fill="white"/>
<rect opacity="0.05" x="225.877" y="0.0137024" width="5.49315" height="4.11986" rx="0.549315" transform="rotate(90 225.877 0.0137024)" fill="white"/>
<rect opacity="0.05" x="216.266" y="0.0137024" width="5.49315" height="4.11986" rx="0.549315" transform="rotate(90 216.266 0.0137024)" fill="white"/>
<rect opacity="0.05" x="206.652" y="0.0137024" width="5.49315" height="4.11986" rx="0.549315" transform="rotate(90 206.652 0.0137024)" fill="white"/>
<rect opacity="0.05" x="197.039" y="0.0137024" width="5.49315" height="4.11986" rx="0.549315" transform="rotate(90 197.039 0.0137024)" fill="white"/>
<rect opacity="0.05" x="187.426" y="0.0137024" width="5.49315" height="4.11986" rx="0.549315" transform="rotate(90 187.426 0.0137024)" fill="white"/>
<rect opacity="0.05" x="177.812" y="0.0137024" width="5.49315" height="4.11986" rx="0.549315" transform="rotate(90 177.812 0.0137024)" fill="white"/>
<rect opacity="0.05" x="168.199" y="0.0137024" width="5.49315" height="4.11986" rx="0.549315" transform="rotate(90 168.199 0.0137024)" fill="white"/>
<rect opacity="0.05" x="158.586" y="0.0137024" width="5.49315" height="4.11986" rx="0.549315" transform="rotate(90 158.586 0.0137024)" fill="white"/>
<rect opacity="0.05" x="148.975" y="0.0137024" width="5.49315" height="4.11986" rx="0.549315" transform="rotate(90 148.975 0.0137024)" fill="white"/>
<rect opacity="0.05" x="139.361" y="0.0137024" width="5.49315" height="4.11986" rx="0.549315" transform="rotate(90 139.361 0.0137024)" fill="white"/>
<rect opacity="0.05" x="129.748" y="0.0137024" width="5.49315" height="4.11986" rx="0.549315" transform="rotate(90 129.748 0.0137024)" fill="white"/>
<rect opacity="0.05" x="120.135" y="0.0137024" width="5.49315" height="4.11986" rx="0.549315" transform="rotate(90 120.135 0.0137024)" fill="white"/>
<rect opacity="0.05" x="110.521" y="0.0137024" width="5.49315" height="4.11986" rx="0.549315" transform="rotate(90 110.521 0.0137024)" fill="white"/>
<rect opacity="0.05" x="100.908" y="0.0137024" width="5.49315" height="4.11986" rx="0.549315" transform="rotate(90 100.908 0.0137024)" fill="white"/>
<rect opacity="0.05" x="91.2949" y="0.0137024" width="5.49315" height="4.11986" rx="0.549315" transform="rotate(90 91.2949 0.0137024)" fill="white"/>
<rect opacity="0.05" x="81.6816" y="0.0137024" width="5.49315" height="4.11986" rx="0.549315" transform="rotate(90 81.6816 0.0137024)" fill="white"/>
<rect opacity="0.05" x="72.0703" y="0.0137024" width="5.49315" height="4.11986" rx="0.549315" transform="rotate(90 72.0703 0.0137024)" fill="white"/>
<rect opacity="0.05" x="62.457" y="0.0137024" width="5.49315" height="4.11986" rx="0.549315" transform="rotate(90 62.457 0.0137024)" fill="white"/>
<rect opacity="0.05" x="52.8438" y="0.0137024" width="5.49315" height="4.11986" rx="0.549315" transform="rotate(90 52.8438 0.0137024)" fill="white"/>
<rect opacity="0.05" x="43.2305" y="0.0137024" width="5.49315" height="4.11986" rx="0.549315" transform="rotate(90 43.2305 0.0137024)" fill="white"/>
<rect opacity="0.05" x="33.6172" y="0.0137024" width="5.49315" height="4.11986" rx="0.549315" transform="rotate(90 33.6172 0.0137024)" fill="white"/>
<rect opacity="0.05" x="24.0039" y="0.0137024" width="5.49315" height="4.11986" rx="0.549315" transform="rotate(90 24.0039 0.0137024)" fill="white"/>
<rect opacity="0.05" x="14.3906" y="0.0137024" width="5.49315" height="4.11986" rx="0.549315" transform="rotate(90 14.3906 0.0137024)" fill="white"/>
<rect opacity="0.05" x="4.7793" y="0.0137024" width="5.49315" height="4.11986" rx="0.549315" transform="rotate(90 4.7793 0.0137024)" fill="white"/>
</svg>
