<svg width="36" height="36" viewBox="0 0 36 36" fill="none" xmlns="http://www.w3.org/2000/svg">
<path d="M18.3038 32.6505C19.0394 32.6519 19.7681 32.5079 20.4479 32.2268C21.1278 31.9457 21.7454 31.533 22.2652 31.0125L28.511 24.7667L28.511 24.7667L28.5121 24.7656C29.5443 23.7112 30.1189 22.2922 30.111 20.8167C30.1032 19.3412 29.5136 17.9283 28.4702 16.8849C27.4269 15.8416 26.014 15.252 24.5385 15.2441C23.063 15.2363 21.6439 15.8109 20.5896 16.8431L20.4812 16.9491L20.5884 17.0563L22.053 18.5209L22.1591 18.627L22.2652 18.5209C22.8711 17.915 23.6928 17.5747 24.5497 17.5747C25.4066 17.5747 26.2283 17.915 26.8342 18.5209C27.4401 19.1268 27.7805 19.9486 27.7805 20.8055C27.7805 21.6623 27.4401 22.4841 26.8342 23.09L20.5884 29.3358C20.2884 29.6358 19.9323 29.8738 19.5403 30.0362C19.1483 30.1985 18.7282 30.2821 18.3039 30.2821C17.8796 30.2821 17.4595 30.1985 17.0675 30.0362C16.6755 29.8738 16.3194 29.6358 16.0194 29.3358C15.7193 29.0358 15.4814 28.6796 15.319 28.2876C15.1566 27.8957 15.0731 27.4755 15.0731 27.0513C15.0731 26.627 15.1566 26.2069 15.319 25.8149C15.4814 25.4229 15.7193 25.0667 16.0194 24.7667L16.1255 24.6606L16.0193 24.5546L14.5537 23.09L14.4477 22.984L14.3416 23.0899C13.5577 23.8731 13.0237 24.8713 12.8074 25.958C12.591 27.0448 12.702 28.1714 13.1263 29.1951C13.5505 30.2187 14.269 31.0935 15.1907 31.7086C16.1124 32.3237 17.1958 32.6515 18.3038 32.6505ZM18.3038 32.6505C18.3037 32.6505 18.3037 32.6505 18.3036 32.6505L18.3039 32.5005L18.304 32.6505C18.304 32.6505 18.3039 32.6505 18.3038 32.6505Z" fill="#348FE2" stroke="#348FE2" stroke-width="0.3"/>
<path d="M6.44779 34.2057C7.32737 34.7932 8.35444 35.119 9.40975 35.147V35.1497L9.55948 35.15C10.2953 35.1513 11.024 35.0072 11.7039 34.7259C12.3838 34.4446 13.0014 34.0316 13.5211 33.5108L13.627 33.4048L13.521 33.2988L12.0564 31.8342L11.9503 31.7281L11.8443 31.8342C11.2384 32.4401 10.4166 32.7805 9.55975 32.7805C8.70289 32.7805 7.88111 32.4401 7.27522 31.8342C6.66932 31.2283 6.32893 30.4065 6.32893 29.5497C6.32893 28.6928 6.66932 27.871 7.27522 27.2651L13.521 21.0193L13.521 21.0194L13.5226 21.0178C13.8209 20.7105 14.1773 20.4657 14.5711 20.2974C14.965 20.1291 15.3883 20.0409 15.8165 20.0377C16.2448 20.0345 16.6694 20.1165 17.0656 20.2789C17.4619 20.4413 17.8219 20.6809 18.1248 20.9836C18.4276 21.2864 18.6673 21.6464 18.8297 22.0426C18.9922 22.4389 19.0743 22.8634 19.0712 23.2917C19.0681 23.7199 18.9799 24.1433 18.8118 24.5371C18.6436 24.931 18.3988 25.2875 18.0916 25.5858L17.9825 25.6919L18.0901 25.7995L19.5547 27.2641L19.6591 27.3685L19.7652 27.2658C20.2988 26.7486 20.7242 26.1304 21.0166 25.4472C21.309 24.764 21.4626 24.0295 21.4684 23.2864C21.4742 22.5433 21.3321 21.8065 21.0503 21.1188C20.7686 20.4312 20.3529 19.8064 19.8274 19.281C19.3019 18.7555 18.6771 18.3399 17.9894 18.0583C17.3017 17.7766 16.5649 17.6346 15.8217 17.6405C15.0786 17.6464 14.3441 17.8001 13.661 18.0926C12.9782 18.3849 12.3604 18.8101 11.8435 19.3434C11.8432 19.3437 11.8429 19.344 11.8426 19.3443L5.59849 25.5884C4.81512 26.3717 4.28165 27.3697 4.06556 28.4562C3.84947 29.5427 3.96046 30.6689 4.3845 31.6923C4.80855 32.7158 5.52658 33.5904 6.44779 34.2057ZM1 14.1363H0.85V14.2863V16.3579V16.5079H1H9.2863H9.4363V16.3579V14.2863V14.1363H9.2863H1ZM1 9.99315H0.85V10.1432V12.2147V12.3647H1H13.4295H13.5795V12.2147V10.1432V9.99315H13.4295H1ZM1 5.85H0.85V6V8.07158V8.22158H1H13.4295H13.5795V8.07158V6V5.85H13.4295H1Z" fill="#348FE2" stroke="#348FE2" stroke-width="0.3"/>
<path d="M36 10C36 4.47715 31.5228 0 26 0C20.4772 0 16 4.47715 16 10C16 14.9913 19.6569 19.1283 24.4375 19.8785V12.8906H21.8984V10H24.4375V7.79688C24.4375 5.29062 25.9304 3.90625 28.2146 3.90625C29.3087 3.90625 30.4531 4.10156 30.4531 4.10156V6.5625H29.1921C27.9499 6.5625 27.5625 7.33333 27.5625 8.12417V10H30.3359L29.8926 12.8906H27.5625V19.8785C32.3431 19.1283 36 14.9913 36 10Z" fill="#1877F2"/>
<path d="M29.8926 12.8906L30.3359 10H27.5625V8.12417C27.5625 7.33333 27.9499 6.5625 29.1921 6.5625H30.4531V4.10156C30.4531 4.10156 29.3087 3.90625 28.2146 3.90625C25.9304 3.90625 24.4375 5.29062 24.4375 7.79688V10H21.8984V12.8906H24.4375V19.8785C25.4729 20.0405 26.5271 20.0405 27.5625 19.8785V12.8906H29.8926Z" fill="white"/>
</svg>
