<svg width="36" height="36" viewBox="0 0 36 36" fill="none" xmlns="http://www.w3.org/2000/svg">
<path fill-rule="evenodd" clip-rule="evenodd" d="M4.5 28.125C4.5 27.8266 4.61853 27.5405 4.82951 27.3295C5.04048 27.1185 5.32663 27 5.625 27H21.375C21.6734 27 21.9595 27.1185 22.1705 27.3295C22.3815 27.5405 22.5 27.8266 22.5 28.125C22.5 28.4234 22.3815 28.7095 22.1705 28.9205C21.9595 29.1315 21.6734 29.25 21.375 29.25H5.625C5.32663 29.25 5.04048 29.1315 4.82951 28.9205C4.61853 28.7095 4.5 28.4234 4.5 28.125ZM4.5 21.375C4.5 21.0766 4.61853 20.7905 4.82951 20.5795C5.04048 20.3685 5.32663 20.25 5.625 20.25H30.375C30.6734 20.25 30.9595 20.3685 31.1705 20.5795C31.3815 20.7905 31.5 21.0766 31.5 21.375C31.5 21.6734 31.3815 21.9595 31.1705 22.1705C30.9595 22.3815 30.6734 22.5 30.375 22.5H5.625C5.32663 22.5 5.04048 22.3815 4.82951 22.1705C4.61853 21.9595 4.5 21.6734 4.5 21.375ZM4.5 14.625C4.5 14.3266 4.61853 14.0405 4.82951 13.8295C5.04048 13.6185 5.32663 13.5 5.625 13.5H30.375C30.6734 13.5 30.9595 13.6185 31.1705 13.8295C31.3815 14.0405 31.5 14.3266 31.5 14.625C31.5 14.9234 31.3815 15.2095 31.1705 15.4205C30.9595 15.6315 30.6734 15.75 30.375 15.75H5.625C5.32663 15.75 5.04048 15.6315 4.82951 15.4205C4.61853 15.2095 4.5 14.9234 4.5 14.625ZM13.5 7.875C13.5 7.57663 13.6185 7.29048 13.8295 7.07951C14.0405 6.86853 14.3266 6.75 14.625 6.75H30.375C30.6734 6.75 30.9595 6.86853 31.1705 7.07951C31.3815 7.29048 31.5 7.57663 31.5 7.875C31.5 8.17337 31.3815 8.45952 31.1705 8.67049C30.9595 8.88147 30.6734 9 30.375 9H14.625C14.3266 9 14.0405 8.88147 13.8295 8.67049C13.6185 8.45952 13.5 8.17337 13.5 7.875Z" fill="#348FE2"/>
</svg>
