<svg width="50" height="50" viewBox="0 0 50 50" fill="none" xmlns="http://www.w3.org/2000/svg">
<path fill-rule="evenodd" clip-rule="evenodd" d="M25 0C38.8076 0 50 11.1924 50 25C50 38.8076 38.8076 50 25 50C11.1924 50 0 38.8076 0 25C0 11.1924 11.1924 0 25 0Z" fill="url(#paint0_linear_193_253)"/>
<path fill-rule="evenodd" clip-rule="evenodd" d="M30.6144 10.3525C30.6153 10.7998 30.7472 17.2695 37.5353 17.6729C37.5353 19.5381 37.5372 20.8906 37.5372 22.6709C37.0236 22.7002 33.0685 22.4131 30.6066 20.2178L30.5987 29.9482C30.6925 36.7021 25.7228 40.8115 19.2257 39.3916C8.02355 36.041 11.7462 19.4268 22.9943 21.2041C22.9943 26.5684 22.9972 21.2031 22.9972 26.5684C18.3507 25.8848 16.796 29.75 18.0314 32.5186C19.1544 35.0381 23.7814 35.584 25.3956 32.0293C25.5782 31.334 25.6691 30.54 25.6691 29.6494V10.3281L30.6144 10.3525Z" fill="white"/>
<defs>
<linearGradient id="paint0_linear_193_253" x1="6.62402" y1="8.04883" x2="46.3076" y2="38.084" gradientUnits="userSpaceOnUse">
<stop stop-color="#67C4CE"/>
<stop offset="1" stop-color="#E62A58"/>
</linearGradient>
</defs>
</svg>
