<svg width="50" height="50" viewBox="0 0 50 50" fill="none" xmlns="http://www.w3.org/2000/svg">
<circle cx="25" cy="25" r="25" fill="#54BD95"/>
<path d="M14.1217 18.6015L14.4027 18.3168L14.1217 18.6015C14.455 18.9304 14.9059 19.1143 15.375 19.1143H34.625C35.0941 19.1143 35.545 18.9304 35.8783 18.6015C36.2117 18.2724 36.4 17.8249 36.4 17.3571C36.4 16.8894 36.2117 16.4419 35.8783 16.1128C35.545 15.7839 35.0941 15.6 34.625 15.6H15.375C14.9059 15.6 14.455 15.7839 14.1217 16.1128C13.7883 16.4419 13.6 16.8894 13.6 17.3571C13.6 17.8249 13.7883 18.2724 14.1217 18.6015ZM14.1217 32.3985C13.7883 32.7276 13.6 33.1751 13.6 33.6429C13.6 34.1106 13.7883 34.5581 14.1217 34.8872C14.455 35.2161 14.9059 35.4 15.375 35.4H34.625C35.0941 35.4 35.545 35.2161 35.8783 34.8872C36.2117 34.5581 36.4 34.1106 36.4 33.6429C36.4 33.1751 36.2117 32.7276 35.8783 32.3985C35.545 32.0696 35.0941 31.8857 34.625 31.8857H15.375C14.9059 31.8857 14.455 32.0696 14.1217 32.3985ZM23.625 23.7429C23.1559 23.7429 22.705 23.9267 22.3717 24.2557C22.0383 24.5848 21.85 25.0323 21.85 25.5C21.85 25.9677 22.0383 26.4152 22.3717 26.7443C22.705 27.0733 23.1559 27.2571 23.625 27.2571H34.625C35.0941 27.2571 35.545 27.0733 35.8783 26.7443C36.2117 26.4152 36.4 25.9677 36.4 25.5C36.4 25.0323 36.2117 24.5848 35.8783 24.2557C35.545 23.9267 35.0941 23.7429 34.625 23.7429H23.625Z" fill="white" stroke="white" stroke-width="0.8"/>
</svg>
