<svg width="50" height="50" viewBox="0 0 50 50" fill="none" xmlns="http://www.w3.org/2000/svg">
<g clip-path="url(#clip0_193_262)">
<path d="M10.7422 101.172C40.4059 101.172 64.4531 77.1247 64.4531 47.4609C64.4531 17.7972 40.4059 -6.25 10.7422 -6.25C-18.9215 -6.25 -42.9688 17.7972 -42.9688 47.4609C-42.9688 77.1247 -18.9215 101.172 10.7422 101.172Z" fill="url(#paint0_radial_193_262)"/>
<path d="M10.7422 41.7969C42.779 41.7969 68.75 15.8259 68.75 -16.2109C68.75 -48.2478 42.779 -74.2188 10.7422 -74.2188C-21.2946 -74.2188 -47.2656 -48.2478 -47.2656 -16.2109C-47.2656 15.8259 -21.2946 41.7969 10.7422 41.7969Z" fill="url(#paint1_radial_193_262)"/>
<path d="M5.41797 191.02C45.4651 191.02 77.9297 158.555 77.9297 118.508C77.9297 78.4607 45.4651 45.9961 5.41797 45.9961C-34.6291 45.9961 -67.0938 78.4607 -67.0938 118.508C-67.0938 158.555 -34.6291 191.02 5.41797 191.02Z" fill="url(#paint2_radial_193_262)"/>
<path d="M10.7422 41.7969C42.779 41.7969 68.75 15.8259 68.75 -16.2109C68.75 -48.2478 42.779 -74.2188 10.7422 -74.2188C-21.2946 -74.2188 -47.2656 -48.2478 -47.2656 -16.2109C-47.2656 15.8259 -21.2946 41.7969 10.7422 41.7969Z" fill="url(#paint3_radial_193_262)"/>
<path d="M10.7422 41.7969C42.779 41.7969 68.75 15.8259 68.75 -16.2109C68.75 -48.2478 42.779 -74.2188 10.7422 -74.2188C-21.2946 -74.2188 -47.2656 -48.2478 -47.2656 -16.2109C-47.2656 15.8259 -21.2946 41.7969 10.7422 41.7969Z" fill="url(#paint4_radial_193_262)"/>
<path d="M5.41797 63.6758C45.4651 63.6758 77.9297 31.2112 77.9297 -8.83593C77.9297 -48.883 45.4651 -81.3477 5.41797 -81.3477C-34.6291 -81.3477 -67.0938 -48.883 -67.0938 -8.83593C-67.0938 31.2112 -34.6291 63.6758 5.41797 63.6758Z" fill="url(#paint5_radial_193_262)"/>
<path d="M32.0312 19.9219C33.1099 19.9219 33.9844 19.0474 33.9844 17.9688C33.9844 16.8901 33.1099 16.0156 32.0312 16.0156C30.9526 16.0156 30.0781 16.8901 30.0781 17.9688C30.0781 19.0474 30.9526 19.9219 32.0312 19.9219Z" fill="white"/>
<path d="M25 18.75C23.7639 18.75 22.5555 19.1166 21.5277 19.8033C20.4999 20.4901 19.6988 21.4662 19.2258 22.6082C18.7527 23.7503 18.6289 25.0069 18.8701 26.2193C19.1113 27.4317 19.7065 28.5453 20.5806 29.4194C21.4547 30.2935 22.5683 30.8888 23.7807 31.1299C24.9931 31.3711 26.2497 31.2473 27.3918 30.7742C28.5338 30.3012 29.5099 29.5001 30.1967 28.4723C30.8834 27.4445 31.25 26.2361 31.25 25C31.25 23.3424 30.5915 21.7527 29.4194 20.5806C28.2473 19.4085 26.6576 18.75 25 18.75ZM25 28.125C24.3819 28.125 23.7778 27.9417 23.2638 27.5983C22.7499 27.255 22.3494 26.7669 22.1129 26.1959C21.8764 25.6249 21.8145 24.9965 21.935 24.3903C22.0556 23.7842 22.3533 23.2273 22.7903 22.7903C23.2273 22.3533 23.7842 22.0556 24.3903 21.935C24.9965 21.8145 25.6249 21.8764 26.1959 22.1129C26.7669 22.3494 27.255 22.7499 27.5983 23.2638C27.9417 23.7777 28.125 24.3819 28.125 25C28.125 25.8288 27.7958 26.6237 27.2097 27.2097C26.6237 27.7958 25.8288 28.125 25 28.125Z" fill="white"/>
<path d="M32.8125 12.5H17.1875C14.5987 12.5 12.5 14.5987 12.5 17.1875V32.8125C12.5 35.4013 14.5987 37.5 17.1875 37.5H32.8125C35.4013 37.5 37.5 35.4013 37.5 32.8125V17.1875C37.5 14.5987 35.4013 12.5 32.8125 12.5Z" stroke="white" stroke-width="3" stroke-miterlimit="10"/>
</g>
<defs>
<radialGradient id="paint0_radial_193_262" cx="0" cy="0" r="1" gradientUnits="userSpaceOnUse" gradientTransform="translate(10.7422 47.4609) scale(53.7109)">
<stop stop-color="#FFD676"/>
<stop offset="0.25" stop-color="#F2A454"/>
<stop offset="0.38" stop-color="#F05C3C"/>
<stop offset="0.7" stop-color="#C22F86"/>
<stop offset="0.96" stop-color="#6666AD"/>
<stop offset="0.99" stop-color="#5C6CB2"/>
</radialGradient>
<radialGradient id="paint1_radial_193_262" cx="0" cy="0" r="1" gradientUnits="userSpaceOnUse" gradientTransform="translate(10.7422 -16.2109) scale(58.0078)">
<stop stop-color="#FFD676"/>
<stop offset="0.25" stop-color="#F2A454"/>
<stop offset="0.38" stop-color="#F05C3C"/>
<stop offset="0.7" stop-color="#C22F86"/>
<stop offset="0.96" stop-color="#6666AD"/>
<stop offset="0.99" stop-color="#5C6CB2"/>
</radialGradient>
<radialGradient id="paint2_radial_193_262" cx="0" cy="0" r="1" gradientUnits="userSpaceOnUse" gradientTransform="translate(5.41798 118.508) scale(72.5117)">
<stop stop-color="#FFD676"/>
<stop offset="0.25" stop-color="#F2A454"/>
<stop offset="0.38" stop-color="#F05C3C"/>
<stop offset="0.7" stop-color="#C22F86"/>
<stop offset="0.96" stop-color="#6666AD"/>
<stop offset="0.99" stop-color="#5C6CB2"/>
</radialGradient>
<radialGradient id="paint3_radial_193_262" cx="0" cy="0" r="1" gradientUnits="userSpaceOnUse" gradientTransform="translate(10.7422 -16.2109) scale(58.0078)">
<stop stop-color="#FFD676"/>
<stop offset="0.25" stop-color="#F2A454"/>
<stop offset="0.38" stop-color="#F05C3C"/>
<stop offset="0.7" stop-color="#C22F86"/>
<stop offset="0.96" stop-color="#6666AD"/>
<stop offset="0.99" stop-color="#5C6CB2"/>
</radialGradient>
<radialGradient id="paint4_radial_193_262" cx="0" cy="0" r="1" gradientUnits="userSpaceOnUse" gradientTransform="translate(10.7422 -16.2109) scale(58.0078)">
<stop stop-color="#FFD676"/>
<stop offset="0.25" stop-color="#F2A454"/>
<stop offset="0.38" stop-color="#F05C3C"/>
<stop offset="0.7" stop-color="#C22F86"/>
<stop offset="0.96" stop-color="#6666AD"/>
<stop offset="0.99" stop-color="#5C6CB2"/>
</radialGradient>
<radialGradient id="paint5_radial_193_262" cx="0" cy="0" r="1" gradientUnits="userSpaceOnUse" gradientTransform="translate(5.41798 -8.83593) scale(72.5117)">
<stop stop-color="#FFD676"/>
<stop offset="0.25" stop-color="#F2A454"/>
<stop offset="0.38" stop-color="#F05C3C"/>
<stop offset="0.7" stop-color="#C22F86"/>
<stop offset="0.96" stop-color="#6666AD"/>
<stop offset="0.99" stop-color="#5C6CB2"/>
</radialGradient>
<clipPath id="clip0_193_262">
<rect width="50" height="50" rx="25" fill="white"/>
</clipPath>
</defs>
</svg>
