<svg width="1920" height="1251" viewBox="0 0 1920 1251" fill="none" xmlns="http://www.w3.org/2000/svg">
<ellipse opacity="0.3" cx="1295" cy="708" rx="242" ry="147" fill="#0B00D0"/>
<ellipse cx="1228.5" cy="530" rx="174.5" ry="194" fill="#8754DE"/>
<ellipse opacity="0.4" cx="1236.5" cy="785.5" rx="196.5" ry="147.5" fill="#348FE2"/>
<g filter="url(#filter0_b_63_85)">
<rect x="-53" width="2155" height="1251" fill="white" fill-opacity="0.01"/>
</g>
<defs>
<filter id="filter0_b_63_85" x="-221" y="-168" width="2491" height="1587" filterUnits="userSpaceOnUse" color-interpolation-filters="sRGB">
<feFlood flood-opacity="0" result="BackgroundImageFix"/>
<feGaussianBlur in="BackgroundImage" stdDeviation="84"/>
<feComposite in2="SourceAlpha" operator="in" result="effect1_backgroundBlur_63_85"/>
<feBlend mode="normal" in="SourceGraphic" in2="effect1_backgroundBlur_63_85" result="shape"/>
</filter>
</defs>
</svg>
