<svg width="13" height="23" viewBox="0 0 13 23" fill="none" xmlns="http://www.w3.org/2000/svg">
<g clip-path="url(#clip0_142_645)">
<path d="M6.48186 0.285156C3.26086 0.285156 0.64978 2.92501 0.64978 6.18132C0.64978 9.43772 3.26086 12.0777 6.48186 12.0777C9.70287 12.0777 12.3139 9.43772 12.3139 6.18132C12.3139 2.92501 9.70287 0.285156 6.48186 0.285156ZM6.48186 8.61884C5.15041 8.61884 4.07101 7.52749 4.07101 6.18141C4.07101 4.83533 5.15041 3.74406 6.48186 3.74406C7.81331 3.74406 8.89272 4.83533 8.89272 6.18141C8.89272 7.52749 7.81331 8.61884 6.48186 8.61884Z" fill="#15B5CB"/>
<path d="M8.54087 16.7696C10.8757 16.2887 12.2748 15.1709 12.3489 15.1109C13.0321 14.5569 13.1418 13.5479 12.5939 12.8571C12.0461 12.1664 11.0481 12.0554 10.3647 12.6093C10.3503 12.6211 8.85802 13.7784 6.40268 13.7801C3.94743 13.7784 2.4236 12.6211 2.40916 12.6093C1.72579 12.0554 0.727844 12.1664 0.180007 12.8571C-0.367914 13.5479 -0.258163 14.5569 0.425048 15.1109C0.50008 15.1717 1.95697 16.3187 4.35722 16.7882L1.01203 20.3226C0.4041 20.96 0.422378 21.9749 1.05284 22.5895C1.36056 22.8895 1.75717 23.0386 2.15344 23.0386C2.56891 23.0386 2.98396 22.8745 3.2951 22.5482L6.40277 19.2013L9.82433 22.5699C10.4443 23.1956 11.4481 23.1946 12.0669 22.5681C12.6857 21.9415 12.6849 20.9265 12.0652 20.3009L8.54087 16.7696Z" fill="#15B5CB"/>
</g>
<defs>
<clipPath id="clip0_142_645">
<rect width="13" height="23" fill="white"/>
</clipPath>
</defs>
</svg>
