<svg width="25" height="25" viewBox="0 0 25 25" fill="none" xmlns="http://www.w3.org/2000/svg">
<path d="M23.4375 10.9375C23.4375 4.89687 18.5406 0 12.5 0C6.45937 0 1.5625 4.89687 1.5625 10.9375C1.5625 13.5594 2.4875 15.9656 4.02656 17.8484L0 21.875H3.125V25L7.47812 20.6469C8.98281 21.4266 10.6875 21.875 12.5 21.875C14.3125 21.875 16.0172 21.4266 17.5219 20.6469L21.875 25V21.875H25L20.9734 17.8484C22.5125 15.9656 23.4375 13.5594 23.4375 10.9375ZM12.5 17.1875C9.04844 17.1875 6.25 14.3891 6.25 10.9375C6.25 7.48594 9.04844 4.6875 12.5 4.6875C15.9516 4.6875 18.75 7.48594 18.75 10.9375C18.75 14.3891 15.9516 17.1875 12.5 17.1875Z" fill="#15B5CB"/>
</svg>
