<svg width="52" height="50" viewBox="0 0 52 50" fill="none" xmlns="http://www.w3.org/2000/svg">
<path fill-rule="evenodd" clip-rule="evenodd" d="M26.4407 0V37.7789L0 50V9.40084L26.4407 0ZM1.76271 10.6375V47.2505L24.678 36.6589V2.4901L1.76271 10.6375Z" fill="black"/>
<path fill-rule="evenodd" clip-rule="evenodd" d="M24.678 0.0144043V37.7871L46 45.9801V5.39363L24.678 0.0144043ZM44.2373 6.64474V43.2704L26.4407 36.6507V2.47574L44.2373 6.64474Z" fill="black"/>
</svg>
