<svg width="40" height="58" viewBox="0 0 40 58" fill="none" xmlns="http://www.w3.org/2000/svg">
<path d="M21.5917 37.0957V9.30408H19.175V37.0957C15.9125 37.6999 13.375 40.5999 13.375 43.9832C13.375 47.8499 16.5167 50.9916 20.3833 50.9916C24.25 50.9916 27.3917 47.8499 27.3917 43.9832C27.3917 40.5999 24.8542 37.6999 21.5917 37.0957ZM20.3833 48.6957C17.8458 48.6957 15.7917 46.6416 15.7917 44.1041C15.7917 41.5666 17.8458 39.5124 20.3833 39.5124C22.9208 39.5124 24.975 41.5666 24.975 44.1041C24.975 46.6416 22.9208 48.6957 20.3833 48.6957Z" fill="black"/>
<path d="M20.3833 0.604126C16.5167 0.604126 13.375 3.74579 13.375 7.61246V32.7458C9.50834 35.1625 7.09167 39.3916 7.09167 44.1041C7.09167 51.475 13.0125 57.3958 20.3833 57.3958C27.7542 57.3958 33.675 51.475 33.675 44.1041C33.675 39.5125 31.2583 35.1625 27.3917 32.7458V31.0541H32.4667V28.6375H27.3917V24.1666H32.4667V21.75H27.3917V17.2791H32.4667V14.8625H27.3917V10.5125H32.4667V8.09579H27.3917V7.61246C27.3917 3.74579 24.25 0.604126 20.3833 0.604126ZM31.2583 44.1041C31.2583 50.1458 26.425 54.9791 20.3833 54.9791C14.3417 54.9791 9.50834 50.1458 9.50834 44.1041C9.50834 40.1166 11.6833 36.4916 15.1875 34.5583L15.7917 34.1958V7.61246C15.7917 5.07496 17.8458 3.02079 20.3833 3.02079C22.9208 3.02079 24.975 5.07496 24.975 7.61246V34.1958L25.5792 34.5583C29.0833 36.4916 31.2583 40.1166 31.2583 44.1041Z" fill="black"/>
<path d="M4.19168 6.5249V10.5124H0.325012V12.9291H4.19168V16.7957H6.60835V12.9291H10.5958V10.5124H6.60835V6.5249H4.19168Z" fill="black"/>
</svg>
