<svg width="19" height="20" viewBox="0 0 19 20" fill="none" xmlns="http://www.w3.org/2000/svg">
<g clip-path="url(#clip0_142_660)">
<path d="M7.45514 12.6505L7.14085 17.3039C7.59052 17.3039 7.78527 17.1005 8.01881 16.8564L10.127 14.7355L14.4954 18.103C15.2966 18.573 15.8611 18.3255 16.0772 17.3272L18.9446 3.18385L18.9454 3.18302C19.1995 1.93635 18.5171 1.44885 17.7365 1.75469L0.881935 8.54719C-0.268356 9.01719 -0.25094 9.69219 0.686393 9.99802L4.99543 11.4089L15.0045 4.81635C15.4755 4.48802 15.9038 4.66969 15.5515 4.99802L7.45514 12.6505Z" fill="#15B5CB"/>
</g>
<defs>
<clipPath id="clip0_142_660">
<rect width="19" height="20" fill="white"/>
</clipPath>
</defs>
</svg>
