<svg width="30" height="30" viewBox="0 0 30 30" fill="none" xmlns="http://www.w3.org/2000/svg">
<path d="M20 11.25L25.4638 13.4362C25.9388 13.625 26.25 14.0863 26.25 14.5963V26.25C26.25 26.94 25.69 27.5 25 27.5H5C4.31 27.5 3.75 26.94 3.75 26.25V14.5963C3.75 14.085 4.06125 13.625 4.53625 13.4362L10 11.25H20ZM25 17.5H10V23.75H25V17.5ZM20 3.75C20.69 3.75 21.25 4.31 21.25 5V10H8.75V5C8.75 4.31 9.31 3.75 10 3.75H20Z" fill="#15B5CB"/>
</svg>
