<svg width="22" height="17" viewBox="0 0 22 17" fill="none" xmlns="http://www.w3.org/2000/svg">
<path fill-rule="evenodd" clip-rule="evenodd" d="M10.6751 0.0817981C10.575 0.129869 10.3929 0.267532 10.2705 0.387777C9.94347 0.709036 9.20051 1.61378 8.82794 2.14447C8.64918 2.3991 8.49667 2.61462 8.48901 2.62345C8.48135 2.63223 8.27536 2.51116 8.0313 2.35435C7.54226 2.04023 6.4596 1.46725 6.01824 1.28898C5.61568 1.12639 5.32123 1.13358 5.05428 1.31253C4.87901 1.43005 4.82467 1.50504 4.68343 1.82417C4.46879 2.3091 4.15929 3.26588 3.96668 4.04001C3.88265 4.37769 3.8087 4.65997 3.80233 4.66725C3.79596 4.67457 3.52213 4.63768 3.19382 4.58534C2.79126 4.52108 2.28179 4.48197 1.62893 4.46509C0.66441 4.44013 0.660237 4.44044 0.467325 4.55055C0.342991 4.62149 0.229239 4.73692 0.149433 4.87317C0.0421783 5.05622 0.0223452 5.1429 0.00453395 5.50632C-0.0190853 5.98967 0.0526332 7.1611 0.148659 7.86019C0.822389 12.7639 3.30938 15.6612 7.6989 16.6563C9.688 17.1071 12.266 17.1151 14.2345 16.6764C16.7527 16.1153 18.7162 14.9024 19.9414 13.1511C21.2424 11.2915 21.9741 8.73147 21.9938 5.96975L22 5.10252L21.8709 4.88177C21.7862 4.73692 21.6753 4.62304 21.5483 4.55055C21.3554 4.44044 21.3511 4.44013 20.3867 4.46505C19.7403 4.48174 19.2257 4.52099 18.8379 4.58316C18.5184 4.63436 18.2448 4.67639 18.2298 4.67648C18.2149 4.67661 18.1601 4.48742 18.1082 4.25603C17.9624 3.60633 17.5219 2.23988 17.3201 1.81093C17.1664 1.48431 17.1075 1.40504 16.9369 1.29521C16.6423 1.10547 16.3917 1.11984 15.852 1.35724C15.2812 1.60837 14.4761 2.03828 13.9617 2.36672C13.7288 2.51539 13.5325 2.63036 13.5255 2.62222C13.5184 2.61408 13.3664 2.3991 13.1877 2.14447C12.8151 1.61378 12.0721 0.709036 11.7451 0.387777C11.3546 0.00425774 11.0302 -0.0885638 10.6751 0.0817981ZM11.2529 2.52785C12.2436 3.75809 12.9802 5.08428 13.3683 6.33667C13.6405 7.21481 13.695 7.58109 13.6929 8.51963C13.6913 9.24951 13.6781 9.397 13.5718 9.88039C13.4104 10.6136 13.2485 11.0919 12.9241 11.7941C12.5081 12.6942 11.7985 13.8133 11.1794 14.5455L11.0063 14.7502L10.8327 14.5455C10.231 13.8365 9.5209 12.7132 9.09335 11.7941C8.7684 11.0954 8.60633 10.6183 8.44349 9.88039C8.33533 9.3904 8.32385 9.25729 8.32406 8.49689C8.32428 7.79843 8.34037 7.57909 8.41871 7.20553C8.71058 5.8143 9.35376 4.4323 10.3365 3.08496C10.6536 2.65023 10.9684 2.26635 11.0078 2.26635C11.0268 2.26635 11.1371 2.38405 11.2529 2.52785ZM6.28751 3.43023C6.69494 3.64421 7.56416 4.19832 7.56506 4.24466C7.56554 4.26967 7.50612 4.42316 7.43307 4.58575C7.35998 4.74833 7.23155 5.07578 7.1477 5.3134C7.0639 5.55103 6.98908 5.753 6.98151 5.76227C6.97394 5.77151 6.74902 5.677 6.48172 5.55221C6.21442 5.42746 5.89429 5.29044 5.77034 5.24769C5.6464 5.20498 5.53617 5.155 5.52546 5.13663C5.47753 5.05468 5.95035 3.31235 6.02047 3.31235C6.04392 3.31235 6.16408 3.36538 6.28751 3.43023ZM16.1891 3.82399C16.3698 4.43804 16.5193 5.08683 16.491 5.13508C16.4798 5.15427 16.3692 5.20498 16.2452 5.24769C16.1213 5.29044 15.8012 5.42746 15.5339 5.55221C15.2666 5.677 15.0417 5.77151 15.0341 5.76227C15.0265 5.753 14.9517 5.55103 14.8679 5.3134C14.784 5.07578 14.6556 4.74833 14.5825 4.58575C14.5095 4.42316 14.4496 4.26854 14.4496 4.24207C14.4496 4.16808 15.8546 3.31981 15.9862 3.31449C16.0158 3.31326 16.1037 3.5342 16.1891 3.82399ZM2.31729 6.33689C3.66638 6.44018 5.15168 6.86549 6.24307 7.46098L6.5765 7.64294V8.41653C6.5765 9.99763 6.88944 11.2832 7.66302 12.8803C7.9107 13.3916 8.49529 14.379 8.8908 14.9541C8.94376 15.0311 8.92478 15.0309 8.49706 14.9498C5.32429 14.3482 3.37417 12.7504 2.42321 9.97334C2.26695 9.51701 2.05747 8.68635 1.95018 8.09741C1.87459 7.68255 1.75894 6.68198 1.75838 6.43813C1.75804 6.28437 1.76793 6.2689 1.8548 6.28782C1.90806 6.29942 2.11616 6.32152 2.31729 6.33689ZM20.2576 6.46291C20.2576 6.92716 20.0845 8.12624 19.9111 8.86308C19.0983 12.3163 17.1555 14.2064 13.6967 14.9088C13.4364 14.9616 13.1882 15.0126 13.1451 15.0219C13.0765 15.0368 13.0738 15.0285 13.1235 14.9561C13.5251 14.371 14.1045 13.3923 14.3526 12.8803C15.1262 11.2832 15.4391 9.99763 15.4391 8.41653V7.64294L15.7775 7.4568C16.8168 6.88523 18.2032 6.48256 19.6338 6.33676C19.9414 6.30542 20.2076 6.27723 20.2253 6.27409C20.2431 6.27099 20.2576 6.35595 20.2576 6.46291Z" fill="#919EAF"/>
</svg>
