<svg width="68" height="86" viewBox="0 0 68 86" fill="none" xmlns="http://www.w3.org/2000/svg">
<g clip-path="url(#clip0_3:2253)">
<path fill-rule="evenodd" clip-rule="evenodd" d="M48.633 44.7453C49.5997 45.5994 50.8933 46.7426 50.9207 47.6648C50.9207 47.6648 53.3134 50.0388 53.9116 57.7544C54.5098 65.4699 52.7152 68.1156 52.7152 68.1156C52.7152 68.1156 49.9374 68.18 46.162 68.2359C47.6566 68.0412 48.591 67.9071 48.591 67.9071L48.3454 44.4901C48.4366 44.5717 48.533 44.6569 48.633 44.7453ZM43.9389 41.5685C43.9534 44.4054 43.9786 50.6925 43.931 53.0064L41.7786 52.6682C40.8347 52.5199 39.9178 53.0599 39.5897 53.9573L38.3597 57.3224L25.5712 58.1039C25.5712 58.1039 18.3645 44.9322 16.4436 41.5198L17.6864 40.6875C17.9317 40.4789 18.1419 40.3398 18.2471 40.3051C17.5463 38.3931 18.212 37.6978 19.4383 36.4464C19.7186 36.203 19.9989 35.8902 20.2792 35.5773L20.2792 35.5773C22.1012 33.561 22.6618 33.8044 22.6618 33.8044C21.926 35.8902 22.5917 37.4893 23.6779 39.5751C24.6239 41.3827 27.7072 44.4071 29.2839 45.6586C30.8606 46.9101 35.3678 48.8518 37.7605 46.4778C39.3918 44.8593 39.5676 42.2456 39.6685 40.746C39.7155 40.0459 39.7463 39.5886 39.9012 39.5886C40.6903 39.8496 42.2731 40.6275 43.9389 41.5685ZM12.8929 44.2097L21.3969 67.4964C15.8344 66.7558 11.6857 65.7317 9.01743 64.9339C6.87944 64.2946 5.66309 62.1773 5.97244 59.9673C6.39785 56.9282 6.94201 53.1882 7.31528 51.2207C7.80581 48.5787 9.48762 47.1534 11.0994 45.7977C11.66 45.3457 12.1855 44.8591 12.6761 44.3724L12.6761 44.3724C12.7111 44.3376 12.7461 44.3028 12.8162 44.2681L12.8929 44.2097Z" fill="url(#paint0_linear_3:2253)"/>
<path d="M23.9021 29.6029C23.6196 29.5008 23.3018 29.7051 23.2665 30.0114L23.1253 35.0149C23.1253 35.049 23.1253 35.083 23.1253 35.1171C23.2312 35.5596 24.0081 38.7931 26.6564 41.2098C27.5745 42.0608 28.3866 42.7415 29.0928 43.3542C30.6465 44.5796 31.8471 45.1923 33.1536 45.2263C34.9897 45.2944 36.5081 44.7838 37.0731 43.2861C37.1084 43.184 37.1437 43.0819 37.179 42.9458C37.5321 41.5162 37.2849 39.0654 37.2143 38.2826C37.179 38.1124 37.0731 37.9762 36.9318 37.9422C36.155 37.6699 33.6479 36.7509 31.388 35.5936C30.2934 35.083 29.4812 34.6405 28.8456 34.0959C28.6338 33.8917 28.4219 33.6875 28.21 33.4492C27.8923 33.0408 28.4572 32.4962 28.881 32.8365C29.7284 33.5173 30.823 34.2321 32.1295 34.7086C34.566 35.6276 37.2849 36.7509 39.1917 36.6488C39.227 36.6488 39.2623 36.6488 39.2976 36.6147C42.1578 37.0232 42.8287 32.1898 42.8287 32.1898L43.2524 31.8835C43.6409 31.6112 43.7468 31.1006 43.5349 30.6922L43.3584 30.3518C43.3584 30.3518 43.3584 30.3518 43.9234 30.1475C44.4883 29.9433 43.888 27.5947 43.888 27.5947C43.888 27.5947 47.2073 27.0842 46.6776 25.7907C46.1479 24.4973 44.8767 21.1616 44.8767 21.1616L46.9245 13.8103C43.2524 16.017 38.1113 13.6997 34.1047 14.2516C30.8998 14.6931 27.8569 26.3013 27.8569 26.3013C27.1154 22.1827 24.6083 21.2297 23.9021 21.0254C22.5603 20.6851 21.8541 20.5149 20.9713 22.0466C19.9473 23.8165 23.7609 28.9562 23.7609 28.9562C23.9374 29.1945 24.0787 29.4328 24.114 29.7051C24.0434 29.671 23.9728 29.637 23.9021 29.6029ZM26.727 31.475C26.6917 31.475 26.6564 31.441 26.6564 31.4069C26.6917 31.441 26.6917 31.441 26.727 31.475ZM26.3033 31.0666C26.268 31.0666 26.268 31.0325 26.268 30.9985C26.268 31.0325 26.268 31.0325 26.3033 31.0666ZM25.8442 30.6581C25.8089 30.6581 25.7736 30.6241 25.7736 30.59C25.8089 30.6241 25.8442 30.6241 25.8442 30.6581ZM25.3852 30.3177C25.3499 30.3177 25.3146 30.3177 25.3146 30.2837C25.3499 30.2837 25.3499 30.3177 25.3852 30.3177ZM25.1733 30.1816C25.138 30.1816 25.1027 30.1816 25.1027 30.1475C25.138 30.1475 25.1733 30.1816 25.1733 30.1816ZM24.9615 30.0795C24.9261 30.0795 24.8908 30.0454 24.8908 30.0454C24.9261 30.0454 24.9261 30.0795 24.9615 30.0795Z" fill="#8A97CC"/>
<path fill-rule="evenodd" clip-rule="evenodd" d="M48.3747 67.6466C46.8231 67.7083 32.9444 68.2411 27.3917 67.8147C24.0986 67.6062 21.6813 67.2239 21.6813 67.2239L21.3841 66.453C21.4852 66.9507 21.5405 67.2587 21.5405 67.2587C21.5405 67.2587 23.9578 67.641 27.2508 67.8496C33.1364 68.3014 48.3756 67.6758 48.3756 67.6758L48.3747 67.6466ZM18.4706 58.8963C15.8676 58.4166 12.9223 60.5422 10.6 62.2183C9.01819 63.3599 7.72539 64.293 7.02671 64.0519C6.048 63.7142 5.48602 62.73 5.62696 61.7043C6.0635 58.5275 6.78583 53.3886 7.24714 50.957C7.7376 48.3154 9.41917 46.8903 11.0307 45.5347C11.5912 45.0829 12.1167 44.5963 12.6072 44.1097L12.6072 44.1096C12.6422 44.0749 12.6772 44.0401 12.7473 44.0054L16.2155 41.3637L17.6168 40.4253C17.8621 40.2167 18.0723 40.0777 18.1774 40.0429C17.4767 38.1312 18.1423 37.4361 19.3685 36.1848C19.6487 35.9415 19.929 35.6287 20.2092 35.3158L20.2093 35.3158C22.031 33.2998 22.5915 33.5431 22.5915 33.5431C21.8558 35.6286 22.5214 37.2275 23.6074 39.313C24.5533 41.1204 27.6362 44.1444 29.2127 45.3957C29.2477 45.4305 34.32 47.4117 37.0876 45.3957C39.3647 43.5535 38.076 38.8264 38.076 38.8264L38.3212 39.0349L39.8276 39.6258C40.5283 39.6954 42.1047 40.7033 43.6812 42.1284C43.7435 42.1846 43.8067 42.2417 43.8705 42.2997C43.9882 44.0709 44.838 56.6573 44.838 56.6573L25.4999 57.8391C25.4999 57.8391 17.8978 44.0401 16.3914 41.3984L12.783 44.1444L18.4706 58.8963Z" fill="url(#paint1_linear_3:2253)"/>
<path d="M33.8984 24.2361C33.0696 22.9228 31.8821 18.2096 30.2986 17.7382L48.3717 17.3934C49.6573 17.3689 50.8727 18.5681 50.8883 19.8538C50.9141 21.9802 50.6053 24.7494 47.7172 26.3793C46.1337 26.3793 46.7768 26.133 46.1338 25.7508C45.4909 25.3686 45.3414 27.1648 40.9876 27.1648C36.6339 27.1648 34.7272 25.5493 33.8984 24.2361Z" fill="#0B1240"/>
<path d="M36.6111 23.5027C35.0775 21.6242 34.9741 18.0443 35.0774 16.1667L49.199 17.6552C50.7257 17.6552 50.344 24.601 47.6723 25.0972C46.9089 25.0972 47.1472 24.5073 46.5272 24.1049C45.9073 23.7026 44.6705 25.1121 42.5007 25.5144C40.331 25.9167 37.231 24.7097 36.6111 23.5027Z" fill="url(#paint2_linear_3:2253)"/>
<path d="M31.0904 15.7742L18.2496 15.3962C17.1115 17.736 17.621 20.8801 19.1407 20.8801L33.8541 18.9162H50.8842V17.7378C50.8842 14.5956 48.7663 13.7953 46.787 13.4027C41.3832 12.3307 30.1987 12.9402 31.0904 15.7742Z" fill="#0B1240"/>
<path d="M48.7473 13.6514C48.4251 12.9724 47.5365 12.7733 46.846 13.07C45.2057 13.7747 43.071 13.877 41.3829 13.4178C41.3829 13.4178 44.6826 12.8832 46.4862 11.7646C47.067 11.4043 47.1879 10.6668 46.9448 10.0281C43.4438 0.828434 38.7185 -0.301682 29.1322 0.0561369C29.0103 0.0606847 28.8855 0.0767215 28.7668 0.104574C24.2772 1.15802 21.6712 3.33347 20.3506 6.69884C20.3366 6.73447 20.328 6.77325 20.3108 6.80745C20.295 6.83885 20.2888 6.87314 20.2774 6.9064C20.0377 7.60813 19.43 9.83489 19.6563 12.5716C19.6902 12.9815 19.4259 13.3629 19.0858 13.5941C18.9975 13.6542 18.909 13.7243 18.8267 13.8054C18.8244 13.8077 18.823 13.8189 18.823 13.8222C18.823 13.8332 18.8099 13.8569 18.8022 13.8648C18.7163 13.9538 18.6543 14.0411 18.5942 14.1049C18.5835 14.1163 18.5742 14.1289 18.5674 14.1429C18.4499 14.3837 18.3862 14.6522 18.4434 15.0148C18.4592 15.1151 18.5274 15.2822 18.5868 15.3645C18.7125 15.5389 18.8578 15.5812 19.0669 15.6316C22.1503 16.3759 27.3476 15.2082 28.6458 14.8923C28.8458 14.8437 29.0506 14.822 29.2561 14.8334C35.5905 15.1871 42.4896 16.5904 48.0643 15.1841C48.7316 15.0158 49.0423 14.2731 48.7473 13.6514Z" fill="url(#paint3_linear_3:2253)"/>
<rect x="3.82129" y="71.0879" width="0.459426" height="13.6748" fill="url(#paint4_linear_3:2253)"/>
<rect x="18.6465" y="61.3557" width="0.459426" height="15.9539" fill="url(#paint5_linear_3:2253)"/>
<rect x="40.0566" y="70.0459" width="0.459426" height="15.9539" fill="url(#paint6_linear_3:2253)"/>
<rect x="63.6416" y="63.8306" width="0.459426" height="15.9539" fill="url(#paint7_linear_3:2253)"/>
<ellipse cx="3.90512" cy="67.01" rx="3.90512" ry="3.87453" stroke="#13BBD2" stroke-width="2"/>
<ellipse cx="40.1356" cy="66.6367" rx="3.90512" ry="3.87453" stroke="#13BBD2" stroke-width="2"/>
<ellipse cx="64.0956" cy="60.0271" rx="3.90512" ry="3.87453" stroke="#13BBD2" stroke-width="2"/>
<path d="M7.41309 63.8415L15.8367 57.824M22.9126 57.824L36.0535 64.8444M44.0164 67.1784L60.6506 61.5013" stroke="url(#paint8_linear_3:2253)" stroke-width="2"/>
<ellipse cx="19.405" cy="56.981" rx="3.90512" ry="3.87453" stroke="#13BBD2" stroke-width="2"/>
</g>
<defs>
<linearGradient id="paint0_linear_3:2253" x1="28.8279" y1="83.8491" x2="90.3972" y2="70.9089" gradientUnits="userSpaceOnUse">
<stop stop-color="#3D48DB"/>
<stop offset="0.494792" stop-color="#3C2D93"/>
<stop offset="1" stop-color="#6238B3"/>
</linearGradient>
<linearGradient id="paint1_linear_3:2253" x1="28.9346" y1="68.0135" x2="85.6504" y2="51.4446" gradientUnits="userSpaceOnUse">
<stop stop-color="#3D48DB"/>
<stop offset="0.494792" stop-color="#3C2D93"/>
<stop offset="1" stop-color="#6238B3"/>
</linearGradient>
<linearGradient id="paint2_linear_3:2253" x1="32.0236" y1="15.6706" x2="58.1959" y2="19.3392" gradientUnits="userSpaceOnUse">
<stop offset="0.122969" stop-color="#3C2D93"/>
<stop offset="0.468598" stop-color="#3D48DB"/>
<stop offset="1" stop-color="#6238B3"/>
</linearGradient>
<linearGradient id="paint3_linear_3:2253" x1="41.0099" y1="-3.34472" x2="19.6097" y2="38.5132" gradientUnits="userSpaceOnUse">
<stop stop-color="#3D48DB"/>
<stop offset="0.494792" stop-color="#3C2D93"/>
<stop offset="1" stop-color="#6238B3"/>
</linearGradient>
<linearGradient id="paint4_linear_3:2253" x1="4.051" y1="82.4088" x2="10.2802" y2="76.5794" gradientUnits="userSpaceOnUse">
<stop stop-color="#3D48DB" stop-opacity="0"/>
<stop offset="0.941162" stop-color="#6238B3"/>
</linearGradient>
<linearGradient id="paint5_linear_3:2253" x1="18.8762" y1="74.5635" x2="25.9861" y2="68.8604" gradientUnits="userSpaceOnUse">
<stop stop-color="#3D48DB" stop-opacity="0"/>
<stop offset="0.941162" stop-color="#6238B3"/>
</linearGradient>
<linearGradient id="paint6_linear_3:2253" x1="40.2864" y1="83.2537" x2="47.3962" y2="77.5506" gradientUnits="userSpaceOnUse">
<stop stop-color="#3D48DB" stop-opacity="0"/>
<stop offset="0.941162" stop-color="#6238B3"/>
</linearGradient>
<linearGradient id="paint7_linear_3:2253" x1="63.8713" y1="77.0383" x2="70.9812" y2="71.3352" gradientUnits="userSpaceOnUse">
<stop stop-color="#3D48DB" stop-opacity="0"/>
<stop offset="0.941162" stop-color="#6238B3"/>
</linearGradient>
<linearGradient id="paint8_linear_3:2253" x1="33.021" y1="57.824" x2="33.021" y2="70.1933" gradientUnits="userSpaceOnUse">
<stop stop-color="#01F8F1"/>
<stop offset="1" stop-color="#13BBD2"/>
</linearGradient>
<clipPath id="clip0_3:2253">
<rect width="68.0007" height="86" fill="white"/>
</clipPath>
</defs>
</svg>
