<svg width="68" height="86" viewBox="0 0 68 86" fill="none" xmlns="http://www.w3.org/2000/svg">
<g clip-path="url(#clip0_3:2347)">
<path d="M63.6115 59.7984V60.6777L36.064 76.7026V75.8857L63.6115 59.7984Z" fill="url(#paint0_linear_3:2347)" stroke="#13BBD2" stroke-width="4.05714"/>
<path d="M4.45924 59.7944L32.0782 75.887V76.6997L4.45924 60.6072V59.7944Z" fill="url(#paint1_linear_3:2347)" stroke="#13BBD2" stroke-width="4.05714"/>
<path d="M34.036 69.8565V78.2978L68.0003 58.4821V49.9692L34.036 69.8565Z" fill="url(#paint2_linear_3:2347)"/>
<path d="M35.1086 70.4284L66.9277 51.9004V57.9095L35.1086 76.4375V70.4284Z" fill="#25054D"/>
<path d="M66.5702 52.115V57.7664L35.1086 76.0799V76.4375L66.9277 57.9095V51.9004L66.5702 52.115Z" fill="#45108A"/>
<path d="M34.1073 69.8565V78.2978L0 58.4106V49.9692L34.1073 69.8565Z" fill="url(#paint3_linear_3:2347)"/>
<path opacity="0.2" d="M1.07251 57.8382V51.8291L33.0347 70.4287V76.4378L1.07251 57.8382Z" fill="#25054D"/>
<path d="M1.50153 57.6236V52.1153L1.07251 51.8291V57.8382L33.0347 76.4378V76.0086L1.50153 57.6236Z" fill="#45108A"/>
<path d="M0 49.969L34.1073 69.8563L68 49.969L33.8927 30.1533L0 49.969Z" fill="url(#paint4_linear_3:2347)"/>
<path d="M63.6115 47.9165V48.8027L36.064 64.8276V63.9414L63.6115 47.9165Z" fill="url(#paint5_linear_3:2347)" stroke="#13BBD2" stroke-width="4.05714"/>
<path d="M4.45924 47.8476L32.0782 63.9402V64.8245L4.45924 48.7319V47.8476Z" fill="url(#paint6_linear_3:2347)" stroke="#13BBD2" stroke-width="4.05714"/>
<path d="M34.036 57.91V66.4228L68.0003 46.6071V38.0942L34.036 57.91Z" fill="url(#paint7_linear_3:2347)"/>
<path d="M35.1086 58.5539L66.9277 40.0259V45.9634L35.1086 64.563V58.5539Z" fill="#25054D"/>
<path d="M66.5702 40.2405V45.8919L35.1086 64.2053V64.563L66.9277 45.9634V40.0259L66.5702 40.2405Z" fill="#45108A"/>
<path d="M34.1073 57.91V66.4228L0 46.5356V38.0942L34.1073 57.91Z" fill="url(#paint8_linear_3:2347)"/>
<path opacity="0.2" d="M1.07251 45.9632V39.9541L33.0347 58.5537V64.5628L1.07251 45.9632Z" fill="#25054D"/>
<path d="M1.50153 45.7486V40.2403L1.07251 39.9541V45.9632L33.0347 64.5628V64.1336L1.50153 45.7486Z" fill="#45108A"/>
<path d="M0 38.0943L34.1073 57.91L68 38.0943L33.8927 18.207L0 38.0943Z" fill="url(#paint9_linear_3:2347)"/>
<path d="M33.5863 25.3409V4.16602L11.3486 17.1857V38.3606L33.5863 25.3409Z" fill="url(#paint10_linear_3:2347)"/>
<path d="M33.5862 25.3409V4.16602L55.8953 17.1857V38.3606L33.5862 25.3409Z" fill="url(#paint11_linear_3:2347)"/>
<path d="M33.6572 30.0099V43.2442L45.2408 36.4482V23.2139L33.6572 30.0099Z" fill="url(#paint12_linear_3:2347)"/>
<path d="M33.6571 30.0099V43.2442L22.002 36.4482V23.2139L33.6571 30.0099Z" fill="url(#paint13_linear_3:2347)"/>
<path d="M22.002 23.2137L33.6571 30.0097L45.2407 23.2137L33.5855 16.4893L22.002 23.2137Z" fill="url(#paint14_linear_3:2347)"/>
<path d="M33.6575 30.134V51.3089L55.8951 38.2892V17.1143L33.6575 30.134Z" fill="url(#paint15_linear_3:2347)" fill-opacity="0.3"/>
<path d="M33.6578 30.134V51.3089L11.3486 38.2892V17.1143L33.6578 30.134Z" fill="url(#paint16_linear_3:2347)" fill-opacity="0.3"/>
<path d="M33.5148 4.2373L11.3486 17.1855L33.5863 30.1336L55.7524 17.1855L33.5148 4.2373ZM33.6578 28.2022L14.6378 17.1855L33.5148 6.09726L52.5347 17.1855L33.6578 28.2022Z" fill="url(#paint17_linear_3:2347)" fill-opacity="0.5"/>
</g>
<defs>
<linearGradient id="paint0_linear_3:2347" x1="49.8377" y1="56.2646" x2="49.8377" y2="80.2295" gradientUnits="userSpaceOnUse">
<stop stop-color="#422F98"/>
<stop offset="1" stop-color="#2A6AB3"/>
</linearGradient>
<linearGradient id="paint1_linear_3:2347" x1="18.2687" y1="56.2646" x2="18.2687" y2="80.2295" gradientUnits="userSpaceOnUse">
<stop stop-color="#422F98"/>
<stop offset="1" stop-color="#2A6AB3"/>
</linearGradient>
<linearGradient id="paint2_linear_3:2347" x1="45.3643" y1="65.8637" x2="120.123" y2="43.4889" gradientUnits="userSpaceOnUse">
<stop stop-color="#25054D"/>
<stop offset="1" stop-color="#45108A"/>
</linearGradient>
<linearGradient id="paint3_linear_3:2347" x1="-31.0545" y1="74.9304" x2="67.2785" y2="52.8976" gradientUnits="userSpaceOnUse">
<stop stop-color="#25054D"/>
<stop offset="1" stop-color="#45108A"/>
</linearGradient>
<linearGradient id="paint4_linear_3:2347" x1="69.4307" y1="-17.5445" x2="31.3049" y2="55.0817" gradientUnits="userSpaceOnUse">
<stop stop-color="#25054D"/>
<stop offset="1" stop-color="#45108A"/>
</linearGradient>
<linearGradient id="paint5_linear_3:2347" x1="49.8377" y1="44.3896" x2="49.8377" y2="68.3545" gradientUnits="userSpaceOnUse">
<stop stop-color="#422F98"/>
<stop offset="1" stop-color="#2A6AB3"/>
</linearGradient>
<linearGradient id="paint6_linear_3:2347" x1="18.2687" y1="44.3179" x2="18.2687" y2="68.3543" gradientUnits="userSpaceOnUse">
<stop stop-color="#422F98"/>
<stop offset="1" stop-color="#2A6AB3"/>
</linearGradient>
<linearGradient id="paint7_linear_3:2347" x1="45.3643" y1="53.9798" x2="120.123" y2="31.605" gradientUnits="userSpaceOnUse">
<stop stop-color="#25054D"/>
<stop offset="1" stop-color="#45108A"/>
</linearGradient>
<linearGradient id="paint8_linear_3:2347" x1="-31.0545" y1="63.0465" x2="67.2785" y2="41.0137" gradientUnits="userSpaceOnUse">
<stop stop-color="#25054D"/>
<stop offset="1" stop-color="#45108A"/>
</linearGradient>
<linearGradient id="paint9_linear_3:2347" x1="69.4307" y1="-29.4282" x2="31.3049" y2="43.198" gradientUnits="userSpaceOnUse">
<stop stop-color="#25054D"/>
<stop offset="1" stop-color="#45108A"/>
</linearGradient>
<linearGradient id="paint10_linear_3:2347" x1="11.3486" y1="20.5061" x2="33.6107" y2="20.5061" gradientUnits="userSpaceOnUse">
<stop stop-color="#3D48DB"/>
<stop offset="0.494792" stop-color="#3C2D93"/>
<stop offset="0.915468" stop-color="#6238B3"/>
</linearGradient>
<linearGradient id="paint11_linear_3:2347" x1="27.2841" y1="41.0618" x2="56.2471" y2="29.7284" gradientUnits="userSpaceOnUse">
<stop offset="0.216858" stop-color="#3D48DB"/>
<stop offset="0.85489" stop-color="#292184"/>
</linearGradient>
<linearGradient id="paint12_linear_3:2347" x1="38.1217" y1="26.9151" x2="50.6208" y2="37.6826" gradientUnits="userSpaceOnUse">
<stop stop-color="#01F8F1"/>
<stop offset="1" stop-color="#3643A3"/>
</linearGradient>
<linearGradient id="paint13_linear_3:2347" x1="26.494" y1="26.9151" x2="39.0043" y2="37.7587" gradientUnits="userSpaceOnUse">
<stop stop-color="#01F8F1"/>
<stop offset="1" stop-color="#3643A3"/>
</linearGradient>
<linearGradient id="paint14_linear_3:2347" x1="30.9585" y1="18.9876" x2="36.7404" y2="33.7911" gradientUnits="userSpaceOnUse">
<stop stop-color="#01F8F1"/>
<stop offset="1" stop-color="#3643A3"/>
</linearGradient>
<linearGradient id="paint15_linear_3:2347" x1="42.2282" y1="23.4328" x2="63.7928" y2="44.3235" gradientUnits="userSpaceOnUse">
<stop stop-color="#01F8F1"/>
<stop offset="1" stop-color="#3643A3"/>
</linearGradient>
<linearGradient id="paint16_linear_3:2347" x1="19.947" y1="23.4328" x2="41.5136" y2="44.3927" gradientUnits="userSpaceOnUse">
<stop stop-color="#01F8F1"/>
<stop offset="1" stop-color="#3643A3"/>
</linearGradient>
<linearGradient id="paint17_linear_3:2347" x1="55.4075" y1="7.90099" x2="26.3211" y2="20.569" gradientUnits="userSpaceOnUse">
<stop stop-color="#3643A3"/>
<stop offset="0.841876" stop-color="#01F8F1"/>
</linearGradient>
<clipPath id="clip0_3:2347">
<rect width="68" height="86" fill="white"/>
</clipPath>
</defs>
</svg>
