<?xml version="1.0" encoding="UTF-8" standalone="no"?>
<svg
   xmlns:dc="http://purl.org/dc/elements/1.1/"
   xmlns:cc="http://creativecommons.org/ns#"
   xmlns:rdf="http://www.w3.org/1999/02/22-rdf-syntax-ns#"
   xmlns:svg="http://www.w3.org/2000/svg"
   xmlns="http://www.w3.org/2000/svg"
   xmlns:sodipodi="http://sodipodi.sourceforge.net/DTD/sodipodi-0.dtd"
   xmlns:inkscape="http://www.inkscape.org/namespaces/inkscape"
   width="61"
   height="61"
   viewBox="0 0 61 61"
   version="1.1"
   id="svg3887"
   sodipodi:docname="community_info__01.svg"
   style="fill:none"
   inkscape:version="0.92.5 (2060ec1f9f, 2020-04-08)">
  <metadata
     id="metadata3891">
    <rdf:RDF>
      <cc:Work
         rdf:about="">
        <dc:format>image/svg+xml</dc:format>
        <dc:type
           rdf:resource="http://purl.org/dc/dcmitype/StillImage" />
        <dc:title></dc:title>
      </cc:Work>
    </rdf:RDF>
  </metadata>
  <sodipodi:namedview
     pagecolor="#ffffff"
     bordercolor="#666666"
     borderopacity="1"
     objecttolerance="10"
     gridtolerance="10"
     guidetolerance="10"
     inkscape:pageopacity="0"
     inkscape:pageshadow="2"
     inkscape:window-width="2560"
     inkscape:window-height="1367"
     id="namedview3889"
     showgrid="false"
     inkscape:zoom="7.0771636"
     inkscape:cx="31.461903"
     inkscape:cy="4.5503957"
     inkscape:window-x="1920"
     inkscape:window-y="0"
     inkscape:window-maximized="1"
     inkscape:current-layer="svg3887" />
  <path
     d="M 31.7378,4.46154 C 19.4374,4.46154 8.78768,11.2556 3.62835,21.1529 3.40473,21.5818 2.84338,21.7083 2.46737,21.4039 2.19427,21.1829 2.11052,20.8012 2.27303,20.4897 7.68382,10.11858 18.846,3 31.7378,3 42.8217,3 52.6271,8.262 58.598,16.329 c 0.2308,0.3119 0.1748,0.7481 -0.1213,0.9989 -0.3364,0.2849 -0.8444,0.2182 -1.1064,-0.1363 C 51.6761,9.48773 42.3176,4.46154 31.7378,4.46154 Z"
     id="path3822"
     inkscape:connector-curvature="0"
     style="fill:url(#paint0_linear)" />
  <path
     d="m 30.0997,38.1349 c 3.4859,0 6.3118,-2.8262 6.3118,-6.3126 0,-3.4863 -2.8259,-6.3125 -6.3118,-6.3125 -3.486,0 -6.3119,2.8262 -6.3119,6.3125 0,3.4864 2.8259,6.3126 6.3119,6.3126 z"
     id="path3824"
     inkscape:connector-curvature="0"
     style="fill:url(#paint1_linear)" />
  <path
     d="m 58.5295,45.0585 c 0,-5.1283 -4.1347,-9.2804 -9.2414,-9.2804 -5.1068,0 -9.2415,4.1521 -9.2415,9.2804 v 3.5549 h 18.4829 z"
     id="path3826"
     inkscape:connector-curvature="0"
     style="fill:url(#paint2_linear)" />
  <path
     d="m 22.0761,45.0585 c 0,-5.1283 -4.1347,-9.2804 -9.2414,-9.2804 -5.10674,0 -9.24144,4.1521 -9.24144,9.2804 v 3.5549 H 22.0761 Z"
     id="path3828"
     inkscape:connector-curvature="0"
     style="fill:url(#paint3_linear)" />
  <path
     d="m 49.0944,33.1803 c 2.5431,0 4.6048,-2.0619 4.6048,-4.6054 0,-2.5435 -2.0617,-4.6054 -4.6048,-4.6054 -2.5432,0 -4.6049,2.0619 -4.6049,4.6054 0,2.5435 2.0617,4.6054 4.6049,4.6054 z"
     id="path3830"
     inkscape:connector-curvature="0"
     style="fill:url(#paint4_linear)" />
  <path
     d="m 12.8192,33.6937 c 2.5432,0 4.6049,-2.0619 4.6049,-4.6054 0,-2.5435 -2.0617,-4.6054 -4.6049,-4.6054 -2.5432,0 -4.60484,2.0619 -4.60484,4.6054 0,2.5435 2.06164,4.6054 4.60484,4.6054 z"
     id="path3832"
     inkscape:connector-curvature="0"
     style="fill:url(#paint5_linear)" />
  <path
     d="m 42.7435,53.4399 c 0,-6.9875 -5.6568,-12.645 -12.6435,-12.645 -6.9866,0 -12.6435,5.6575 -12.6435,12.645 v 4.8436 h 25.287 z"
     id="path3834"
     inkscape:connector-curvature="0"
     style="fill:url(#paint6_linear)" />
  <circle
     cx="3.56706"
     cy="19.4828"
     r="2.56706"
     id="circle3836"
     style="fill:#0b1240;stroke:#13bbd2;stroke-width:2" />
  <circle
     cx="16.942101"
     cy="7.1342001"
     r="2.56706"
     id="circle3838"
     style="fill:#0b1240;stroke:#13bbd2;stroke-width:2" />
  <circle
     cx="37.992802"
     cy="4.56706"
     r="2.56706"
     id="circle3840"
     style="fill:#0b1240;stroke:#13bbd2;stroke-width:2" />
  <circle
     cx="56.183201"
     cy="15.0574"
     r="3.8159699"
     id="circle3842"
     style="fill:#0b1240;stroke:#13bbd2;stroke-width:2" />
  <defs
     id="defs3885">
    <linearGradient
       id="paint0_linear"
       x1="2"
       y1="11.0792"
       x2="59.062698"
       y2="11.0792"
       gradientUnits="userSpaceOnUse"
       gradientTransform="translate(0,1)">
      <stop
         stop-color="#3D48DB"
         id="stop3844" />
      <stop
         offset="0.494792"
         stop-color="#3C2D93"
         id="stop3846" />
      <stop
         offset="0.915468"
         stop-color="#6238B3"
         id="stop3848" />
    </linearGradient>
    <linearGradient
       id="paint1_linear"
       x1="28.6532"
       y1="26.448601"
       x2="36.657101"
       y2="37.667801"
       gradientUnits="userSpaceOnUse"
       gradientTransform="translate(0,1)">
      <stop
         stop-color="#01F8F1"
         id="stop3851" />
      <stop
         offset="1"
         stop-color="#3643A3"
         id="stop3853" />
    </linearGradient>
    <linearGradient
       id="paint2_linear"
       x1="47.747799"
       y1="29.9007"
       x2="46.4571"
       y2="61.801701"
       gradientUnits="userSpaceOnUse"
       gradientTransform="translate(0,1)">
      <stop
         offset="0.12188"
         stop-color="#3D48DB"
         id="stop3856" />
      <stop
         offset="0.494792"
         stop-color="#3C2D93"
         stop-opacity="0"
         id="stop3858" />
      <stop
         offset="1"
         stop-color="#6238B3"
         stop-opacity="0"
         id="stop3860" />
    </linearGradient>
    <linearGradient
       id="paint3_linear"
       x1="11.2944"
       y1="29.9007"
       x2="10.0037"
       y2="61.801701"
       gradientUnits="userSpaceOnUse"
       gradientTransform="translate(0,1)">
      <stop
         offset="0.12188"
         stop-color="#3D48DB"
         id="stop3863" />
      <stop
         offset="0.494792"
         stop-color="#3C2D93"
         stop-opacity="0"
         id="stop3865" />
      <stop
         offset="1"
         stop-color="#6238B3"
         stop-opacity="0"
         id="stop3867" />
    </linearGradient>
    <linearGradient
       id="paint4_linear"
       x1="44.957001"
       y1="13.1616"
       x2="48.554298"
       y2="46.258801"
       gradientUnits="userSpaceOnUse"
       gradientTransform="translate(0,1)">
      <stop
         offset="0.291343"
         stop-color="#01F8F1"
         id="stop3870" />
      <stop
         offset="0.684855"
         stop-color="#3643A3"
         stop-opacity="0"
         id="stop3872" />
    </linearGradient>
    <linearGradient
       id="paint5_linear"
       x1="12.8351"
       y1="9.1073599"
       x2="11.7876"
       y2="46.200901"
       gradientUnits="userSpaceOnUse"
       gradientTransform="translate(0,1)">
      <stop
         offset="0.291343"
         stop-color="#01F8F1"
         id="stop3875" />
      <stop
         offset="0.684855"
         stop-color="#3643A3"
         stop-opacity="0"
         id="stop3877" />
    </linearGradient>
    <linearGradient
       id="paint6_linear"
       x1="18.740101"
       y1="21.172701"
       x2="19.987"
       y2="70.485001"
       gradientUnits="userSpaceOnUse"
       gradientTransform="translate(0,1)">
      <stop
         offset="0.291343"
         stop-color="#01F8F1"
         id="stop3880" />
      <stop
         offset="0.684855"
         stop-color="#3643A3"
         stop-opacity="0"
         id="stop3882" />
    </linearGradient>
  </defs>
</svg>
