<svg width="1842" height="1738" viewBox="0 0 1842 1738" fill="none" xmlns="http://www.w3.org/2000/svg">
<ellipse cx="920.888" cy="831.396" rx="571.899" ry="723.16" transform="rotate(-48.8846 920.888 831.396)" fill="url(#paint0_linear)"/>
<ellipse cx="893.639" cy="544.873" rx="307.026" ry="388.23" transform="rotate(-58.4954 893.639 544.873)" fill="url(#paint1_linear)"/>
<defs>
<linearGradient id="paint0_linear" x1="1537.61" y1="422.671" x2="638.55" y2="1002.32" gradientUnits="userSpaceOnUse">
<stop stop-color="#320D40"/>
<stop offset="1" stop-color="#0F1958" stop-opacity="0"/>
</linearGradient>
<linearGradient id="paint1_linear" x1="893.639" y1="156.643" x2="893.639" y2="933.104" gradientUnits="userSpaceOnUse">
<stop stop-color="#09103E"/>
<stop offset="1" stop-color="#0F1958" stop-opacity="0"/>
</linearGradient>
</defs>
</svg>
