<svg width="414" height="896" viewBox="0 0 414 896" fill="none" xmlns="http://www.w3.org/2000/svg">
<g clip-path="url(#clip0)">
<rect width="414" height="896" fill="white"/>
<g filter="url(#filter0_d)">
<path d="M-349.63 -22.7272C-347.258 -22.8514 -344.82 -22.8218 -342.322 -22.6433L615.27 -11.6489L414.647 644.829C415.087 649.236 385.545 593.294 310.972 543.579C193.896 465.529 -7.80331 508.983 -55.6032 327.673C-98.0317 166.737 -256.19 -16.4879 -342.322 -22.6433L-349.63 -22.7272Z" fill="#177AF3"/>
</g>
<g filter="url(#filter1_d)">
<path d="M267.791 164.166C104.794 139.272 21.567 79.2106 0.327806 52.2915L-4.85742 -33.311H416.711L432.784 290.277C441.285 319.931 440.846 348.734 436.714 369.394L432.784 290.277C417.405 236.63 372.764 180.199 267.791 164.166Z" fill="white"/>
</g>
<rect x="140.117" y="883" width="134" height="5" rx="2.5" fill="#E5E9F3"/>
</g>
<defs>
<filter id="filter0_d" x="-360.63" y="-33.8027" width="990.899" height="693.876" filterUnits="userSpaceOnUse" color-interpolation-filters="sRGB">
<feFlood flood-opacity="0" result="BackgroundImageFix"/>
<feColorMatrix in="SourceAlpha" type="matrix" values="0 0 0 0 0 0 0 0 0 0 0 0 0 0 0 0 0 0 127 0" result="hardAlpha"/>
<feOffset dx="2" dy="2"/>
<feGaussianBlur stdDeviation="6.5"/>
<feComposite in2="hardAlpha" operator="out"/>
<feColorMatrix type="matrix" values="0 0 0 0 0 0 0 0 0 0 0 0 0 0 0 0 0 0 0.06 0"/>
<feBlend mode="normal" in2="BackgroundImageFix" result="effect1_dropShadow"/>
<feBlend mode="normal" in="SourceGraphic" in2="effect1_dropShadow" result="shape"/>
</filter>
<filter id="filter1_d" x="-15.8574" y="-44.311" width="470.437" height="428.705" filterUnits="userSpaceOnUse" color-interpolation-filters="sRGB">
<feFlood flood-opacity="0" result="BackgroundImageFix"/>
<feColorMatrix in="SourceAlpha" type="matrix" values="0 0 0 0 0 0 0 0 0 0 0 0 0 0 0 0 0 0 127 0" result="hardAlpha"/>
<feOffset dx="2" dy="2"/>
<feGaussianBlur stdDeviation="6.5"/>
<feComposite in2="hardAlpha" operator="out"/>
<feColorMatrix type="matrix" values="0 0 0 0 0 0 0 0 0 0 0 0 0 0 0 0 0 0 0.06 0"/>
<feBlend mode="normal" in2="BackgroundImageFix" result="effect1_dropShadow"/>
<feBlend mode="normal" in="SourceGraphic" in2="effect1_dropShadow" result="shape"/>
</filter>
<clipPath id="clip0">
<rect width="414" height="896" fill="white"/>
</clipPath>
</defs>
</svg>
