<svg width="111" height="111" viewBox="0 0 111 111" xmlns="http://www.w3.org/2000/svg">
    <path fill-rule="evenodd" clip-rule="evenodd" d="M20.514 41L19.1279 44.799H38.2445L39.6306 41H20.514ZM18.4637 46.684L17.0776 50.483H36.1653L37.5514 46.684H18.4637ZM16.3846 52.397L15.0273 56.196H34.115L35.5011 52.397H16.3846Z" />
    <path fill-rule="evenodd" clip-rule="evenodd" d="M55.627 57.6175V57.7045C56.4933 58.0235 57.3307 58.5745 57.7639 58.9515C59.1211 60.0825 59.7275 61.5615 59.7275 63.5045C59.7275 66.6945 58.0526 68.9565 55.3093 69.6815C54.4719 69.9135 53.6056 70.0005 51.9885 70.0005H43.6719V46.7715H51.0066C52.5082 46.7715 53.5478 46.8585 54.4719 47.0905C57.1286 47.8155 58.8901 49.6715 58.8901 52.6005C58.8901 54.1665 58.3414 55.5005 57.4173 56.3705C57.0131 56.7765 56.4644 57.2695 55.627 57.6175ZM48.2633 60.0825V66.1725H51.4398C52.3927 66.1725 53.259 66.0855 53.8943 65.5055C54.5296 64.8965 54.7895 64.1425 54.7895 63.1275C54.7895 62.3735 54.5874 61.6485 54.212 61.1265C53.5478 60.2855 52.7104 60.0825 51.2954 60.0825H48.2633ZM48.2344 56.0515H50.8045C51.5842 56.0515 51.9885 56.0515 52.3927 55.9355C53.4612 55.6165 54.1542 54.6595 54.1542 53.3255C54.1542 51.7595 53.4612 51.0635 52.3927 50.7445C51.9596 50.6285 51.5264 50.5705 50.6312 50.5705H48.2056L48.2344 56.0515ZM66.6291 70.0005V50.6575H59.9874V46.7715H78.4109L77.0826 50.6575H71.2205V70.0005H66.6291ZM79.8548 70.0005V46.7715H94.7842L93.4847 50.6575H84.4173V55.7905H88.1136C91.0879 55.7905 92.6473 56.5155 93.7157 57.4435C94.5532 58.1685 95.9681 59.7635 95.9681 62.9535C95.9681 66.0855 94.4954 67.8255 93.2826 68.6955C91.8387 69.6815 90.366 69.9715 87.2762 69.9715H79.8548V70.0005ZM84.4173 66.1145H87.8826C89.1821 66.1145 89.9906 65.7955 90.5393 65.0705C90.828 64.7225 91.2034 64.0845 91.2034 62.8665C91.2034 61.6775 90.7992 60.8075 90.0195 60.1985C89.5575 59.8505 88.9222 59.6475 87.8248 59.6475H84.4173V66.1145Z"/>
</svg>
