<svg width="18" height="19" viewBox="0 0 18 19" fill="none" xmlns="http://www.w3.org/2000/svg">
<path d="M13.5355 5.92291C14.4082 5.92291 15.1182 5.21293 15.1182 4.34028C15.1182 3.46763 14.4082 2.75765 13.5355 2.75765C12.6629 2.75765 11.9529 3.46763 11.9529 4.34028C11.9529 5.21293 12.6628 5.92291 13.5355 5.92291ZM13.5355 3.81272C13.8264 3.81272 14.0631 4.0494 14.0631 4.34028C14.0631 4.63116 13.8264 4.86784 13.5355 4.86784C13.2446 4.86784 13.008 4.63116 13.008 4.34028C13.008 4.0494 13.2446 3.81272 13.5355 3.81272Z" fill="white"/>
<path d="M0.157354 17.154C0.170046 17.418 0.373848 17.6297 0.633793 17.6538C0.634743 17.6539 0.635656 17.6541 0.636641 17.6542L4.80337 18.0273C5.07161 18.0513 5.31496 17.8693 5.36773 17.6052L5.67159 16.0853L7.19213 15.781C7.40096 15.7392 7.56416 15.576 7.60592 15.3672L7.90995 13.8469L9.4298 13.5432C9.61317 13.5066 9.76343 13.3756 9.82474 13.199L10.4472 11.4067C12.4617 11.9839 14.6486 11.4339 16.1468 9.93579C18.4094 7.67323 18.4094 3.9917 16.1468 1.72914C15.0508 0.633076 13.5935 0.0294762 12.0435 0.0294762C8.83492 0.0294762 6.24049 2.63143 6.24049 5.83248C6.24049 6.44958 6.33646 7.05181 6.52075 7.6225L0.312534 13.7698C0.212444 13.8688 0.156158 14.0038 0.156158 14.1446V17.1288C0.156158 17.1373 0.156967 17.1456 0.157354 17.154ZM12.0435 1.08455C13.3117 1.08445 14.504 1.57832 15.4008 2.47509C17.252 4.32628 17.252 7.3384 15.4008 9.18963C14.4959 10.0945 13.2839 10.5763 12.0476 10.5763C11.4648 10.5763 10.8762 10.4691 10.3124 10.2485C10.0339 10.1396 9.72008 10.284 9.62189 10.5667L8.92706 12.5676L7.35825 12.8811C7.14938 12.9229 6.98608 13.0861 6.94432 13.295L6.64025 14.8153L5.11967 15.1196C4.91084 15.1614 4.74761 15.3247 4.70588 15.5335L4.42593 16.9341L1.86075 16.7045L8.68466 9.9373C8.89201 9.73164 8.89279 9.39621 8.68621 9.1897C5.71722 6.22071 7.81117 1.08455 12.0435 1.08455ZM1.21124 14.3646L6.97307 8.65937C7.14713 8.97043 7.35051 9.26676 7.58247 9.54446L1.21124 15.8626V14.3646Z" fill="white"/>
</svg>
