<svg width="50" height="50" viewBox="0 0 50 50" fill="none" xmlns="http://www.w3.org/2000/svg">
<rect width="50" height="50" fill="white"/>
<path d="M39.3 38.4H17.4C16.8 38.4 16.4 38 16.4 37.4C16.4 36.8 16.8 36.4 17.4 36.4H39.3C40.4 36.4 41.2 35.5 41.2 34.5C41.2 33.5 40.3 32.6 39.3 32.6H31.1C29.4 32.6 28.1 31.2 28.1 29.6C28.1 27.9 29.5 26.6 31.1 26.6H37.2C37.8 26.6 38.2 27 38.2 27.6C38.2 28.2 37.8 28.6 37.2 28.6H31.1C30.5 28.6 30.1 29.1 30.1 29.6C30.1 30.1 30.6 30.6 31.1 30.6H39.3C41.5 30.6 43.2 32.4 43.2 34.5C43.2 36.6 41.4 38.4 39.3 38.4Z" fill="black"/>
<path d="M37.1 28.9C36.6 28.9 36.1 28.6 35.8 28.2L31.9 22.2C31.6 21.7 31.5 21.3 31.3 20.9C31.1 20.3 31 19.7 31 19.1C31 15.7 33.7 13 37.1 13C40.5 13 43.2 15.7 43.2 19.1C43.2 19.7 43.1 20.3 42.9 20.9C42.8 21.4 42.6 21.8 42.3 22.2L42.1 22.4L38.4 28.1C38.2 28.7 37.7 28.9 37.1 28.9Z" fill="black"/>
<path d="M37.1 14.1C39.9 14.1 42.2 16.4 42.2 19.2C42.2 19.7 42.1 20.2 42 20.7C41.9 21.1 41.7 21.5 41.5 21.8L41.3 22L37.6 27.7C37.5 27.9 37.3 28 37.1 28C36.9 28 36.7 27.9 36.6 27.7L33 22.2L32.7 21.7C32.5 21.4 32.4 21 32.3 20.7C32.1 20.2 32.1 19.7 32.1 19.2C32 16.3 34.3 14.1 37.1 14.1ZM37.1 12.1C33.2 12.1 30 15.3 30 19.2C30 19.9 30.1 20.6 30.3 21.3C30.4 21.8 30.6 22.2 30.9 22.7C30.9 22.7 30.9 22.8 31 22.8L31.3 23.3L34.9 28.8C35.4 29.5 36.2 30 37.1 30C38 30 38.8 29.6 39.3 28.8L43 23.1L43.1 22.9C43.4 22.4 43.6 21.9 43.8 21.3C44 20.7 44.1 19.9 44.1 19.2C44.2 15.2 41 12.1 37.1 12.1Z" fill="white"/>
<path d="M17.4 40.4C16.7 40.4 16 40 15.6 39.4L8.2 28.1L7.5 27.1C7 26.3 6.7 25.5 6.5 24.7C6.2 23.7 6 22.5 6 21.4C6 15.1 11.1 10 17.4 10C23.7 10 28.8 15.1 28.8 21.4C28.8 22.6 28.6 23.7 28.3 24.8C28 25.7 27.7 26.5 27.2 27.3L26.9 27.8L19.3 39.4C18.8 40 18.1 40.4 17.4 40.4ZM17.4 16.8C15 16.8 13.1 18.7 13.1 21C13.1 21.4 13.2 21.9 13.3 22.2C13.4 22.5 13.5 22.8 13.7 23.1L14 23.6C14.8 24.7 16 25.3 17.4 25.3C18.8 25.3 20.1 24.6 20.9 23.4L21 23.2C21.2 22.9 21.3 22.6 21.4 22.3C21.5 21.9 21.6 21.5 21.6 21C21.6 18.7 19.7 16.8 17.4 16.8Z" fill="black"/>
<path d="M17.4 11C23.1 11 27.8 15.6 27.8 21.4C27.8 22.5 27.6 23.5 27.3 24.5C27.1 25.3 26.7 26.1 26.3 26.8L26 27.2L18.4 38.8C18.2 39.2 17.8 39.3 17.4 39.3C17 39.3 16.6 39.1 16.4 38.8L9.1 27.6V27.5L8.4 26.5C8 25.9 7.7 25.2 7.5 24.4C7.2 23.4 7 22.4 7 21.3C7 15.6 11.7 11 17.4 11ZM17.4 26.3C19.2 26.3 20.8 25.4 21.7 24L21.8 23.8C22 23.4 22.2 23 22.3 22.6C22.5 22.1 22.5 21.6 22.5 21C22.5 18.1 20.2 15.8 17.3 15.8C14.4 15.8 12.1 18.2 12.1 21C12.1 21.5 12.2 22.1 12.3 22.6C12.4 23 12.6 23.3 12.8 23.7L13.1 24.2C14.1 25.4 15.7 26.3 17.4 26.3ZM17.4 9C10.6 9 5 14.6 5 21.4C5 22.7 5.2 23.9 5.6 25.1C5.8 25.9 6.2 26.8 6.7 27.6C6.7 27.6 6.7 27.7 6.8 27.7L7.5 28.7V28.8L14.8 40C15.4 40.9 16.4 41.5 17.5 41.5C18.6 41.5 19.6 41 20.2 40L27.8 28.4L28.1 27.9C28.6 27 29 26.1 29.3 25.1C29.7 24 29.9 22.7 29.9 21.4C29.8 14.6 24.2 9 17.4 9ZM14.5 22.6C14.4 22.4 14.3 22.2 14.3 22C14.2 21.7 14.1 21.3 14.1 21C14.1 19.2 15.6 17.8 17.3 17.8C19.1 17.8 20.5 19.3 20.5 21C20.5 21.3 20.5 21.6 20.4 21.9C20.3 22.2 20.2 22.4 20.1 22.6L20 22.8C19.4 23.7 18.4 24.2 17.3 24.2C16.3 24.2 15.4 23.7 14.7 22.9L14.5 22.6Z" fill="white"/>
</svg>
