<svg width="60" height="60" viewBox="0 0 60 60" fill="none" xmlns="http://www.w3.org/2000/svg">
<g clip-path="url(#clip0)">
<path d="M20.4 17.3582C19.3554 17.3582 18.4413 16.8359 18.0496 15.9218C17.5273 15.1384 17.5273 14.0937 18.1802 13.1797L22.0975 6.9119C22.6199 6.12842 23.4033 5.60611 24.448 5.60611H42.3372C43.2513 5.60611 44.1653 6.12842 44.6877 6.9119L48.605 13.1797C49.1273 13.9632 49.1273 15.1384 48.7356 15.9218C48.2133 16.8359 47.2992 17.3582 46.3852 17.3582H20.4Z" fill="black"/>
<path d="M42.2066 6.91199C42.7289 6.91199 43.1207 7.17315 43.3818 7.56488L47.2992 13.8327C47.9521 14.7467 47.1686 16.0525 46.124 16.0525H20.4C19.2248 16.0525 18.5719 14.8773 19.2248 13.8327L23.1421 7.56488C23.4033 7.17315 23.795 6.91199 24.3173 6.91199H42.2066ZM42.2066 4.30042H24.4479C23.0115 4.30042 21.8363 4.95331 21.0529 6.12852L17.1355 12.3963C16.2214 13.7021 16.2214 15.269 16.8743 16.5748C17.5272 17.8806 18.9636 18.6641 20.4 18.6641H46.2545C47.6909 18.6641 49.1273 17.8806 49.7802 16.5748C50.4331 15.269 50.4331 13.7021 49.6496 12.5269L45.7322 6.2591C44.9488 5.08389 43.643 4.30042 42.2066 4.30042Z" fill="white"/>
<path d="M29.0182 33.9415C28.1041 33.9415 27.1901 33.4191 26.6677 32.6357L17.2661 17.4885C16.7437 16.5745 16.7437 15.5299 17.2661 14.6158L21.314 8.21744C21.8363 7.43397 22.6198 6.91165 23.6644 6.91165C24.7091 6.91165 25.4925 7.43397 26.0148 8.21744L38.4198 29.8935C38.9421 30.8076 38.9421 31.7216 38.4198 32.6357C37.8975 33.5497 36.9835 33.9415 36.0694 33.9415H29.0182Z" fill="black"/>
<path d="M23.5338 8.21762C24.0561 8.21762 24.4479 8.47878 24.709 8.87052L37.2446 30.416C37.7669 31.3301 37.114 32.5053 36.0694 32.5053H29.0181C28.4958 32.5053 28.1041 32.2441 27.8429 31.8524L18.3107 16.8358C18.0495 16.3135 18.0495 15.7912 18.3107 15.3995L22.3586 9.00109C22.6198 8.47878 23.1421 8.21762 23.5338 8.21762ZM23.5338 5.60605C22.0975 5.60605 20.9223 6.25894 20.1388 7.43415L16.0908 13.8325C15.3074 15.1383 15.3074 16.8358 16.0908 18.1416L25.4925 33.2887C26.276 34.464 27.4512 35.2474 28.8876 35.2474H35.9388C37.3752 35.2474 38.681 34.464 39.4644 33.2887C40.1173 31.983 40.1173 30.5466 39.4644 29.2408L26.9289 7.69531C26.276 6.38952 24.9702 5.60605 23.5338 5.60605Z" fill="white"/>
<path d="M30.5851 33.9417C29.5404 33.9417 28.757 33.4194 28.2347 32.6359C27.7123 31.7218 27.7123 30.8078 28.2347 29.8937L40.7702 8.34824C41.2925 7.43419 42.2066 7.04245 43.1206 7.04245C44.0347 7.04245 44.9487 7.56476 45.4711 8.34824L49.519 14.7466C50.0413 15.6607 50.0413 16.7053 49.519 17.6193L40.1173 32.7665C39.595 33.5499 38.8115 34.0723 37.7669 34.0723H30.5851V33.9417Z" fill="black"/>
<path d="M43.1207 8.21762C43.643 8.21762 44.0347 8.47878 44.2959 8.87052L48.3438 15.2689C48.605 15.7912 48.605 16.3135 48.3438 16.7052L38.9422 31.8524C38.681 32.2441 38.2893 32.5053 37.7669 32.5053H30.5851C29.5405 32.5053 28.757 31.3301 29.4099 30.416L41.9455 8.87052C42.2066 8.47878 42.5984 8.21762 43.1207 8.21762ZM43.1207 5.60605C41.6843 5.60605 40.3785 6.38952 39.595 7.56473L27.0595 29.1102C26.4066 30.416 26.276 31.8524 27.0595 33.1582C27.7124 34.4639 29.1488 35.1168 30.5851 35.1168H37.6364C39.0727 35.1168 40.3785 34.4639 41.0314 33.1582L50.4331 18.011C51.2166 16.7052 51.2166 15.0077 50.4331 13.7019L46.3851 7.30358C45.7323 6.38952 44.4265 5.60605 43.1207 5.60605Z" fill="white"/>
<path d="M33.3273 33.2888C33.1967 33.2888 33.0661 33.2888 32.9355 33.1582C32.6744 33.0277 32.5438 32.6359 32.6744 32.2442L45.2099 11.0904C45.3405 10.8293 45.7322 10.6987 46.124 10.8293C46.3851 10.9599 46.5157 11.3516 46.3851 11.7433L33.8496 32.8971C33.719 33.1582 33.5884 33.2888 33.3273 33.2888Z" fill="white"/>
<path d="M30.1933 28.1962C29.9322 28.1962 29.8016 28.0657 29.671 27.9351L20.1388 11.8739C20.0082 11.6127 20.0082 11.221 20.3999 10.9598C20.6611 10.8293 21.0528 10.8293 21.314 11.221L30.8462 27.1516C30.9768 27.4128 30.9768 27.8045 30.5851 28.0657C30.4545 28.1962 30.3239 28.1962 30.1933 28.1962Z" fill="white"/>
<path d="M32.9611 59.2203C42.3975 59.2203 50.0473 51.5705 50.0473 42.1341C50.0473 32.6977 42.3975 25.0479 32.9611 25.0479C23.5247 25.0479 15.8749 32.6977 15.8749 42.1341C15.8749 51.5705 23.5247 59.2203 32.9611 59.2203Z" fill="#F5A623"/>
<path d="M33.3272 25.9763C42.2066 25.9763 49.3884 33.1582 49.3884 42.0375C49.3884 50.9169 42.2066 58.0987 33.3272 58.0987C24.4479 58.0987 17.2661 51.0474 17.2661 42.1681C17.2661 33.2887 24.4479 25.9763 33.3272 25.9763ZM33.3272 23.3647C23.0115 23.3647 14.6545 31.7218 14.6545 42.0375C14.6545 52.3532 23.0115 60.7103 33.3272 60.7103C43.643 60.7103 52 52.3532 52 42.0375C52 31.7218 43.643 23.3647 33.3272 23.3647Z" fill="white"/>
<path d="M33.5884 33.8112L35.5471 39.8179C35.5471 39.9485 35.6777 40.079 35.8082 40.079H42.076C42.3372 40.079 42.4677 40.4708 42.2066 40.6013L37.114 44.2575C37.114 44.2575 37.114 44.3881 37.114 44.5187L39.0727 50.5253C39.2033 50.7865 38.8115 51.0476 38.5504 50.9171L33.4578 47.2609C33.3272 47.1303 33.1967 47.1303 33.0661 47.2609L27.9735 50.9171C27.7124 51.0476 27.4512 50.9171 27.4512 50.5253L29.4099 44.5187C29.4099 44.3881 29.4099 44.2575 29.2793 44.127L24.1867 40.4708C23.9256 40.3402 24.0561 39.9485 24.3173 39.9485H30.5851C30.7157 39.9485 30.8462 39.8179 30.8462 39.6873L32.8049 33.6807C33.0661 33.4195 33.5884 33.4195 33.5884 33.8112Z" fill="white"/>
</g>
<defs>
<clipPath id="clip0">
<rect width="60" height="60" fill="white"/>
</clipPath>
</defs>
</svg>
