<svg width="15" height="15" viewBox="0 0 15 15" fill="none" xmlns="http://www.w3.org/2000/svg">
<g clip-path="url(#clip0)">
<path d="M7.50066 15.0002C11.6426 15.0002 15.0003 11.6425 15.0003 7.50054C15.0003 3.35858 11.6426 0.000854492 7.50066 0.000854492C3.3587 0.000854492 0.000976562 3.35858 0.000976562 7.50054C0.000976562 11.6425 3.3587 15.0002 7.50066 15.0002Z" fill="white"/>
<path d="M14.5713 4.99927H9.95032C10.1511 6.60139 10.1522 8.3667 9.95421 9.97082H14.5812C14.8513 9.19694 14.9998 8.36588 14.9998 7.49997C14.9999 6.6227 14.848 5.78144 14.5713 4.99927Z" fill="#2B479D"/>
<path d="M9.95027 4.99934H14.5712C14.5705 4.99696 14.5697 4.99497 14.5688 4.99281C13.609 2.28634 11.1399 0.295086 8.17334 0.0307617C9.32146 0.660047 9.65681 2.6538 9.95027 4.99934Z" fill="#EFECEC"/>
<path d="M8.17358 14.9689C11.1455 14.7041 13.618 12.706 14.5741 9.99226C14.5766 9.98504 14.5787 9.97791 14.5813 9.97095H9.95428C9.66307 12.3292 9.32629 14.337 8.17358 14.9689Z" fill="#E63026"/>
<path d="M0 7.5001C0 8.36613 0.14874 9.19707 0.418605 9.97094H10.3403C10.5385 8.3667 10.5371 6.60152 10.3366 4.99939H0.42858C0.151938 5.7816 0 6.62286 0 7.5001Z" fill="#3757A6"/>
<path d="M0.430964 4.99283C0.430267 4.99495 0.429539 4.99698 0.428589 4.99936H10.3366C10.043 2.65378 9.32152 0.660066 8.17356 0.0307803C7.95152 0.0111151 7.727 3.60935e-10 7.49988 3.60935e-10C4.23727 -3.16666e-05 1.46277 2.08369 0.430964 4.99283Z" fill="#EFEFEF"/>
<path d="M10.3402 9.97095H0.418579C0.421081 9.97795 0.423424 9.98504 0.425799 9.99226C1.45349 12.9088 4.23198 14.9999 7.49981 14.9999C7.72696 14.9999 7.95148 14.9888 8.1735 14.9689C9.32633 14.337 10.049 12.3292 10.3402 9.97095Z" fill="#E73B36"/>
</g>
<defs>
<clipPath id="clip0">
<rect width="15" height="15" fill="white"/>
</clipPath>
</defs>
</svg>
