<svg width="44" height="37" viewBox="0 0 44 37" fill="none" xmlns="http://www.w3.org/2000/svg">
<path d="M14.7418 32.0002H6.19718C4.97653 32.0002 4 31.0237 4 29.803V14.4228C4 13.2021 4.97653 12.2256 6.19718 12.2256H14.7418C15.9624 12.2256 16.939 13.2021 16.939 14.4228V29.681C16.939 31.0237 15.9624 32.0002 14.7418 32.0002Z" fill="black" stroke="white" stroke-width="2" stroke-miterlimit="10"/>
<path d="M38.1784 31.9999H30.2442C28.9014 31.9999 27.6808 30.9013 27.6808 29.4365V18.9389C27.6808 17.5962 28.7794 16.3755 30.2442 16.3755H38.1784C39.5212 16.3755 40.7418 17.4741 40.7418 18.9389V29.4365C40.6198 30.9013 39.5212 31.9999 38.1784 31.9999Z" fill="black" stroke="white" stroke-width="2" stroke-miterlimit="10"/>
<path d="M26.3381 32H17.6714C16.4507 32 15.4742 31.0235 15.4742 29.8028V8.19719C15.4742 6.97653 16.4507 6 17.6714 6H26.3381C27.5587 6 28.5352 6.97653 28.5352 8.19719V29.8028C28.5352 31.0235 27.5587 32 26.3381 32Z" fill="black" stroke="white" stroke-width="2" stroke-miterlimit="10"/>
<path d="M20.2347 11.3708V9.29565H23.7746V17.5961H21.4554V11.3708H20.2347Z" fill="white"/>
<path d="M8.51638 20.1595C9.00464 19.7933 9.37084 19.305 9.73704 18.8167C10.1032 18.3285 10.2253 17.9623 10.2253 17.5961C10.2253 17.3519 10.2253 17.1078 10.1032 16.9858C9.98117 16.8637 9.8591 16.7416 9.61497 16.7416C9.37084 16.7416 9.24877 16.8637 9.12671 16.9858C9.00464 17.2299 9.00464 17.474 9.00464 17.8402H6.68539C6.68539 17.1078 6.80746 16.6196 7.17366 16.1313C7.53985 15.643 7.78399 15.3989 8.27225 15.1548C8.76051 14.9106 9.24877 14.7886 9.73704 14.7886C10.7136 14.7886 11.3239 15.0327 11.8122 15.521C12.1784 16.1313 12.4225 16.7416 12.4225 17.474C12.4225 18.2064 12.1784 18.9388 11.6901 19.6712C11.2018 20.4036 10.4694 21.0139 9.73704 21.5022H12.5445V23.3332H6.68539V21.6243C7.41779 21.136 8.02812 20.6477 8.51638 20.1595Z" fill="white"/>
<path d="M32.5634 19.7934C33.0516 19.3052 33.784 19.061 34.6385 19.061C35.2488 19.061 35.7371 19.1831 36.1033 19.3052C36.4695 19.5493 36.8357 19.7934 37.0798 20.1596C37.3239 20.5258 37.446 20.892 37.446 21.3803C37.446 21.8685 37.3239 22.3568 37.0798 22.6009C36.8357 22.9671 36.5916 23.0892 36.2254 23.2113C37.2019 23.5775 37.5681 24.1878 37.5681 25.1643C37.5681 25.6526 37.446 26.0188 37.2019 26.385C36.9577 26.7512 36.7136 26.9953 36.2254 27.2394C35.8592 27.4836 35.3709 27.6056 34.7606 27.6056C33.784 27.6056 33.0516 27.3615 32.5634 26.8732C32.0751 26.385 31.7089 25.7746 31.7089 24.7981H33.9061C33.9061 25.0423 33.9061 25.2864 34.1502 25.5305C34.2723 25.6526 34.5164 25.7746 34.7606 25.7746C35.0047 25.7746 35.1268 25.6526 35.2488 25.5305C35.3709 25.4084 35.493 25.1643 35.493 25.0423C35.493 24.7981 35.3709 24.554 35.2488 24.4319C35.0047 24.3099 34.7606 24.1878 34.3944 24.1878H34.0282V22.3568H34.3944C34.6385 22.3568 34.8826 22.3568 35.1268 22.2347C35.3709 22.1127 35.3709 21.8685 35.3709 21.6244C35.3709 21.3803 35.3709 21.2582 35.2488 21.1361C35.1268 21.0141 35.0047 21.0141 34.7606 21.0141C34.5164 21.0141 34.3944 21.1361 34.2723 21.2582C34.1502 21.3803 34.1502 21.6244 34.1502 21.8685H31.9531C31.831 21.0141 32.0751 20.2817 32.5634 19.7934Z" fill="white"/>
</svg>
