<svg width="67" height="75" viewBox="0 0 67 75" fill="none" xmlns="http://www.w3.org/2000/svg">
<path d="M64.5 33.1699C67.8333 35.0944 67.8333 39.9056 64.5 41.8301L8.24999 74.3061C4.91666 76.2306 0.749996 73.825 0.749997 69.9759L0.749999 5.02404C0.75 1.17504 4.91666 -1.23058 8.25 0.693916L64.5 33.1699Z" fill="white"/>
</svg>
