<svg width="48" height="46" viewBox="0 0 48 46" fill="none" xmlns="http://www.w3.org/2000/svg">
<path d="M40.625 6.48753V6.73753H40.875H47.75V45.625H0.25V6.73753H7.125H7.375V6.48753V1.125H15.3125V6.48753V6.73753H15.5625H32.4375H32.6875V6.48753V1.125H40.625V6.48753ZM35.25 3.4375H35V3.6875V10.697V10.947H35.25H38.0625H38.3125V10.697V3.6875V3.4375H38.0625H35.25ZM9.9375 3.4375H9.6875V3.6875V10.697V10.947H9.9375H12.75H13V10.697V3.6875V3.4375H12.75H9.9375ZM45.1875 43.3125H45.4375V43.0625V9.30003V9.05003H45.1875H40.875H40.625V9.30003V13.2594H32.6875V9.30003V9.05003H32.4375H15.5625H15.3125V9.30003V13.2594H7.375V9.30003V9.05003H7.125H2.8125H2.5625V9.30003V43.0625V43.3125H2.8125H45.1875Z" fill="white" stroke="#FF9700" stroke-width="0.5"/>
<path d="M9.84375 20.2751H9.59375V20.5251V23.3251V23.5751H9.84375H12.6562H12.9062V23.3251V20.5251V20.2751H12.6562H9.84375ZM15.2188 17.9626V25.8876H7.28125V17.9626H15.2188Z" fill="white" stroke="#FF9700" stroke-width="0.5"/>
<path d="M22.5 20.2751H22.25V20.5251V23.3251V23.5751H22.5H25.3125H25.5625V23.3251V20.5251V20.2751H25.3125H22.5ZM27.875 17.9626V25.8876H19.9375V17.9626H27.875Z" fill="white" stroke="#FF9700" stroke-width="0.5"/>
<path d="M35.1562 20.2751H34.9062V20.5251V23.3251V23.5751H35.1562H37.9688H38.2188V23.3251V20.5251V20.2751H37.9688H35.1562ZM40.5312 17.9626V25.8876H32.5938V17.9626H40.5312Z" fill="white" stroke="#FF9700" stroke-width="0.5"/>
<path d="M9.84375 32.9033H9.59375V33.1533V35.9533V36.2033H9.84375H12.6562H12.9062V35.9533V33.1533V32.9033H12.6562H9.84375ZM15.2188 30.5908V38.5158H7.28125V30.5908H15.2188Z" fill="white" stroke="#FF9700" stroke-width="0.5"/>
<path d="M22.5 32.9033H22.25V33.1533V35.9533V36.2033H22.5H25.3125H25.5625V35.9533V33.1533V32.9033H25.3125H22.5ZM27.875 30.5908V38.5158H19.9375V30.5908H27.875Z" fill="white" stroke="#FF9700" stroke-width="0.5"/>
<path d="M35.1562 32.9033H34.9062V33.1533V35.9533V36.2033H35.1562H37.9688H38.2188V35.9533V33.1533V32.9033H37.9688H35.1562ZM40.5312 30.5908V38.5158H32.5938V30.5908H40.5312Z" fill="white" stroke="#FF9700" stroke-width="0.5"/>
</svg>
