<svg width="14" height="25" viewBox="0 0 14 25" fill="none" xmlns="http://www.w3.org/2000/svg">
<path d="M13.218 0.470703H10.0741C6.52917 0.470703 4.25031 2.84038 4.25031 6.51232V9.30897H1.08523C0.81092 9.30897 0.599915 9.54381 0.599915 9.79999V13.8348C0.599915 14.1124 0.832021 14.3259 1.08523 14.3259H4.25031V24.5091C4.25031 24.7866 4.46132 25.0001 4.73562 25.0001H8.87133C9.14564 25.0001 9.35665 24.7653 9.35665 24.5091V14.3259H13.0492C13.3236 14.3259 13.5346 14.1124 13.5346 13.8348V9.79999C13.5346 9.6719 13.4924 9.54381 13.3869 9.43706C13.3025 9.35167 13.1758 9.28762 13.0281 9.28762H9.33555V6.91794C9.33555 5.78647 9.60985 5.21006 11.0658 5.21006H13.1969C13.4713 5.21006 13.6823 4.97523 13.6823 4.71905V0.961718C13.7034 0.705536 13.4924 0.470703 13.218 0.470703Z" fill="white"/>
</svg>
