<svg width="30" height="30" viewBox="0 0 30 30" fill="none" xmlns="http://www.w3.org/2000/svg">
<path fill-rule="evenodd" clip-rule="evenodd" d="M0 15C0 6.71573 6.71573 0 15 0C23.2843 0 30 6.71573 30 15C30 23.2843 23.2843 30 15 30C6.71573 30 0 23.2843 0 15Z" fill="#3368CC"/>
<path fill-rule="evenodd" clip-rule="evenodd" d="M16.5635 23.8197V15.6589H18.8162L19.1147 12.8466H16.5635L16.5673 11.4391C16.5673 10.7056 16.637 10.3126 17.6905 10.3126H19.0988V7.5H16.8457C14.1395 7.5 13.1869 8.86425 13.1869 11.1585V12.8469H11.5V15.6592H13.1869V23.8197H16.5635Z" fill="white"/>
</svg>
