<svg width="95" height="95" viewBox="0 0 95 95" fill="none" xmlns="http://www.w3.org/2000/svg">
<mask id="path-1-inside-1" fill="white">
<path d="M2.59356 9.70632C4.52817 7.46264 4.82967 6.06341 4.94805 1.979C5.06642 6.06341 5.36793 7.46264 7.30254 9.70632C7.64083 10.0987 7.64083 10.6823 7.30254 11.0746C5.36793 13.3183 5.06642 14.7175 4.94805 18.8019C4.82967 14.7175 4.52817 13.3183 2.59356 11.0746C2.25527 10.6823 2.25527 10.0987 2.59356 9.70632Z"/>
<path d="M13.4132 17.6344C14.1655 16.6126 14.2952 15.8222 14.3491 13.854C14.403 15.8222 14.5327 16.6126 15.285 17.6344C15.5794 18.0343 15.5794 18.58 15.285 18.9798C14.5327 20.0016 14.403 20.7921 14.3491 22.7603C14.2952 20.7921 14.1655 20.0016 13.4132 18.9798C13.1188 18.58 13.1188 18.0343 13.4132 17.6344Z"/>
<path d="M69.8195 84.9261C70.5717 83.9043 70.7015 83.1138 70.7553 81.1457C70.8092 83.1138 70.9389 83.9043 71.6912 84.9261C71.9856 85.3259 71.9856 85.8717 71.6912 86.2715C70.9389 87.2933 70.8092 88.0837 70.7553 90.0519C70.7015 88.0837 70.5717 87.2933 69.8195 86.2715C69.5251 85.8717 69.5251 85.3259 69.8195 84.9261Z"/>
<path d="M79.727 69.1022C81.2959 67.157 81.5431 65.9112 81.6408 62.3436C81.7384 65.9112 81.9856 67.157 83.5545 69.1022C83.8662 69.4887 83.8662 70.0422 83.5545 70.4287C81.9856 72.3739 81.7384 73.6197 81.6408 77.1873C81.5431 73.6197 81.2959 72.3739 79.727 70.4287C79.4153 70.0422 79.4153 69.4887 79.727 69.1022Z"/>
<path d="M66.143 59.7718H72.9404C73.6287 59.7718 74.1868 59.2061 74.1868 58.5083V52.4008H64.5241V58.5083C64.5241 59.2061 65.4546 59.7718 66.143 59.7718Z"/>
<path d="M73.2965 31.4315H65.2364C64.843 31.4315 64.5241 31.7548 64.5241 32.1536V36.4259H74.1868V32.3341C74.1868 31.8356 73.7882 31.4315 73.2965 31.4315Z"/>
<path d="M76.6346 49.9192V38.9075C76.6346 37.5369 75.5387 36.4259 74.1868 36.4259H64.5241C63.0757 36.4259 61.9014 37.6163 61.9014 39.0847V49.742C61.9014 51.2104 63.0757 52.4008 64.5241 52.4008H74.1868C75.5387 52.4008 76.6346 51.2898 76.6346 49.9192Z"/>
</mask>
<path d="M2.59356 9.70632C4.52817 7.46264 4.82967 6.06341 4.94805 1.979C5.06642 6.06341 5.36793 7.46264 7.30254 9.70632C7.64083 10.0987 7.64083 10.6823 7.30254 11.0746C5.36793 13.3183 5.06642 14.7175 4.94805 18.8019C4.82967 14.7175 4.52817 13.3183 2.59356 11.0746C2.25527 10.6823 2.25527 10.0987 2.59356 9.70632Z" fill="#3064C0"/>
<path d="M13.4132 17.6344C14.1655 16.6126 14.2952 15.8222 14.3491 13.854C14.403 15.8222 14.5327 16.6126 15.285 17.6344C15.5794 18.0343 15.5794 18.58 15.285 18.9798C14.5327 20.0016 14.403 20.7921 14.3491 22.7603C14.2952 20.7921 14.1655 20.0016 13.4132 18.9798C13.1188 18.58 13.1188 18.0343 13.4132 17.6344Z" fill="#3064C0"/>
<path d="M69.8195 84.9261C70.5717 83.9043 70.7015 83.1138 70.7553 81.1457C70.8092 83.1138 70.9389 83.9043 71.6912 84.9261C71.9856 85.3259 71.9856 85.8717 71.6912 86.2715C70.9389 87.2933 70.8092 88.0837 70.7553 90.0519C70.7015 88.0837 70.5717 87.2933 69.8195 86.2715C69.5251 85.8717 69.5251 85.3259 69.8195 84.9261Z" fill="#3064C0"/>
<path d="M79.727 69.1022C81.2959 67.157 81.5431 65.9112 81.6408 62.3436C81.7384 65.9112 81.9856 67.157 83.5545 69.1022C83.8662 69.4887 83.8662 70.0422 83.5545 70.4287C81.9856 72.3739 81.7384 73.6197 81.6408 77.1873C81.5431 73.6197 81.2959 72.3739 79.727 70.4287C79.4153 70.0422 79.4153 69.4887 79.727 69.1022Z" fill="#3064C0"/>
<path d="M66.143 59.7718H72.9404C73.6287 59.7718 74.1868 59.2061 74.1868 58.5083V52.4008H64.5241V58.5083C64.5241 59.2061 65.4546 59.7718 66.143 59.7718Z" fill="#3064C0"/>
<path d="M73.2965 31.4315H65.2364C64.843 31.4315 64.5241 31.7548 64.5241 32.1536V36.4259H74.1868V32.3341C74.1868 31.8356 73.7882 31.4315 73.2965 31.4315Z" fill="#3064C0"/>
<path d="M76.6346 49.9192V38.9075C76.6346 37.5369 75.5387 36.4259 74.1868 36.4259H64.5241C63.0757 36.4259 61.9014 37.6163 61.9014 39.0847V49.742C61.9014 51.2104 63.0757 52.4008 64.5241 52.4008H74.1868C75.5387 52.4008 76.6346 51.2898 76.6346 49.9192Z" fill="#3064C0"/>
<path d="M64.5241 35.9259C64.248 35.9259 64.0241 36.1497 64.0241 36.4259C64.0241 36.702 64.248 36.9259 64.5241 36.9259V35.9259ZM74.1868 36.9259C74.4629 36.9259 74.6868 36.702 74.6868 36.4259C74.6868 36.1497 74.4629 35.9259 74.1868 35.9259V36.9259ZM74.1868 52.9008C74.4629 52.9008 74.6868 52.677 74.6868 52.4008C74.6868 52.1247 74.4629 51.9008 74.1868 51.9008V52.9008ZM64.5241 51.9008C64.248 51.9008 64.0241 52.1247 64.0241 52.4008C64.0241 52.677 64.248 52.9008 64.5241 52.9008V51.9008ZM65.1177 25.3254C65.2265 25.5792 65.5204 25.6968 65.7742 25.588C66.0281 25.4792 66.1456 25.1853 66.0369 24.9314L65.1177 25.3254ZM59.7183 10.1882C59.6096 9.93443 59.3156 9.81685 59.0618 9.92563C58.808 10.0344 58.6904 10.3283 58.7992 10.5822L59.7183 10.1882ZM69.3322 22.8204C69.2207 23.0731 69.3352 23.3682 69.5878 23.4797C69.8404 23.5912 70.1356 23.4767 70.2471 23.2241L69.3322 22.8204ZM78.1452 5.32159C78.2567 5.06895 78.1422 4.77378 77.8896 4.66232C77.6369 4.55085 77.3418 4.66531 77.2303 4.91795L78.1452 5.32159ZM66.0245 63.2631C66.148 63.0161 66.0479 62.7158 65.8009 62.5923C65.5539 62.4688 65.2536 62.5689 65.1301 62.8159L66.0245 63.2631ZM54.5992 83.8776C54.4757 84.1246 54.5758 84.4249 54.8228 84.5484C55.0698 84.6719 55.3701 84.5718 55.4936 84.3248L54.5992 83.8776ZM70.268 62.8939C70.1876 62.6297 69.9082 62.4808 69.644 62.5612C69.3799 62.6416 69.2309 62.9209 69.3113 63.1851L70.268 62.8939ZM72.9971 75.2956C73.0775 75.5598 73.3568 75.7087 73.621 75.6283C73.8852 75.5479 74.0342 75.2686 73.9538 75.0044L72.9971 75.2956ZM64.5241 36.9259H74.1868V35.9259H64.5241V36.9259ZM74.1868 51.9008H64.5241V52.9008H74.1868V51.9008ZM66.0369 24.9314L59.7183 10.1882L58.7992 10.5822L65.1177 25.3254L66.0369 24.9314ZM70.2471 23.2241L78.1452 5.32159L77.2303 4.91795L69.3322 22.8204L70.2471 23.2241ZM65.1301 62.8159L54.5992 83.8776L55.4936 84.3248L66.0245 63.2631L65.1301 62.8159ZM69.3113 63.1851L72.9971 75.2956L73.9538 75.0044L70.268 62.8939L69.3113 63.1851ZM4.94805 1.979L5.94763 1.95003C5.93196 1.40926 5.48905 0.979004 4.94805 0.979004C4.40704 0.979004 3.96414 1.40926 3.94847 1.95003L4.94805 1.979ZM2.59356 9.70632L1.83622 9.0533L1.83622 9.05331L2.59356 9.70632ZM7.30254 9.70632L8.05988 9.05331L8.05988 9.0533L7.30254 9.70632ZM4.94805 18.8019L3.94847 18.8309C3.96414 19.3717 4.40704 19.8019 4.94805 19.8019C5.48905 19.8019 5.93196 19.3717 5.94763 18.8309L4.94805 18.8019ZM2.59356 11.0746L1.83622 11.7276H1.83622L2.59356 11.0746ZM7.30254 11.0746L8.05988 11.7276L8.05988 11.7276L7.30254 11.0746ZM14.3491 13.854L15.3487 13.8266C15.3339 13.2852 14.8907 12.854 14.3491 12.854C13.8075 12.854 13.3643 13.2852 13.3495 13.8266L14.3491 13.854ZM13.4132 17.6344L12.6079 17.0415L13.4132 17.6344ZM15.285 17.6344L16.0903 17.0415L15.285 17.6344ZM14.3491 22.7603L13.3495 22.7876C13.3643 23.329 13.8075 23.7603 14.3491 23.7603C14.8907 23.7603 15.3339 23.329 15.3487 22.7876L14.3491 22.7603ZM13.4132 18.9798L14.2185 18.387H14.2185L13.4132 18.9798ZM15.285 18.9798L14.4797 18.387L15.285 18.9798ZM70.7553 81.1457L71.755 81.1183C71.7402 80.5769 71.297 80.1457 70.7553 80.1457C70.2137 80.1457 69.7705 80.5769 69.7557 81.1183L70.7553 81.1457ZM69.8195 84.9261L69.0142 84.3332L69.8195 84.9261ZM71.6912 84.9261L72.4965 84.3332L71.6912 84.9261ZM70.7553 90.0519L69.7557 90.0793C69.7705 90.6207 70.2137 91.0519 70.7553 91.0519C71.297 91.0519 71.7402 90.6207 71.755 90.0793L70.7553 90.0519ZM69.8195 86.2715L70.6247 85.6786L69.8195 86.2715ZM71.6912 86.2715L70.8859 85.6786L71.6912 86.2715ZM81.6408 62.3436L82.6404 62.3162C82.6256 61.7748 82.1824 61.3436 81.6408 61.3436C81.0991 61.3436 80.656 61.7748 80.6411 62.3162L81.6408 62.3436ZM79.727 69.1022L78.9486 68.4744L79.727 69.1022ZM83.5545 69.1022L82.7761 69.73L83.5545 69.1022ZM81.6408 77.1873L80.6411 77.2147C80.656 77.7561 81.0991 78.1873 81.6408 78.1873C82.1824 78.1873 82.6256 77.7561 82.6404 77.2147L81.6408 77.1873ZM79.727 70.4287L78.9486 71.0565L79.727 70.4287ZM83.5545 70.4287L84.3329 71.0565H84.3329L83.5545 70.4287ZM64.5241 36.4259V37.4259H65.5241V36.4259H64.5241ZM74.1868 36.4259H73.1868V37.4259H74.1868V36.4259ZM74.1868 52.4008V51.4008H73.1868V52.4008H74.1868ZM64.5241 52.4008H65.5241V51.4008H64.5241V52.4008ZM3.94847 1.95003C3.88914 3.99712 3.78382 5.24982 3.49172 6.25351C3.2127 7.21229 2.74575 7.99847 1.83622 9.0533L3.3509 10.3593C4.37598 9.17049 5.02709 8.13521 5.41206 6.81236C5.78397 5.53441 5.88858 4.04529 5.94763 2.00797L3.94847 1.95003ZM3.94847 2.00797C4.00751 4.04529 4.11213 5.53441 4.48404 6.81236C4.86901 8.13521 5.52011 9.17049 6.54519 10.3593L8.05988 9.0533C7.15035 7.99847 6.6834 7.21229 6.40437 6.25351C6.11228 5.24982 6.00696 3.99712 5.94763 1.95003L3.94847 2.00797ZM5.94763 18.7729C5.88858 16.7356 5.78397 15.2465 5.41206 13.9686C5.02709 12.6457 4.37598 11.6104 3.3509 10.4216L1.83622 11.7276C2.74575 12.7825 3.2127 13.5686 3.49172 14.5274C3.78382 15.5311 3.88914 16.7838 3.94847 18.8309L5.94763 18.7729ZM5.94763 18.8309C6.00696 16.7838 6.11228 15.5311 6.40437 14.5274C6.6834 13.5686 7.15035 12.7825 8.05988 11.7276L6.54519 10.4216C5.52011 11.6104 4.86901 12.6457 4.48404 13.9686C4.11213 15.2465 4.00751 16.7356 3.94847 18.7729L5.94763 18.8309ZM6.54519 10.3593C6.55203 10.3673 6.55625 10.3772 6.55625 10.3905C6.55625 10.4037 6.55203 10.4137 6.54519 10.4216L8.05988 11.7276C8.72171 10.9601 8.72171 9.82087 8.05988 9.05331L6.54519 10.3593ZM1.83622 9.05331C1.17439 9.82087 1.17439 10.9601 1.83622 11.7276L3.35091 10.4216C3.34407 10.4137 3.33984 10.4037 3.33984 10.3905C3.33984 10.3772 3.34407 10.3673 3.3509 10.3593L1.83622 9.05331ZM13.3495 13.8266C13.3225 14.8125 13.2769 15.4101 13.1692 15.872C13.0709 16.2933 12.9153 16.624 12.6079 17.0415L14.2185 18.2273C14.6634 17.623 14.9487 17.0476 15.1169 16.3261C15.2756 15.6454 15.3218 14.8637 15.3487 13.8814L13.3495 13.8266ZM13.3495 13.8814C13.3764 14.8637 13.4225 15.6454 13.5812 16.3261C13.7494 17.0476 14.0348 17.623 14.4797 18.2273L16.0903 17.0415C15.7829 16.624 15.6272 16.2933 15.529 15.872C15.4213 15.4101 15.3757 14.8125 15.3487 13.8266L13.3495 13.8814ZM15.3487 22.7329C15.3218 21.7505 15.2756 20.9689 15.1169 20.2881C14.9487 19.5667 14.6634 18.9912 14.2185 18.387L12.6079 19.5727C12.9153 19.9903 13.0709 20.3209 13.1692 20.7422C13.2769 21.2042 13.3225 21.8018 13.3495 22.7876L15.3487 22.7329ZM15.3487 22.7876C15.3757 21.8018 15.4213 21.2042 15.529 20.7422C15.6272 20.3209 15.7829 19.9903 16.0903 19.5727L14.4797 18.387C14.0348 18.9912 13.7494 19.5667 13.5812 20.2881C13.4225 20.9689 13.3764 21.7505 13.3495 22.7329L15.3487 22.7876ZM14.4797 18.2273C14.5145 18.2745 14.5145 18.3397 14.4797 18.387L16.0903 19.5727C16.6443 18.8203 16.6443 17.794 16.0903 17.0415L14.4797 18.2273ZM12.6079 17.0415C12.0539 17.794 12.0539 18.8203 12.6079 19.5727L14.2185 18.387C14.1837 18.3397 14.1837 18.2745 14.2185 18.2273L12.6079 17.0415ZM69.7557 81.1183C69.7287 82.1041 69.6831 82.7017 69.5754 83.1637C69.4772 83.585 69.3216 83.9156 69.0142 84.3332L70.6247 85.5189C71.0696 84.9147 71.355 84.3392 71.5232 83.6178C71.6819 82.9371 71.7281 82.1554 71.755 81.173L69.7557 81.1183ZM69.7557 81.173C69.7826 82.1554 69.8288 82.9371 69.9875 83.6178C70.1557 84.3392 70.4411 84.9147 70.8859 85.5189L72.4965 84.3332C72.1891 83.9156 72.0335 83.585 71.9353 83.1637C71.8276 82.7017 71.782 82.1041 71.755 81.1183L69.7557 81.173ZM71.755 90.0246C71.7281 89.0422 71.6819 88.2605 71.5232 87.5798C71.355 86.8584 71.0696 86.2829 70.6247 85.6786L69.0142 86.8644C69.3216 87.2819 69.4772 87.6126 69.5754 88.0339C69.6831 88.4958 69.7287 89.0935 69.7557 90.0793L71.755 90.0246ZM71.755 90.0793C71.782 89.0935 71.8276 88.4958 71.9353 88.0339C72.0335 87.6126 72.1891 87.2819 72.4965 86.8644L70.8859 85.6786C70.4411 86.2829 70.1557 86.8583 69.9875 87.5798C69.8288 88.2605 69.7826 89.0422 69.7557 90.0246L71.755 90.0793ZM70.8859 85.5189C70.9207 85.5662 70.9207 85.6314 70.8859 85.6786L72.4965 86.8644C73.0505 86.1119 73.0505 85.0856 72.4965 84.3332L70.8859 85.5189ZM69.0142 84.3332C68.4602 85.0856 68.4602 86.1119 69.0142 86.8644L70.6247 85.6786C70.59 85.6314 70.59 85.5662 70.6247 85.5189L69.0142 84.3332ZM80.6411 62.3162C80.5922 64.1046 80.5057 65.1982 80.2702 66.0706C80.0466 66.8987 79.675 67.5738 78.9486 68.4744L80.5054 69.73C81.3479 68.6854 81.8843 67.765 82.201 66.5919C82.5057 65.4632 82.5917 64.1502 82.6404 62.3709L80.6411 62.3162ZM80.6411 62.3709C80.6898 64.1502 80.7758 65.4632 81.0805 66.5919C81.3972 67.765 81.9336 68.6854 82.7761 69.73L84.3329 68.4744C83.6065 67.5738 83.2349 66.8987 83.0114 66.0706C82.7758 65.1982 82.6893 64.1046 82.6404 62.3162L80.6411 62.3709ZM82.6404 77.16C82.5917 75.3807 82.5057 74.0677 82.201 72.939C81.8843 71.7659 81.3479 70.8456 80.5054 69.8009L78.9486 71.0565C79.675 71.9571 80.0466 72.6322 80.2702 73.4603C80.5057 74.3327 80.5922 75.4263 80.6411 77.2147L82.6404 77.16ZM82.6404 77.2147C82.6893 75.4263 82.7758 74.3327 83.0114 73.4603C83.2349 72.6322 83.6065 71.9571 84.3329 71.0565L82.7761 69.8009C81.9336 70.8456 81.3972 71.7659 81.0805 72.939C80.7758 74.0677 80.6898 75.3807 80.6411 77.16L82.6404 77.2147ZM82.7761 69.73C82.7924 69.7501 82.7924 69.7808 82.7761 69.8009L84.3329 71.0565C84.9401 70.3036 84.9401 69.2273 84.3329 68.4744L82.7761 69.73ZM78.9486 68.4744C78.3414 69.2273 78.3414 70.3036 78.9486 71.0565L80.5054 69.8009C80.4891 69.7808 80.4891 69.7501 80.5054 69.73L78.9486 68.4744ZM75.6346 38.9075V49.9192H77.6346V38.9075H75.6346ZM62.9014 49.742V39.0847H60.9014V49.742H62.9014ZM65.2364 32.4315H73.2965V30.4315H65.2364V32.4315ZM66.143 60.7718H72.9404V58.7718H66.143V60.7718ZM73.1868 32.3341V36.4259H75.1868V32.3341H73.1868ZM75.1868 58.5083V52.4008H73.1868V58.5083H75.1868ZM63.5241 52.4008V58.5083H65.5241V52.4008H63.5241ZM65.5241 36.4259V32.1536H63.5241V36.4259H65.5241ZM75.6346 49.9192C75.6346 50.7505 74.9735 51.4008 74.1868 51.4008V53.4008C76.1038 53.4008 77.6346 51.8291 77.6346 49.9192H75.6346ZM60.9014 49.742C60.9014 51.7498 62.5105 53.4008 64.5241 53.4008V51.4008C63.6408 51.4008 62.9014 50.6711 62.9014 49.742H60.9014ZM77.6346 38.9075C77.6346 36.9976 76.1038 35.4259 74.1868 35.4259V37.4259C74.9735 37.4259 75.6346 38.0763 75.6346 38.9075H77.6346ZM62.9014 39.0847C62.9014 38.1556 63.6408 37.4259 64.5241 37.4259V35.4259C62.5105 35.4259 60.9014 37.077 60.9014 39.0847H62.9014ZM66.143 58.7718C66.1021 58.7718 66.0264 58.7622 65.9278 58.7279C65.8313 58.6944 65.7368 58.6455 65.6584 58.5893C65.5783 58.5318 65.5361 58.4819 65.5194 58.4562C65.5049 58.4337 65.5241 58.4535 65.5241 58.5083H63.5241C63.5241 59.3155 64.0467 59.8944 64.4924 60.2142C64.9537 60.5452 65.5583 60.7718 66.143 60.7718V58.7718ZM73.2965 32.4315C73.223 32.4315 73.1868 32.3749 73.1868 32.3341H75.1868C75.1868 31.2963 74.3533 30.4315 73.2965 30.4315V32.4315ZM72.9404 60.7718C74.1939 60.7718 75.1868 59.7455 75.1868 58.5083H73.1868C73.1868 58.6668 73.0636 58.7718 72.9404 58.7718V60.7718ZM65.2364 30.4315C64.2779 30.4315 63.5241 31.2155 63.5241 32.1536H65.5241C65.5241 32.2941 65.4082 32.4315 65.2364 32.4315V30.4315Z" fill="#222D2F" fill-opacity="0.1" mask="url(#path-1-inside-1)"/>
<path d="M8.46515 26.5405C9.21744 25.5187 9.34717 24.7283 9.40104 22.7601C9.45491 24.7283 9.58465 25.5187 10.3369 26.5405C10.6313 26.9403 10.6313 27.4861 10.3369 27.8859C9.58465 28.9077 9.45491 29.6982 9.40104 31.6663C9.34717 29.6982 9.21744 28.9077 8.46515 27.8859C8.17077 27.4861 8.17077 26.9403 8.46515 26.5405Z" fill="#ED7B6D"/>
<path d="M87.6435 84.9354C89.2124 82.9901 89.4596 81.7443 89.5573 78.1768C89.6549 81.7443 89.9021 82.9901 91.4711 84.9354C91.7828 85.3219 91.7828 85.8754 91.4711 86.2619C89.9021 88.2071 89.6549 89.4529 89.5573 93.0205C89.4596 89.4529 89.2124 88.2071 87.6435 86.2619C87.3318 85.8754 87.3318 85.3219 87.6435 84.9354Z" fill="#ED7B6D"/>
<path fill-rule="evenodd" clip-rule="evenodd" d="M74.1553 38.0986H64.3864C63.8048 38.0986 63.3333 38.5701 63.3333 39.1517V49.4153C63.3333 49.9969 63.8048 50.4684 64.3864 50.4684H74.1553C74.7368 50.4684 75.2083 49.9969 75.2083 49.4153V39.1517C75.2083 38.5701 74.7368 38.0986 74.1553 38.0986ZM71.5155 46.6392C71.2323 46.6392 70.993 46.4076 71.0395 46.1282C71.0587 46.0131 71.0854 45.9121 71.1195 45.8251C71.1974 45.6245 71.3236 45.4511 71.4982 45.3048C71.6729 45.1585 71.805 45.0251 71.8947 44.9048C71.9867 44.7821 72.0327 44.6476 72.0327 44.5013C72.0327 44.145 71.8793 43.9668 71.5726 43.9668C71.431 43.9668 71.3165 44.0187 71.2292 44.1226L71.2022 44.1548C71.0476 44.3397 70.8769 44.5438 70.6393 44.5438H70.504C70.1685 44.5438 69.8793 44.2604 69.9974 43.9465C70.0717 43.7493 70.1861 43.5815 70.3408 43.443C70.6334 43.1787 71.044 43.0465 71.5726 43.0465C72.0988 43.0465 72.5058 43.1681 72.7937 43.4111C73.084 43.6542 73.2291 43.9999 73.2291 44.4482C73.2291 44.6441 73.1901 44.8222 73.1123 44.9827C73.0344 45.1431 72.9093 45.3071 72.7371 45.4747L72.33 45.8534C72.2144 45.9643 72.1342 46.0787 72.0893 46.1967C71.9987 46.4306 71.8151 46.6392 71.5642 46.6392H71.5155ZM70.8576 47.7152C70.8576 47.5406 70.9201 47.3978 71.0452 47.2869C71.1726 47.1736 71.3307 47.117 71.5195 47.117C71.7083 47.117 71.8652 47.1736 71.9902 47.2869C72.1177 47.3978 72.1814 47.5406 72.1814 47.7152C72.1814 47.8898 72.1177 48.0337 71.9902 48.147C71.8652 48.2579 71.7083 48.3134 71.5195 48.3134C71.3307 48.3134 71.1726 48.2579 71.0452 48.147C70.9201 48.0337 70.8576 47.8898 70.8576 47.7152ZM65.8073 40.0778C65.534 40.0778 65.3125 40.2993 65.3125 40.5726C65.3125 40.8459 65.534 41.0674 65.8073 41.0674H72.7344C73.0076 41.0674 73.2292 40.8459 73.2292 40.5726C73.2292 40.2993 73.0076 40.0778 72.7344 40.0778H65.8073ZM65.8073 42.5518C65.534 42.5518 65.3125 42.7733 65.3125 43.0465C65.3125 43.3198 65.534 43.5413 65.8073 43.5413H69.2708C69.5441 43.5413 69.7656 43.3198 69.7656 43.0465C69.7656 42.7733 69.5441 42.5518 69.2708 42.5518H65.8073ZM65.8073 45.0257C65.534 45.0257 65.3125 45.2472 65.3125 45.5205C65.3125 45.7938 65.534 46.0153 65.8073 46.0153H69.2708C69.5441 46.0153 69.7656 45.7938 69.7656 45.5205C69.7656 45.2472 69.5441 45.0257 69.2708 45.0257H65.8073ZM65.8073 47.4997C65.534 47.4997 65.3125 47.7212 65.3125 47.9945C65.3125 48.2677 65.534 48.4893 65.8073 48.4893H69.7656C70.0389 48.4893 70.2604 48.2677 70.2604 47.9945C70.2604 47.7212 70.0389 47.4997 69.7656 47.4997H65.8073Z" fill="#ED7B6D"/>
<path d="M39.899 14.352C39.2969 14.352 38.7882 13.8734 38.8871 13.296C38.9278 13.058 38.9845 12.8492 39.0572 12.6694C39.2227 12.2549 39.4911 11.8964 39.8623 11.594C40.2335 11.2917 40.5144 11.0161 40.705 10.7674C40.9006 10.5138 40.9984 10.2358 40.9984 9.93341C40.9984 9.19699 40.6724 8.82878 40.0203 8.82878C39.7193 8.82878 39.476 8.93607 39.2904 9.15066C38.9463 9.54847 38.571 10.0212 38.0364 10.0212H37.7487C37.0356 10.0212 36.4206 9.4355 36.6718 8.78669C36.8296 8.37916 37.073 8.03229 37.4018 7.74609C38.0238 7.19987 38.8966 6.92676 40.0203 6.92676C41.1389 6.92676 42.0042 7.17792 42.6162 7.68025C43.2332 8.18258 43.5417 8.89706 43.5417 9.82368C43.5417 10.2285 43.4589 10.5967 43.2934 10.9283C43.1278 11.26 42.862 11.5989 42.4958 11.9452L41.6305 12.7279C41.3847 12.9571 41.2141 13.1937 41.1188 13.4375C40.926 13.9209 40.5358 14.352 40.0026 14.352H39.899ZM38.5004 16.5759C38.5004 16.215 38.6333 15.9199 38.8992 15.6907C39.17 15.4566 39.5061 15.3395 39.9074 15.3395C40.3087 15.3395 40.6423 15.4566 40.9081 15.6907C41.179 15.9199 41.3145 16.215 41.3145 16.5759C41.3145 16.9368 41.179 17.2343 40.9081 17.4683C40.6423 17.6976 40.3087 17.8122 39.9074 17.8122C39.5061 17.8122 39.17 17.6976 38.8992 17.4683C38.6333 17.2343 38.5004 16.9368 38.5004 16.5759Z" fill="#ED7B6D"/>
<path d="M9.22191 87.5811C8.61984 87.5811 8.11107 87.1025 8.20998 86.5251C8.25074 86.2872 8.30744 86.0783 8.38007 85.8986C8.54561 85.484 8.81398 85.1256 9.18518 84.8232C9.55638 84.5208 9.83729 84.2453 10.0279 83.9965C10.2235 83.7429 10.3214 83.465 10.3214 83.1626C10.3214 82.4262 9.9953 82.0579 9.34319 82.0579C9.04222 82.0579 8.79893 82.1652 8.61333 82.3798C8.26925 82.7776 7.8939 83.2504 7.35929 83.2504H7.07157C6.35851 83.2504 5.74353 82.6647 5.99475 82.0159C6.15254 81.6083 6.39587 81.2615 6.72472 80.9753C7.34673 80.429 8.21956 80.1559 9.34319 80.1559C10.4618 80.1559 11.3271 80.4071 11.9391 80.9094C12.5561 81.4117 12.8646 82.1262 12.8646 83.0528C12.8646 83.4576 12.7818 83.8259 12.6163 84.1575C12.4507 84.4891 12.1849 84.8281 11.8187 85.1743L10.9534 85.9571C10.7076 86.1863 10.5371 86.4228 10.4417 86.6667C10.249 87.1501 9.85874 87.5811 9.32548 87.5811H9.22191ZM7.82327 89.805C7.82327 89.4441 7.9562 89.1491 8.22206 88.9199C8.49294 88.6858 8.82903 88.5687 9.23033 88.5687C9.63162 88.5687 9.9652 88.6858 10.2311 88.9199C10.5019 89.1491 10.6374 89.4441 10.6374 89.805C10.6374 90.1659 10.5019 90.4634 10.2311 90.6975C9.9652 90.9267 9.63162 91.0413 9.23033 91.0413C8.82903 91.0413 8.49294 90.9267 8.22206 90.6975C7.9562 90.4634 7.82327 90.1659 7.82327 89.805Z" fill="#ED7B6D"/>
<path d="M65.3125 47.9945C65.3125 47.7212 65.534 47.4997 65.8073 47.4997H69.7656C70.0389 47.4997 70.2604 47.7212 70.2604 47.9945C70.2604 48.2677 70.0389 48.4893 69.7656 48.4893H65.8073C65.534 48.4893 65.3125 48.2677 65.3125 47.9945Z" fill="#ED7B6D"/>
<path d="M65.3125 45.5205C65.3125 45.2472 65.534 45.0257 65.8073 45.0257H69.2708C69.5441 45.0257 69.7656 45.2472 69.7656 45.5205C69.7656 45.7938 69.5441 46.0153 69.2708 46.0153H65.8073C65.534 46.0153 65.3125 45.7938 65.3125 45.5205Z" fill="#ED7B6D"/>
<path d="M65.3125 43.0465C65.3125 42.7733 65.534 42.5518 65.8073 42.5518H69.2708C69.5441 42.5518 69.7656 42.7733 69.7656 43.0465C69.7656 43.3198 69.5441 43.5413 69.2708 43.5413H65.8073C65.534 43.5413 65.3125 43.3198 65.3125 43.0465Z" fill="#ED7B6D"/>
<path d="M65.3125 40.5726C65.3125 40.2993 65.534 40.0778 65.8073 40.0778H72.7344C73.0076 40.0778 73.2292 40.2993 73.2292 40.5726C73.2292 40.8459 73.0076 41.0674 72.7344 41.0674H65.8073C65.534 41.0674 65.3125 40.8459 65.3125 40.5726Z" fill="#ED7B6D"/>
<path d="M71.0395 46.1282C70.993 46.4076 71.2323 46.6392 71.5155 46.6392H71.5642C71.8151 46.6392 71.9987 46.4306 72.0893 46.1967C72.1342 46.0787 72.2144 45.9643 72.33 45.8534L72.7371 45.4747C72.9093 45.3071 73.0344 45.1431 73.1123 44.9827C73.1901 44.8222 73.2291 44.6441 73.2291 44.4482C73.2291 43.9999 73.084 43.6542 72.7937 43.4111C72.5058 43.1681 72.0988 43.0465 71.5726 43.0465C71.044 43.0465 70.6334 43.1787 70.3408 43.443C70.1861 43.5815 70.0717 43.7493 69.9974 43.9465C69.8793 44.2604 70.1685 44.5438 70.504 44.5438H70.6393C70.8769 44.5438 71.0476 44.3397 71.2022 44.1548L71.2292 44.1226C71.3165 44.0187 71.431 43.9668 71.5726 43.9668C71.8793 43.9668 72.0327 44.145 72.0327 44.5013C72.0327 44.6476 71.9867 44.7821 71.8947 44.9048C71.805 45.0251 71.6729 45.1585 71.4982 45.3048C71.3236 45.4511 71.1974 45.6245 71.1195 45.8251C71.0854 45.9121 71.0587 46.0131 71.0395 46.1282Z" fill="#ED7B6D"/>
<path d="M71.0452 47.2869C70.9201 47.3978 70.8576 47.5406 70.8576 47.7152C70.8576 47.8898 70.9201 48.0337 71.0452 48.147C71.1726 48.2579 71.3307 48.3134 71.5195 48.3134C71.7083 48.3134 71.8652 48.2579 71.9902 48.147C72.1177 48.0337 72.1814 47.8898 72.1814 47.7152C72.1814 47.5406 72.1177 47.3978 71.9902 47.2869C71.8652 47.1736 71.7083 47.117 71.5195 47.117C71.3307 47.117 71.1726 47.1736 71.0452 47.2869Z" fill="#ED7B6D"/>
<mask id="path-4-inside-2" fill="white">
<path fill-rule="evenodd" clip-rule="evenodd" d="M74.1868 36.4264V32.3346C77.668 32.0278 83.758 31.3825 88.3088 30.7198C90.5041 30.4001 92.6882 31.8747 93.0381 34.0949C94.2023 41.4818 94.4896 46.8297 92.9587 54.4735C92.6271 56.1292 91.2171 57.3223 89.5544 57.4356L74.1868 58.5087V52.4013C75.5387 52.4013 76.6346 51.2903 76.6346 49.9197V38.908C76.6346 37.5374 75.5387 36.4264 74.1868 36.4264ZM64.5241 36.4264V32.1541H58.2529C56.2549 32.1541 55.2716 31.735 53.6797 31.0565C53.182 30.8444 52.6248 30.6069 51.9584 30.3489C50.0243 29.6001 46.5858 29.8867 43.6076 30.135C42.278 30.2458 41.0402 30.3489 40.0688 30.3489C39.1069 30.3489 37.7202 30.3152 36.2184 30.2787C32.8067 30.1957 28.8007 30.0983 27.8295 30.3489C26.9033 30.588 25.7472 32.3307 24.4626 34.267C23.8071 35.2551 23.1181 36.2935 22.4092 37.2084C20.7307 39.3745 21.2436 40.6612 21.7099 41.0338C21.3813 41.3651 21.0318 41.7144 20.6608 42.0822C17.1638 45.548 18.1639 48.5806 19.101 49.6637C17.5348 50.6155 16.0757 51.7837 15.5902 53.4544C14.7509 56.3426 16.6393 58.3948 17.6884 59.0599C15.7167 60.1083 13.7194 62.0075 14.8908 64.6461C14.4246 64.6461 13.3872 65.1154 12.9675 66.9928C12.6337 68.486 14.2116 69.76 16.4395 71.5589C17.7128 72.587 19.1983 73.7865 20.6608 75.2963C23.3256 78.0474 27.8329 77.3111 32.1479 76.6062C34.3447 76.2473 36.4918 75.8966 38.3204 76.0183C43.4013 76.3568 52.477 67.3366 56.9059 62.9348C57.2017 62.6409 57.4767 62.3675 57.7284 62.119C60.9456 58.942 63.6499 58.3884 64.5241 58.5087V52.4013C63.0757 52.4013 61.9014 51.2109 61.9014 49.7425V39.0852C61.9014 37.6168 63.0757 36.4264 64.5241 36.4264Z"/>
</mask>
<path fill-rule="evenodd" clip-rule="evenodd" d="M74.1868 36.4264V32.3346C77.668 32.0278 83.758 31.3825 88.3088 30.7198C90.5041 30.4001 92.6882 31.8747 93.0381 34.0949C94.2023 41.4818 94.4896 46.8297 92.9587 54.4735C92.6271 56.1292 91.2171 57.3223 89.5544 57.4356L74.1868 58.5087V52.4013C75.5387 52.4013 76.6346 51.2903 76.6346 49.9197V38.908C76.6346 37.5374 75.5387 36.4264 74.1868 36.4264ZM64.5241 36.4264V32.1541H58.2529C56.2549 32.1541 55.2716 31.735 53.6797 31.0565C53.182 30.8444 52.6248 30.6069 51.9584 30.3489C50.0243 29.6001 46.5858 29.8867 43.6076 30.135C42.278 30.2458 41.0402 30.3489 40.0688 30.3489C39.1069 30.3489 37.7202 30.3152 36.2184 30.2787C32.8067 30.1957 28.8007 30.0983 27.8295 30.3489C26.9033 30.588 25.7472 32.3307 24.4626 34.267C23.8071 35.2551 23.1181 36.2935 22.4092 37.2084C20.7307 39.3745 21.2436 40.6612 21.7099 41.0338C21.3813 41.3651 21.0318 41.7144 20.6608 42.0822C17.1638 45.548 18.1639 48.5806 19.101 49.6637C17.5348 50.6155 16.0757 51.7837 15.5902 53.4544C14.7509 56.3426 16.6393 58.3948 17.6884 59.0599C15.7167 60.1083 13.7194 62.0075 14.8908 64.6461C14.4246 64.6461 13.3872 65.1154 12.9675 66.9928C12.6337 68.486 14.2116 69.76 16.4395 71.5589C17.7128 72.587 19.1983 73.7865 20.6608 75.2963C23.3256 78.0474 27.8329 77.3111 32.1479 76.6062C34.3447 76.2473 36.4918 75.8966 38.3204 76.0183C43.4013 76.3568 52.477 67.3366 56.9059 62.9348C57.2017 62.6409 57.4767 62.3675 57.7284 62.119C60.9456 58.942 63.6499 58.3884 64.5241 58.5087V52.4013C63.0757 52.4013 61.9014 51.2109 61.9014 49.7425V39.0852C61.9014 37.6168 63.0757 36.4264 64.5241 36.4264Z" fill="#FAE2E0"/>
<path d="M4.94805 1.97949L5.44784 1.96501C5.44 1.69462 5.21855 1.47949 4.94805 1.47949C4.67755 1.47949 4.45609 1.69462 4.44826 1.96501L4.94805 1.97949ZM2.59356 9.70681L2.21489 9.3803L2.21489 9.3803L2.59356 9.70681ZM7.30254 9.70681L7.68121 9.3803L7.68121 9.3803L7.30254 9.70681ZM4.94805 18.8024L4.44826 18.8169C4.45609 19.0873 4.67755 19.3024 4.94805 19.3024C5.21855 19.3024 5.44 19.0873 5.44784 18.8169L4.94805 18.8024ZM2.59356 11.0751L2.21489 11.4016L2.21489 11.4016L2.59356 11.0751ZM7.30254 11.0751L7.68121 11.4016L7.68121 11.4016L7.30254 11.0751ZM14.3491 13.8545L14.8489 13.8408C14.8415 13.5701 14.6199 13.3545 14.3491 13.3545C14.0783 13.3545 13.8567 13.5701 13.8493 13.8408L14.3491 13.8545ZM13.4132 17.6349L13.0106 17.3385L13.4132 17.6349ZM15.285 17.6349L15.6876 17.3385L15.285 17.6349ZM14.3491 22.7607L13.8493 22.7744C13.8567 23.0451 14.0783 23.2607 14.3491 23.2607C14.6199 23.2607 14.8415 23.0451 14.8489 22.7744L14.3491 22.7607ZM13.4132 18.9803L13.8158 18.6839L13.4132 18.9803ZM15.285 18.9803L14.8823 18.6839L15.285 18.9803ZM70.7553 81.1461L71.2551 81.1325C71.2477 80.8617 71.0262 80.6461 70.7553 80.6461C70.4845 80.6461 70.2629 80.8617 70.2555 81.1325L70.7553 81.1461ZM69.8195 84.9265L69.4168 84.6301L69.8195 84.9265ZM71.6912 84.9265L72.0939 84.6301L71.6912 84.9265ZM70.7553 90.0524L70.2555 90.0661C70.2629 90.3368 70.4845 90.5524 70.7553 90.5524C71.0262 90.5524 71.2477 90.3368 71.2551 90.0661L70.7553 90.0524ZM69.8195 86.272L70.2221 85.9755L69.8195 86.272ZM71.6912 86.272L71.2886 85.9755L71.6912 86.272ZM81.6408 62.3441L82.1406 62.3304C82.1332 62.0597 81.9116 61.8441 81.6408 61.8441C81.3699 61.8441 81.1484 62.0597 81.1409 62.3304L81.6408 62.3441ZM79.727 69.1027L79.3378 68.7888L79.727 69.1027ZM83.5545 69.1027L83.1653 69.4166L83.5545 69.1027ZM81.6408 77.1878L81.1409 77.2015C81.1484 77.4722 81.3699 77.6878 81.6408 77.6878C81.9116 77.6878 82.1332 77.4722 82.1406 77.2015L81.6408 77.1878ZM79.727 70.4292L79.3378 70.7431L79.727 70.4292ZM83.5545 70.4292L83.9437 70.7431L83.5545 70.4292ZM64.5241 35.9264C64.248 35.9264 64.0241 36.1502 64.0241 36.4264C64.0241 36.7025 64.248 36.9264 64.5241 36.9264V35.9264ZM74.1868 36.9264C74.4629 36.9264 74.6868 36.7025 74.6868 36.4264C74.6868 36.1502 74.4629 35.9264 74.1868 35.9264V36.9264ZM74.1868 52.9013C74.4629 52.9013 74.6868 52.6775 74.6868 52.4013C74.6868 52.1252 74.4629 51.9013 74.1868 51.9013V52.9013ZM64.5241 51.9013C64.248 51.9013 64.0241 52.1252 64.0241 52.4013C64.0241 52.6775 64.248 52.9013 64.5241 52.9013V51.9013ZM73.6868 32.3346C73.6868 32.6107 73.9106 32.8346 74.1868 32.8346C74.4629 32.8346 74.6868 32.6107 74.6868 32.3346H73.6868ZM74.6868 58.5087C74.6868 58.2326 74.4629 58.0087 74.1868 58.0087C73.9106 58.0087 73.6868 58.2326 73.6868 58.5087H74.6868ZM65.0241 58.5087C65.0241 58.2326 64.8003 58.0087 64.5241 58.0087C64.248 58.0087 64.0241 58.2326 64.0241 58.5087H65.0241ZM15.3445 64.436C15.2284 64.1854 14.9312 64.0764 14.6806 64.1924C14.4301 64.3085 14.3211 64.6057 14.4371 64.8563L15.3445 64.436ZM37.6307 68.5758C37.9068 68.5704 38.1262 68.3422 38.1209 68.0661C38.1155 67.79 37.8873 67.5706 37.6112 67.5759L37.6307 68.5758ZM24.5074 68.9784L24.5997 69.4698L24.5074 68.9784ZM19.4368 58.3282L19.2999 57.8472L19.2901 57.8502L19.4368 58.3282ZM24.6444 57.365C24.9099 57.2894 25.0639 57.0128 24.9883 56.7472C24.9127 56.4816 24.636 56.3276 24.3705 56.4033L24.6444 57.365ZM17.4536 58.6184C17.2098 58.7481 17.1173 59.0508 17.2469 59.2946C17.3765 59.5385 17.6793 59.631 17.9231 59.5014L17.4536 58.6184ZM18.8413 49.2364C18.6053 49.3798 18.5303 49.6874 18.6737 49.9233C18.8171 50.1593 19.1247 50.2344 19.3607 50.0909L18.8413 49.2364ZM24.0284 47.0817C24.1975 46.8635 24.1577 46.5494 23.9394 46.3803C23.7212 46.2111 23.4071 46.2509 23.2379 46.4692L24.0284 47.0817ZM21.3549 40.6817C21.1604 40.8777 21.1617 41.1943 21.3577 41.3888C21.5538 41.5833 21.8704 41.582 22.0648 41.3859L21.3549 40.6817ZM26.4856 36.5997C26.6479 36.3763 26.5983 36.0636 26.3749 35.9013C26.1515 35.739 25.8388 35.7885 25.6765 36.0119L26.4856 36.5997ZM64.0241 32.1541C64.0241 32.4303 64.248 32.6541 64.5241 32.6541C64.8003 32.6541 65.0241 32.4303 65.0241 32.1541H64.0241ZM65.1177 25.3259C65.2265 25.5797 65.5204 25.6972 65.7742 25.5885C66.0281 25.4797 66.1456 25.1857 66.0369 24.9319L65.1177 25.3259ZM59.7183 10.1887C59.6096 9.93492 59.3156 9.81734 59.0618 9.92612C58.808 10.0349 58.6904 10.3288 58.7992 10.5827L59.7183 10.1887ZM69.3322 22.8209C69.2207 23.0735 69.3352 23.3687 69.5878 23.4802C69.8404 23.5916 70.1356 23.4772 70.2471 23.2245L69.3322 22.8209ZM78.1452 5.32208C78.2567 5.06944 78.1422 4.77427 77.8896 4.6628C77.6369 4.55134 77.3418 4.66579 77.2303 4.91844L78.1452 5.32208ZM66.0245 63.2636C66.148 63.0166 66.0479 62.7163 65.8009 62.5928C65.5539 62.4693 65.2536 62.5694 65.1301 62.8164L66.0245 63.2636ZM54.5992 83.8781C54.4757 84.1251 54.5758 84.4254 54.8228 84.5489C55.0698 84.6724 55.3701 84.5723 55.4936 84.3253L54.5992 83.8781ZM70.268 62.8944C70.1876 62.6302 69.9082 62.4812 69.644 62.5616C69.3799 62.6421 69.2309 62.9214 69.3113 63.1856L70.268 62.8944ZM72.9971 75.2961C73.0775 75.5602 73.3568 75.7092 73.621 75.6288C73.8852 75.5484 74.0342 75.2691 73.9538 75.0049L72.9971 75.2961ZM4.44826 1.96501C4.389 4.00965 4.28385 5.32146 3.97181 6.39371C3.6663 7.44351 3.15331 8.29196 2.21489 9.3803L2.97223 10.0333C3.96843 8.87797 4.57349 7.90497 4.93198 6.67313C5.28393 5.46375 5.38872 4.03374 5.44784 1.99398L4.44826 1.96501ZM4.44826 1.99398C4.50738 4.03374 4.61217 5.46375 4.96412 6.67313C5.32261 7.90497 5.92767 8.87797 6.92386 10.0333L7.68121 9.3803C6.74279 8.29196 6.2298 7.44351 5.92429 6.39371C5.61224 5.32146 5.5071 4.00965 5.44784 1.96501L4.44826 1.99398ZM5.44784 18.7879C5.38872 16.7482 5.28393 15.3181 4.93198 14.1088C4.57349 12.8769 3.96843 11.9039 2.97223 10.7486L2.21489 11.4016C3.15331 12.4899 3.6663 13.3384 3.97181 14.3882C4.28385 15.4604 4.389 16.7722 4.44826 18.8169L5.44784 18.7879ZM5.44784 18.8169C5.5071 16.7722 5.61224 15.4604 5.92429 14.3882C6.2298 13.3384 6.74279 12.4899 7.68121 11.4016L6.92386 10.7486C5.92767 11.9039 5.32261 12.8769 4.96412 14.1088C4.61217 15.3181 4.50738 16.7482 4.44826 18.7879L5.44784 18.8169ZM6.92386 10.0333C7.10038 10.238 7.10038 10.5439 6.92386 10.7486L7.68121 11.4016C8.18127 10.8216 8.18127 9.96025 7.68121 9.3803L6.92386 10.0333ZM2.21489 9.3803C1.71483 9.96025 1.71483 10.8216 2.21489 11.4016L2.97223 10.7486C2.79571 10.5439 2.79571 10.238 2.97223 10.0333L2.21489 9.3803ZM13.8493 13.8408C13.8223 14.8258 13.7766 15.4694 13.6561 15.9861C13.5404 16.4824 13.3523 16.8742 13.0106 17.3385L13.8158 17.9313C14.2264 17.3738 14.4793 16.8595 14.63 16.2131C14.7759 15.5871 14.822 14.8514 14.8489 13.8682L13.8493 13.8408ZM13.8493 13.8682C13.8762 14.8514 13.9222 15.5871 14.0682 16.2131C14.2189 16.8595 14.4718 17.3738 14.8823 17.9313L15.6876 17.3385C15.3458 16.8742 15.1578 16.4824 15.0421 15.9861C14.9216 15.4694 14.8759 14.8258 14.8489 13.8408L13.8493 13.8682ZM14.8489 22.7471C14.822 21.7638 14.7759 21.0282 14.63 20.4021C14.4793 19.7557 14.2264 19.2415 13.8158 18.6839L13.0106 19.2768C13.3523 19.741 13.5404 20.1329 13.6561 20.6292C13.7766 21.1458 13.8223 21.7895 13.8493 22.7744L14.8489 22.7471ZM14.8489 22.7744C14.8759 21.7895 14.9216 21.1458 15.0421 20.6292C15.1578 20.1329 15.3458 19.741 15.6876 19.2768L14.8823 18.6839C14.4718 19.2415 14.2189 19.7557 14.0682 20.4021C13.9222 21.0282 13.8762 21.7638 13.8493 22.7471L14.8489 22.7744ZM14.8823 17.9313C15.0469 18.1549 15.0469 18.4604 14.8823 18.6839L15.6876 19.2768C16.1118 18.7006 16.1118 17.9146 15.6876 17.3385L14.8823 17.9313ZM13.0106 17.3385C12.5864 17.9146 12.5864 18.7006 13.0106 19.2768L13.8158 18.6839C13.6513 18.4604 13.6513 18.1549 13.8158 17.9313L13.0106 17.3385ZM70.2555 81.1325C70.2286 82.1174 70.1828 82.761 70.0624 83.2777C69.9467 83.774 69.7586 84.1659 69.4168 84.6301L70.2221 85.223C70.6326 84.6654 70.8856 84.1511 71.0362 83.5047C71.1822 82.8787 71.2282 82.143 71.2551 81.1598L70.2555 81.1325ZM70.2555 81.1598C70.2824 82.143 70.3285 82.8787 70.4744 83.5048C70.6251 84.1511 70.8781 84.6654 71.2886 85.223L72.0939 84.6301C71.7521 84.1659 71.564 83.774 71.4483 83.2777C71.3279 82.761 71.2821 82.1174 71.2551 81.1325L70.2555 81.1598ZM71.2551 90.0387C71.2282 89.0555 71.1822 88.3198 71.0362 87.6938C70.8856 87.0474 70.6326 86.5331 70.2221 85.9755L69.4168 86.5684C69.7586 87.0326 69.9467 87.4245 70.0624 87.9208C70.1828 88.4375 70.2286 89.0811 70.2555 90.0661L71.2551 90.0387ZM71.2551 90.0661C71.2821 89.0811 71.3279 88.4375 71.4483 87.9208C71.564 87.4245 71.7521 87.0326 72.0939 86.5684L71.2886 85.9755C70.8781 86.5331 70.6251 87.0474 70.4744 87.6938C70.3285 88.3198 70.2824 89.0555 70.2555 90.0387L71.2551 90.0661ZM71.2886 85.223C71.4532 85.4465 71.4532 85.752 71.2886 85.9755L72.0939 86.5684C72.5181 85.9923 72.5181 85.2063 72.0939 84.6301L71.2886 85.223ZM69.4168 84.6301C68.9926 85.2063 68.9926 85.9923 69.4168 86.5684L70.2221 85.9755C70.0575 85.752 70.0575 85.4465 70.2221 85.223L69.4168 84.6301ZM81.1409 62.3304C81.0921 64.1165 81.0057 65.2649 80.7529 66.2014C80.506 67.1157 80.0932 67.8522 79.3378 68.7888L80.1162 69.4166C80.9297 68.408 81.4249 67.5489 81.7183 66.4621C82.0057 65.3975 82.0918 64.1393 82.1406 62.3577L81.1409 62.3304ZM81.1409 62.3577C81.1897 64.1393 81.2758 65.3975 81.5632 66.4621C81.8566 67.5489 82.3518 68.408 83.1653 69.4166L83.9437 68.7888C83.1883 67.8522 82.7755 67.1157 82.5286 66.2014C82.2758 65.2649 82.1895 64.1165 82.1406 62.3304L81.1409 62.3577ZM82.1406 77.1741C82.0918 75.3926 82.0057 74.1344 81.7183 73.0698C81.4249 71.983 80.9297 71.1239 80.1162 70.1153L79.3378 70.7431C80.0932 71.6797 80.506 72.4161 80.7529 73.3304C81.0057 74.2669 81.0921 75.4154 81.1409 77.2015L82.1406 77.1741ZM82.1406 77.2015C82.1895 75.4154 82.2758 74.2669 82.5286 73.3304C82.7755 72.4161 83.1883 71.6797 83.9437 70.7431L83.1653 70.1153C82.3518 71.1239 81.8566 71.983 81.5632 73.0698C81.2758 74.1344 81.1897 75.3926 81.1409 77.1741L82.1406 77.2015ZM83.1653 69.4166C83.3293 69.6199 83.3293 69.912 83.1653 70.1153L83.9437 70.7431C84.4032 70.1734 84.4032 69.3585 83.9437 68.7888L83.1653 69.4166ZM79.3378 68.7888C78.8783 69.3585 78.8783 70.1734 79.3378 70.7431L80.1162 70.1153C79.9522 69.912 79.9522 69.6199 80.1162 69.4166L79.3378 68.7888ZM65.2364 31.932H73.2965V30.932H65.2364V31.932ZM64.5241 36.9264H74.1868V35.9264H64.5241V36.9264ZM66.143 60.2723H72.9404V59.2723H66.143V60.2723ZM74.1868 51.9013H64.5241V52.9013H74.1868V51.9013ZM37.6112 67.5759C34.5322 67.6359 27.5411 67.9002 24.4152 68.487L24.5997 69.4698C27.6283 68.9013 34.5318 68.6361 37.6307 68.5758L37.6112 67.5759ZM24.4152 68.487C22.5535 68.8364 20.7303 68.7849 19.1591 68.1739C17.6008 67.568 16.2537 66.3987 15.3445 64.436L14.4371 64.8563C15.4512 67.0454 16.9891 68.4031 18.7967 69.106C20.5913 69.8037 22.6147 69.8424 24.5997 69.4698L24.4152 68.487ZM19.5738 58.8091L24.6444 57.365L24.3705 56.4033L19.2999 57.8473L19.5738 58.8091ZM17.9231 59.5014C18.5123 59.1881 19.0984 58.9551 19.5836 58.8062L19.2901 57.8502C18.7459 58.0173 18.1007 58.2744 17.4536 58.6184L17.9231 59.5014ZM19.3607 50.0909C20.2681 49.5395 21.1678 49.086 22.0147 48.6033C22.8195 48.1445 23.5836 47.6557 24.0284 47.0817L23.2379 46.4692C22.9313 46.865 22.3384 47.2678 21.5195 47.7345C20.7428 48.1772 19.752 48.6829 18.8413 49.2364L19.3607 50.0909ZM22.0648 41.3859C24.8324 38.596 26.1479 37.0644 26.4856 36.5997L25.6765 36.0119C25.389 36.4077 24.1234 37.8907 21.3549 40.6817L22.0648 41.3859ZM66.143 59.2723C65.919 59.2723 65.6143 59.1735 65.3669 58.996C65.1118 58.8129 65.0241 58.6285 65.0241 58.5087H64.0241C64.0241 59.0868 64.4017 59.5342 64.7839 59.8084C65.1739 60.0883 65.6785 60.2723 66.143 60.2723V59.2723ZM73.2965 31.932C73.5056 31.932 73.6868 32.1058 73.6868 32.3346H74.6868C74.6868 31.5664 74.0707 30.932 73.2965 30.932V31.932ZM72.9404 60.2723C73.9113 60.2723 74.6868 59.4763 74.6868 58.5087H73.6868C73.6868 58.9369 73.3462 59.2723 72.9404 59.2723V60.2723ZM65.2364 30.932C64.5605 30.932 64.0241 31.4856 64.0241 32.1541H65.0241C65.0241 32.025 65.1256 31.932 65.2364 31.932V30.932ZM66.0369 24.9319L59.7183 10.1887L58.7992 10.5827L65.1177 25.3259L66.0369 24.9319ZM70.2471 23.2245L78.1452 5.32208L77.2303 4.91844L69.3322 22.8209L70.2471 23.2245ZM65.1301 62.8164L54.5992 83.8781L55.4936 84.3253L66.0245 63.2636L65.1301 62.8164ZM69.3113 63.1856L72.9971 75.2961L73.9538 75.0049L70.268 62.8944L69.3113 63.1856ZM64.5241 36.4264V37.4264H65.5241V36.4264H64.5241ZM74.1868 36.4264H73.1868V37.4264H74.1868V36.4264ZM74.1868 52.4013V51.4013H73.1868V52.4013H74.1868ZM64.5241 52.4013H65.5241V51.4013H64.5241V52.4013ZM74.1868 32.3346L74.099 31.3384C73.5827 31.3839 73.1868 31.8163 73.1868 32.3346H74.1868ZM88.3088 30.7198L88.4529 31.7094L88.3088 30.7198ZM93.0381 34.0949L92.0503 34.2506V34.2506L93.0381 34.0949ZM92.9587 54.4735L93.9392 54.6699L92.9587 54.4735ZM74.1868 58.5087H73.1868C73.1868 58.786 73.3019 59.0509 73.5047 59.2401C73.7076 59.4292 73.9798 59.5256 74.2564 59.5063L74.1868 58.5087ZM89.5544 57.4356L89.4864 56.4379L89.4847 56.4381L89.5544 57.4356ZM64.5241 58.5087L64.3878 59.4994C64.6741 59.5388 64.9634 59.4524 65.1813 59.2625C65.3991 59.0726 65.5241 58.7977 65.5241 58.5087H64.5241ZM57.7284 62.119L57.0258 61.4074H57.0258L57.7284 62.119ZM38.3204 76.0183L38.3868 75.0206L38.3204 76.0183ZM20.6608 75.2963L21.3791 74.6005L20.6608 75.2963ZM12.9675 66.9928L11.9916 66.7746L12.9675 66.9928ZM14.8908 64.6461V65.6461C15.2292 65.6461 15.5447 65.4749 15.7292 65.1912C15.9137 64.9075 15.9421 64.5497 15.8048 64.2404L14.8908 64.6461ZM17.6884 59.0599L18.1578 59.9429C18.4723 59.7757 18.6741 59.4539 18.6876 59.0981C18.7012 58.7422 18.5246 58.406 18.2238 58.2153L17.6884 59.0599ZM15.5902 53.4544L14.6299 53.1754L15.5902 53.4544ZM19.101 49.6637L19.6203 50.5182C19.8718 50.3654 20.0432 50.1095 20.0889 49.8187C20.1345 49.528 20.0498 49.2319 19.8572 49.0093L19.101 49.6637ZM20.6608 42.0822L19.9568 41.3719L20.6608 42.0822ZM21.7099 41.0338L22.4198 41.7381C22.6197 41.5366 22.7245 41.2596 22.7082 40.9762C22.6919 40.6929 22.5559 40.4298 22.3341 40.2526L21.7099 41.0338ZM22.4092 37.2084L21.6188 36.5959L22.4092 37.2084ZM27.8295 30.3489L27.5796 29.3807L27.8295 30.3489ZM51.9584 30.3489L52.3195 29.4164H52.3195L51.9584 30.3489ZM64.5241 32.1541H65.5241C65.5241 31.6018 65.0764 31.1541 64.5241 31.1541V32.1541ZM53.6797 31.0565L54.0718 30.1366L53.6797 31.0565ZM43.6076 30.135L43.6906 31.1315L43.6076 30.135ZM36.2184 30.2787L36.2427 29.279L36.2184 30.2787ZM24.4626 34.267L23.6293 33.7142H23.6293L24.4626 34.267ZM16.4395 71.5589L17.0677 70.7809H17.0677L16.4395 71.5589ZM32.1479 76.6062L32.3091 77.5931H32.3091L32.1479 76.6062ZM56.9059 62.9348L57.6109 63.6441L57.6109 63.6441L56.9059 62.9348ZM75.6346 38.908V49.9197H77.6346V38.908H75.6346ZM62.9014 49.7425V39.0852H60.9014V49.7425H62.9014ZM73.1868 32.3346V36.4264H75.1868V32.3346H73.1868ZM74.2746 33.3307C77.7676 33.0229 83.8775 32.3757 88.4529 31.7094L88.1647 29.7302C83.6385 30.3894 77.5685 31.0327 74.099 31.3384L74.2746 33.3307ZM92.0503 34.2506C93.2026 41.5622 93.4788 46.7844 91.9782 54.2771L93.9392 54.6699C95.5004 46.8749 95.202 41.4015 94.0259 33.9392L92.0503 34.2506ZM75.1868 58.5087V52.4013H73.1868V58.5087H75.1868ZM89.4847 56.4381L74.1171 57.5112L74.2564 59.5063L89.624 58.4332L89.4847 56.4381ZM63.5241 52.4013V58.5087H65.5241V52.4013H63.5241ZM64.6605 57.5181C63.9697 57.423 62.8794 57.6022 61.6035 58.1615C60.294 58.7354 58.7134 59.7409 57.0258 61.4074L58.4311 62.8305C59.9606 61.3201 61.3408 60.4603 62.4063 59.9932C63.5054 59.5115 64.2043 59.4741 64.3878 59.4994L64.6605 57.5181ZM13.9434 67.2109C14.2942 65.6417 15.03 65.6461 14.8908 65.6461V63.6461C13.8191 63.6461 12.4801 64.5892 11.9916 66.7746L13.9434 67.2109ZM15.8048 64.2404C15.3664 63.2528 15.5199 62.4722 15.953 61.7961C16.422 61.0639 17.2468 60.4273 18.1578 59.9429L17.2189 58.177C16.1583 58.7409 14.9986 59.5781 14.2689 60.7173C13.5033 61.9125 13.2439 63.4009 13.9768 65.0519L15.8048 64.2404ZM18.2238 58.2153C17.3709 57.6746 15.8861 56.0199 16.5505 53.7335L14.6299 53.1754C13.6158 56.6653 15.9076 59.115 17.1529 59.9045L18.2238 58.2153ZM16.5505 53.7335C16.9224 52.4537 18.0784 51.4553 19.6203 50.5182L18.5816 48.8091C16.9911 49.7757 15.229 51.1136 14.6299 53.1754L16.5505 53.7335ZM19.8572 49.0093C19.5532 48.658 19.1607 47.8809 19.2167 46.8191C19.2713 45.7833 19.7598 44.3831 21.3647 42.7924L19.9568 41.3719C18.0648 43.2471 17.3048 45.0961 17.2195 46.7138C17.1355 48.3055 17.7116 49.5862 18.3448 50.318L19.8572 49.0093ZM21.3647 42.7924C21.7377 42.4227 22.0892 42.0714 22.4198 41.7381L20.9999 40.3296C20.6734 40.6588 20.326 41.0061 19.9568 41.3719L21.3647 42.7924ZM22.3341 40.2526C22.5029 40.3875 21.6648 39.8017 23.1997 37.8209L21.6188 36.5959C19.7967 38.9473 19.9843 40.935 21.0856 41.815L22.3341 40.2526ZM65.5241 36.4264V32.1541H63.5241V36.4264H65.5241ZM58.2529 33.1541H64.5241V31.1541H58.2529V33.1541ZM75.6346 49.9197C75.6346 50.7509 74.9735 51.4013 74.1868 51.4013V53.4013C76.1038 53.4013 77.6346 51.8296 77.6346 49.9197H75.6346ZM88.4529 31.7094C90.1498 31.4623 91.7923 32.6139 92.0503 34.2506L94.0259 33.9392C93.584 31.1355 90.8585 29.338 88.1647 29.7302L88.4529 31.7094ZM91.9782 54.2771C91.738 55.4764 90.7134 56.3543 89.4864 56.4379L89.6224 58.4333C91.7208 58.2902 93.5162 56.7819 93.9392 54.6699L91.9782 54.2771ZM60.9014 49.7425C60.9014 51.7503 62.5105 53.4013 64.5241 53.4013V51.4013C63.6408 51.4013 62.9014 50.6716 62.9014 49.7425H60.9014ZM77.6346 38.908C77.6346 36.9981 76.1038 35.4264 74.1868 35.4264V37.4264C74.9735 37.4264 75.6346 38.0767 75.6346 38.908H77.6346ZM62.9014 39.0852C62.9014 38.1561 63.6408 37.4264 64.5241 37.4264V35.4264C62.5105 35.4264 60.9014 37.0774 60.9014 39.0852H62.9014ZM58.2529 31.1541C56.464 31.1541 55.634 30.8025 54.0718 30.1366L53.2876 31.9765C54.9092 32.6676 56.0458 33.1541 58.2529 33.1541V31.1541ZM54.0718 30.1366C53.5743 29.9246 53.0032 29.6811 52.3195 29.4164L51.5974 31.2815C52.2464 31.5327 52.7897 31.7642 53.2876 31.9765L54.0718 30.1366ZM52.3195 29.4164C51.1665 28.97 49.6629 28.8589 48.1684 28.8681C46.6492 28.8774 45.0054 29.015 43.5245 29.1384L43.6906 31.1315C45.188 31.0067 46.7526 30.8768 48.1807 30.868C49.6335 30.8591 50.8162 30.9791 51.5974 31.2815L52.3195 29.4164ZM43.5245 29.1384C42.18 29.2505 40.9893 29.3489 40.0688 29.3489V31.3489C41.0911 31.3489 42.3761 31.2411 43.6906 31.1315L43.5245 29.1384ZM40.0688 29.3489C39.122 29.3489 37.7499 29.3156 36.2427 29.279L36.194 31.2784C37.6905 31.3148 39.0917 31.3489 40.0688 31.3489V29.3489ZM36.2427 29.279C34.5399 29.2376 32.6736 29.1921 31.111 29.1887C30.33 29.187 29.6141 29.1957 29.0264 29.2215C28.4692 29.246 27.9374 29.2883 27.5796 29.3807L28.0794 31.3172C28.2072 31.2842 28.5404 31.2448 29.1141 31.2196C29.6572 31.1957 30.3382 31.187 31.1066 31.1887C32.6426 31.1921 34.4851 31.2368 36.194 31.2784L36.2427 29.279ZM27.5796 29.3807C27.129 29.497 26.7434 29.7661 26.4334 30.0384C26.1128 30.32 25.7999 30.6709 25.4992 31.0473C24.9003 31.7968 24.2637 32.758 23.6293 33.7142L25.2959 34.8199C25.9461 33.8397 26.5298 32.9614 27.0617 32.2957C27.3263 31.9645 27.5565 31.7139 27.7533 31.541C27.8503 31.4558 27.929 31.3986 27.9895 31.362C28.0505 31.325 28.0797 31.3171 28.0794 31.3172L27.5796 29.3807ZM23.6293 33.7142C22.9695 34.7087 22.3011 35.7153 21.6188 36.5959L23.1997 37.8209C23.9352 36.8718 24.6447 35.8015 25.2959 34.8199L23.6293 33.7142ZM11.9916 66.7746C11.7222 67.98 12.2746 68.9921 12.9864 69.8153C13.6896 70.6285 14.7238 71.4589 15.8113 72.337L17.0677 70.7809C15.9273 69.86 15.0586 69.154 14.4993 68.5072C13.9486 67.8703 13.8791 67.4988 13.9434 67.2109L11.9916 66.7746ZM15.8113 72.337C17.0873 73.3672 18.528 74.5317 19.9425 75.992L21.3791 74.6005C19.8687 73.0412 18.3382 71.8067 17.0677 70.7809L15.8113 72.337ZM19.9425 75.992C21.5247 77.6255 23.6143 78.17 25.7497 78.2466C27.8671 78.3225 30.1759 77.9416 32.3091 77.5931L31.9866 75.6193C29.8049 75.9757 27.7025 76.3153 25.8213 76.2479C23.9581 76.1811 22.4617 75.7182 21.3791 74.6005L19.9425 75.992ZM32.3091 77.5931C34.5404 77.2286 36.5635 76.9035 38.2539 77.0161L38.3868 75.0206C36.42 74.8896 34.1491 75.266 31.9866 75.6193L32.3091 77.5931ZM38.2539 77.0161C39.8054 77.1195 41.5277 76.5133 43.2136 75.6193C44.9253 74.7115 46.7291 73.436 48.4819 72.0354C51.9884 69.2334 55.4014 65.84 57.6109 63.6441L56.201 62.2256C53.9815 64.4314 50.6423 67.749 47.2334 70.4729C45.5286 71.8353 43.834 73.0265 42.2766 73.8524C40.6933 74.692 39.3758 75.0864 38.3868 75.0206L38.2539 77.0161ZM57.6109 63.6441C57.9069 63.3499 58.1807 63.0777 58.4311 62.8305L57.0258 61.4074C56.7727 61.6574 56.4964 61.9319 56.201 62.2256L57.6109 63.6441Z" fill="black" fill-opacity="0.1" mask="url(#path-4-inside-2)"/>
</svg>
