<svg width="50" height="50" viewBox="0 0 50 50" fill="none" xmlns="http://www.w3.org/2000/svg">
<rect width="50" height="50" rx="8" fill="#EDFCF7"/>
<path d="M16.2496 26.4746V29.9871C16.2496 30.8996 16.7496 31.7496 17.5496 32.1871L23.7996 35.5996C24.5496 36.0121 25.4496 36.0121 26.1996 35.5996L32.4496 32.1871C33.2496 31.7496 33.7496 30.8996 33.7496 29.9871V26.4746L26.1996 30.5996C25.4496 31.0121 24.5496 31.0121 23.7996 30.5996L16.2496 26.4746ZM23.7996 14.3996L13.2621 20.1496C12.3996 20.6246 12.3996 21.8746 13.2621 22.3496L23.7996 28.0996C24.5496 28.5121 25.4496 28.5121 26.1996 28.0996L36.2496 22.6121V29.9996C36.2496 30.6871 36.8121 31.2496 37.4996 31.2496C38.1871 31.2496 38.7496 30.6871 38.7496 29.9996V21.9871C38.7496 21.5246 38.4996 21.1121 38.0996 20.8871L26.1996 14.3996C25.8303 14.2026 25.4182 14.0996 24.9996 14.0996C24.5811 14.0996 24.1689 14.2026 23.7996 14.3996Z" fill="#16B6A3"/>
</svg>
