<svg width="16" height="16" viewBox="0 0 16 16" fill="none" xmlns="http://www.w3.org/2000/svg">
<path d="M9.19626 7.19266H12.8V5.87156H10.1267L8.6498 3.42752C8.42826 3.06055 8.02949 2.81101 7.57164 2.81101C7.43872 2.81101 7.32057 2.83303 7.20241 2.86972L3.19995 4.11009V7.92661H4.52918V5.23303L6.08734 4.74862L3.19995 16H4.52918L6.64857 10.0477L8.36918 12.3303V16H9.69841V11.2954L7.85964 7.9633L8.39872 5.85688L9.19626 7.19266ZM9.10764 2.6422C9.84611 2.6422 10.4369 2.05505 10.4369 1.3211C10.4369 0.587156 9.84611 0 9.10764 0C8.36918 0 7.77841 0.587156 7.77841 1.3211C7.77841 2.05505 8.36918 2.6422 9.10764 2.6422Z" fill="#222D2F"/>
</svg>
