<svg width="20" height="20" viewBox="0 0 20 20" fill="none" xmlns="http://www.w3.org/2000/svg">
<path d="M10 0L12.598 6.42414L19.5106 6.90983L14.2037 11.3659L15.8779 18.0902L10 14.42L4.12215 18.0902L5.79633 11.3659L0.489435 6.90983L7.40199 6.42414L10 0Z" fill="#222D2F" fill-opacity="0.08"/>
</svg>
