<svg width="16" height="16" viewBox="0 0 16 16" fill="none" xmlns="http://www.w3.org/2000/svg">
<path d="M12.57 3.3444C12.43 2.9337 12.05 2.66675 11.6 2.66675H4.41C3.95 2.66675 3.58 2.9337 3.43 3.3444L2 7.56429L2.01 13.2216C2.01 13.6118 2.32 13.9609 2.7 13.9609H3.32C3.7 13.9609 4 13.5707 4 13.1805V11.9074H12V13.1805C12 13.5707 12.31 13.9609 12.69 13.9609H13.3C13.68 13.9609 13.99 13.6118 13.99 13.2216L14 11.815V7.56429L12.57 3.3444ZM4.41 3.69349H11.6L12.63 6.7737H3.38L4.41 3.69349ZM4 9.85391C3.45 9.85391 3 9.39188 3 8.82718C3 8.26247 3.45 7.80044 4 7.80044C4.55 7.80044 5 8.26247 5 8.82718C5 9.39188 4.55 9.85391 4 9.85391ZM12 9.85391C11.45 9.85391 11 9.39188 11 8.82718C11 8.26247 11.45 7.80044 12 7.80044C12.55 7.80044 13 8.26247 13 8.82718C13 9.39188 12.55 9.85391 12 9.85391Z" fill="#222D2F"/>
</svg>
