<svg width="20" height="20" viewBox="0 0 20 20" fill="none" xmlns="http://www.w3.org/2000/svg">
<g opacity="0.8">
<path fill-rule="evenodd" clip-rule="evenodd" d="M8.31641 15.009C8.62891 15.009 8.76698 14.8661 8.94141 14.6965L10.6081 13.0759L8.52911 11.8223" fill="#ACACAC"/>
<path d="M8.52825 11.8228L13.5658 15.5445C14.1406 15.8617 14.5555 15.6975 14.6987 15.0108L16.7492 5.34802C16.9591 4.50633 16.4283 4.12458 15.8784 4.37425L3.8378 9.01706C3.01591 9.34672 3.0207 9.80525 3.68798 10.0096L6.77788 10.974L13.9313 6.46095C14.269 6.25617 14.579 6.36626 14.3246 6.59203L8.52825 11.8228Z" fill="#ACACAC"/>
</g>
</svg>
