<svg width="20" height="20" viewBox="0 0 20 20" fill="none" xmlns="http://www.w3.org/2000/svg">
<path d="M17.2222 5.55577V2.22244C17.2222 1.92775 17.1051 1.64514 16.8967 1.43677C16.6884 1.22839 16.4057 1.11133 16.1111 1.11133H3.33328C3.03859 1.11133 2.75598 1.22839 2.5476 1.43677C2.33923 1.64514 2.22217 1.92775 2.22217 2.22244V5.55577C2.22217 5.85046 2.33923 6.13308 2.5476 6.34145C2.75598 6.54982 3.03859 6.66689 3.33328 6.66689H16.1111C16.4057 6.66689 16.6884 6.54982 16.8967 6.34145C17.1051 6.13308 17.2222 5.85046 17.2222 5.55577ZM3.33328 2.22244H16.1111V5.55577H3.33328V2.22244Z" fill="#3368CC"/>
<path d="M18.3335 3.33301H17.7779V6.82745L10.389 9.18857C10.272 9.22524 10.1703 9.29963 10.1 9.40012C10.0296 9.50062 9.99454 9.62158 10.0001 9.74412V10.5552H8.88904V18.333C8.88904 18.6277 9.0061 18.9103 9.21448 19.1187C9.42285 19.3271 9.70546 19.4441 10.0001 19.4441H11.1113C11.4059 19.4441 11.6886 19.3271 11.8969 19.1187C12.1053 18.9103 12.2224 18.6277 12.2224 18.333V10.5552H11.1113V10.1497L18.5002 7.77745C18.6172 7.74078 18.7188 7.66639 18.7892 7.5659C18.8595 7.4654 18.8947 7.34444 18.889 7.2219V3.88856C18.889 3.74122 18.8305 3.59991 18.7263 3.49573C18.6221 3.39154 18.4808 3.33301 18.3335 3.33301ZM11.1113 18.333H10.0001V11.6663H11.1113V18.333Z" fill="#3368CC"/>
</svg>
