<svg width="20" height="20" viewBox="0 0 20 20" fill="none" xmlns="http://www.w3.org/2000/svg">
<path d="M16.3375 10.4667V17C16.3375 17.3667 16.0375 17.6667 15.6709 17.6667C15.3042 17.6667 15.0042 17.3667 15.0042 17V10.4667C15.0042 10.1 15.3042 9.80005 15.6709 9.80005C16.0375 9.80005 16.3375 10.1 16.3375 10.4667ZM15.6709 4.23336C16.0375 4.23336 16.3375 3.93336 16.3375 3.56669V3.00004C16.3375 2.63337 16.0375 2.33337 15.6709 2.33337C15.3042 2.33337 15.0042 2.63337 15.0042 3.00004V3.56669C15.0042 3.93336 15.3042 4.23336 15.6709 4.23336ZM6.32086 10C6.32086 11.1 5.42085 12 4.33752 12C3.25419 12 2.35418 11.1 2.35418 10C2.35418 8.90004 3.25419 8.00004 4.33752 8.00004C5.42085 8.00004 6.32086 8.90004 6.32086 10ZM4.98752 10C4.98752 9.63337 4.68752 9.33337 4.33752 9.33337C3.98752 9.33337 3.68752 9.63337 3.68752 10C3.68752 10.3667 3.98752 10.6667 4.33752 10.6667C4.68752 10.6667 4.98752 10.3667 4.98752 10ZM11.9875 13.2834C11.9875 14.3834 11.0875 15.2834 10.0042 15.2834C8.92085 15.2834 8.02085 14.3834 8.02085 13.2834C8.02085 12.1834 8.92085 11.2834 10.0042 11.2834C11.0875 11.2834 11.9875 12.1667 11.9875 13.2834ZM10.6542 13.2834C10.6542 12.9167 10.3542 12.6167 10.0042 12.6167C9.65419 12.6167 9.35418 12.9167 9.35418 13.2834C9.35418 13.65 9.65419 13.95 10.0042 13.95C10.3542 13.95 10.6542 13.65 10.6542 13.2834ZM17.6709 7.10006C17.6709 8.20006 16.7709 9.10006 15.6875 9.10006C14.6042 9.10006 13.7042 8.20006 13.7042 7.10006C13.7042 6.00006 14.6042 5.10006 15.6875 5.10006C16.7709 5.10006 17.6709 6.00006 17.6709 7.10006ZM16.3375 7.10006C16.3375 6.73339 16.0375 6.43339 15.6875 6.43339C15.3375 6.43339 15.0375 6.73339 15.0375 7.10006C15.0375 7.46672 15.3375 7.76672 15.6875 7.76672C16.0375 7.76672 16.3375 7.48339 16.3375 7.10006ZM10.0042 15.95C9.63752 15.95 9.33752 16.25 9.33752 16.6167V17C9.33752 17.3667 9.63752 17.6667 10.0042 17.6667C10.3709 17.6667 10.6709 17.3667 10.6709 17V16.6167C10.6709 16.25 10.3709 15.95 10.0042 15.95ZM10.0042 10.45C10.3709 10.45 10.6709 10.15 10.6709 9.78337V3.00004C10.6709 2.63337 10.3709 2.33337 10.0042 2.33337C9.63752 2.33337 9.33752 2.63337 9.33752 3.00004V9.78337C9.33752 10.15 9.63752 10.45 10.0042 10.45ZM4.33752 12.8834C3.97085 12.8834 3.67085 13.1834 3.67085 13.55V17C3.67085 17.3667 3.97085 17.6667 4.33752 17.6667C4.70419 17.6667 5.00419 17.3667 5.00419 17V13.55C5.00419 13.1834 4.70419 12.8834 4.33752 12.8834ZM4.33752 7.15002C4.70419 7.15002 5.00419 6.85002 5.00419 6.48336V3.00004C5.00419 2.63337 4.70419 2.33337 4.33752 2.33337C3.97085 2.33337 3.67085 2.63337 3.67085 3.00004V6.48336C3.67085 6.85002 3.97085 7.15002 4.33752 7.15002Z" fill="white"/>
</svg>
