<svg width="30" height="30" viewBox="0 0 30 30" fill="none" xmlns="http://www.w3.org/2000/svg">
<path d="M21.1813 19.5748C21.6313 20.0248 21.6313 20.7248 21.1813 21.1748C20.9563 21.3998 20.6813 21.4998 20.3813 21.4998C20.0813 21.4998 19.8063 21.3998 19.5813 21.1748L15.0063 16.5998L10.4313 21.1748C10.2063 21.3998 9.93127 21.4998 9.63127 21.4998C9.33127 21.4998 9.05629 21.3998 8.83129 21.1748C8.38129 20.7248 8.38129 20.0248 8.83129 19.5748L13.4063 14.9998L8.83129 10.4248C8.38129 9.97481 8.38129 9.2748 8.83129 8.8248C9.28129 8.3748 9.98126 8.3748 10.4313 8.8248L15.0063 13.3998L19.5813 8.8248C20.0313 8.3748 20.7313 8.3748 21.1813 8.8248C21.6313 9.2748 21.6313 9.97481 21.1813 10.4248L16.6062 14.9998L21.1813 19.5748Z" fill="#ED7B6D"/>
</svg>
