<svg width="29" height="29" viewBox="0 0 29 29" fill="none" xmlns="http://www.w3.org/2000/svg">
<path d="M12.0833 3.625H3.625V12.0833H12.0833V3.625Z" stroke="white" stroke-linecap="round" stroke-linejoin="round"/>
<path d="M25.3763 3.625H16.918V12.0833H25.3763V3.625Z" stroke="white" stroke-linecap="round" stroke-linejoin="round"/>
<path d="M25.3763 16.918H16.918V25.3763H25.3763V16.918Z" stroke="white" stroke-linecap="round" stroke-linejoin="round"/>
<path d="M12.0833 16.918H3.625V25.3763H12.0833V16.918Z" stroke="white" stroke-linecap="round" stroke-linejoin="round"/>
</svg>
