<svg width="29" height="29" viewBox="0 0 29 29" fill="none" xmlns="http://www.w3.org/2000/svg">
<path d="M24.1654 25.375V22.9583C24.1654 21.6765 23.6561 20.4471 22.7497 19.5407C21.8433 18.6342 20.6139 18.125 19.332 18.125H9.66536C8.38348 18.125 7.15411 18.6342 6.24768 19.5407C5.34126 20.4471 4.83203 21.6765 4.83203 22.9583V25.375" stroke="white" stroke-linecap="round" stroke-linejoin="round"/>
<path d="M14.5013 13.2917C17.1707 13.2917 19.3346 11.1277 19.3346 8.45833C19.3346 5.78896 17.1707 3.625 14.5013 3.625C11.8319 3.625 9.66797 5.78896 9.66797 8.45833C9.66797 11.1277 11.8319 13.2917 14.5013 13.2917Z" stroke="white" stroke-linecap="round" stroke-linejoin="round"/>
</svg>
