<svg width="20" height="20" viewBox="0 0 20 20" fill="none" xmlns="http://www.w3.org/2000/svg">
<g>
<path d="M18.878 6.6259H16.857L14.044 1.31265C13.8923 1.02597 13.5369 0.916596 13.2501 1.06838C12.9634 1.22016 12.854 1.57565 13.0058 1.86233L15.5278 6.6259H4.46881L6.99079 1.86233C7.14257 1.57565 7.0332 1.22016 6.74651 1.06838C6.45991 0.916635 6.10434 1.02597 5.95256 1.31265L3.13955 6.6259H1.12203C0.503353 6.6259 0 7.12925 0 7.74793V9.05275C0 9.64539 0.461922 10.1319 1.04465 10.1718L3.01522 18.3646C3.0787 18.6286 3.31483 18.8146 3.58632 18.8146H16.4098C16.6812 18.8146 16.9172 18.6287 16.9808 18.3649L18.956 10.1717C19.5384 10.1315 20 9.64515 20 9.05275V7.74793C20 7.12925 19.4967 6.6259 18.878 6.6259ZM1.17478 7.80068H18.8252V8.99997H1.17478V7.80068ZM16.9891 13.318H14.4173L14.8098 10.1747H17.7469L16.9891 13.318ZM10.5882 17.6398V14.4928H13.0867L12.6938 17.6398H10.5882ZM7.30766 17.6398L6.91439 14.4928H9.41341V17.6398H7.30766ZM2.25365 10.1747H5.19091L5.58372 13.318H3.0097L2.25365 10.1747ZM6.37477 10.1747H9.41341V13.318H6.76758L6.37477 10.1747ZM10.5882 13.318V10.1747H13.6259L13.2334 13.318H10.5882ZM3.29224 14.4928H5.73049L6.12376 17.6398H4.04918L3.29224 14.4928ZM15.9472 17.6398H13.8777L14.2706 14.4928H16.7058L15.9472 17.6398Z" fill="white"/>
</g>
<defs>
</defs>
</svg>
