<svg width="25" height="24" viewBox="0 0 25 24" fill="none" xmlns="http://www.w3.org/2000/svg">
<path d="M9.10596 18L15.0878 12L9.10596 6" stroke="#AC4AEB" stroke-width="2" stroke-linecap="round" stroke-linejoin="round"/>
</svg>
