<?xml version="1.0" encoding="iso-8859-1"?>
<!-- Generator: Adobe Illustrator 19.0.0, SVG Export Plug-In . SVG Version: 6.00 Build 0)  -->
<svg version="1.1" id="Capa_1" xmlns="http://www.w3.org/2000/svg" xmlns:xlink="http://www.w3.org/1999/xlink" x="0px" y="0px"
	 viewBox="0 0 512 512" style="enable-background:new 0 0 512 512;" xml:space="preserve">
<g>
	<g>
		<path d="M505.285,323.415c-6.813-18.046-18.324-34.808-33.287-48.474c-6.72-6.137-13.094-14.155-19.049-23.206
			c6.55-7.943,18.053-25.035,13.588-42.894c-1.336-5.342-5.381-15.015-12.367-29.574c-1.798-3.747-6.292-5.326-10.041-3.529
			c-3.747,1.798-5.328,6.294-3.529,10.041c8.034,16.743,10.598,23.768,11.334,26.713c2.17,8.678-2.543,18.464-7.347,25.41
			c-2.198-3.921-4.383-8.048-6.552-12.378c-5.735-11.466-10.844-23.3-15.217-34.352c-0.164-0.412-0.327-0.823-0.49-1.237
			c-0.232-0.591-0.46-1.176-0.687-1.762c-0.273-0.702-0.545-1.407-0.818-2.115c-0.172-0.447-0.343-0.893-0.512-1.337
			c-0.453-1.186-0.903-2.378-1.354-3.582c-4.278-11.455-10.568-21.486-18.305-29.697c-14.395-15.279-33.813-24.243-54.699-24.243
			H209.114c-4.156,0-7.526,3.37-7.526,7.526c0,4.156,3.37,7.526,7.526,7.526h136.842c16.103,0,31.172,6.769,42.656,18.396
			c0.057,0.058,0.112,0.119,0.17,0.178c2.056,2.097,3.993,4.355,5.802,6.754c0.83,1.101,1.632,2.233,2.405,3.394
			c0.947,1.421,1.85,2.887,2.708,4.394c0.696,1.225,1.372,2.472,2.006,3.751c1.161,2.341,2.215,4.773,3.154,7.287
			c0.669,1.791,1.341,3.561,2.015,5.315c0.205,0.532,0.408,1.047,0.613,1.573c0.472,1.215,0.943,2.429,1.417,3.627
			c0.218,0.55,0.435,1.086,0.652,1.63c0.465,1.162,0.929,2.322,1.396,3.466c0.193,0.473,0.385,0.934,0.578,1.402
			c0.498,1.21,0.996,2.416,1.497,3.607c0.141,0.336,0.282,0.664,0.423,0.997c0.559,1.321,1.119,2.631,1.68,3.927
			c0.065,0.151,0.13,0.298,0.196,0.449c7.065,16.242,14.365,30.488,21.816,42.523c0.153,0.247,0.319,0.483,0.498,0.707
			c9.317,14.897,17.613,24.404,24.209,30.428c28.126,25.687,40.894,61.883,32.53,92.213c-7.42,26.904-34.353,62.678-120.533,80.324
			c-4.072,0.834-6.697,4.811-5.863,8.883c0.73,3.562,3.865,6.018,7.366,6.018c0.501,0,1.008-0.05,1.517-0.155
			c93.651-19.174,123.486-60.107,132.024-91.069C514.029,363.627,512.783,343.275,505.285,323.415z"/>
	</g>
</g>
<g>
	<g>
		<path d="M440.657,152.158c-20.203-39.417-60.268-63.903-104.559-63.903h-4.91l-22.015-22.672
			c1.927-3.548,3.023-7.611,3.023-11.925c0-13.825-11.247-25.072-25.072-25.072s-25.072,11.247-25.072,25.072
			s11.247,25.072,25.072,25.072c4.041,0,7.857-0.966,11.241-2.671l11.841,12.195h-108.89l12.327-12.695
			c3.384,1.705,7.201,2.671,11.241,2.671c13.825,0,25.072-11.248,25.072-25.072c0-13.825-11.247-25.072-25.072-25.072
			s-25.072,11.247-25.072,25.072c0,4.314,1.096,8.376,3.022,11.925l-22.498,23.171h-4.425c-44.293,0-84.357,24.486-104.559,63.903
			c-15.384,30.016-23.851,48.558-25.882,56.684c-4.464,17.858,7.038,34.95,13.588,42.893c-5.954,9.05-12.329,17.068-19.049,23.206
			c-15.899,14.522-28.215,33.122-34.678,52.376c-7.284,21.7-7.101,43.569,0.532,63.243c10.874,28.029,35.633,50.29,73.59,66.165
			c43.138,18.041,102.538,27.188,176.55,27.188c32.873,0,63.208-1.827,90.161-5.43c4.12-0.551,7.013-4.337,6.462-8.457
			c-0.551-4.12-4.335-7.015-8.456-6.463c-26.294,3.515-55.958,5.297-88.167,5.297c-177.167,0-223.974-52.469-236.107-83.745
			c-6.344-16.355-6.446-34.685-0.295-53.01c5.663-16.87,16.515-33.224,30.559-46.051c8.755-7.997,16.895-18.666,24.306-30.566
			c0.139-0.185,0.276-0.371,0.399-0.57c9.39-15.168,18.541-33.838,27.281-55.61c0.042-0.103,0.082-0.207,0.124-0.31
			c0.521-1.298,1.04-2.606,1.557-3.927c0.385-0.983,0.767-1.961,1.141-2.929c0.184-0.476,0.366-0.953,0.549-1.432
			c0.556-1.453,1.103-2.894,1.632-4.309c0.939-2.515,1.994-4.946,3.154-7.287c0.634-1.28,1.309-2.526,2.006-3.751
			c0.858-1.508,1.761-2.973,2.708-4.394c0.958-1.437,1.96-2.83,3.003-4.174c1.637-2.108,3.373-4.104,5.205-5.973
			c0.057-0.058,0.112-0.119,0.17-0.178c11.484-11.626,26.553-18.396,42.656-18.396h12.958c4.156,0,7.526-3.37,7.526-7.526
			s-3.37-7.526-7.526-7.526h-12.958c-20.885,0-40.304,8.964-54.699,24.243c-7.737,8.211-14.027,18.242-18.305,29.697
			c-0.45,1.202-0.9,2.392-1.351,3.576c-0.171,0.449-0.344,0.9-0.518,1.352c-0.269,0.701-0.539,1.398-0.809,2.092
			c-0.231,0.592-0.46,1.184-0.694,1.782c-0.159,0.404-0.318,0.804-0.477,1.206c-4.373,11.054-9.483,22.893-15.22,34.363
			c-2.167,4.325-4.349,8.448-6.545,12.366c-4.584-6.557-9.627-16.326-7.362-25.382c0.971-3.883,5.468-15.995,24.675-53.469
			c17.614-34.367,52.546-55.716,91.164-55.716h160.186c38.617,0,73.549,21.349,91.164,55.716c1.896,3.699,6.432,5.16,10.13,3.264
			C441.092,160.393,442.554,155.857,440.657,152.158z M287.124,63.679c-5.525,0-10.02-4.495-10.02-10.02s4.495-10.02,10.02-10.02
			s10.02,4.496,10.02,10.02S292.649,63.679,287.124,63.679z M224.884,43.139c5.525,0,10.02,4.496,10.02,10.02
			c0,5.525-4.495,10.02-10.02,10.02s-10.02-4.495-10.02-10.02C214.864,47.634,219.358,43.139,224.884,43.139z"/>
	</g>
</g>
<g>
	<g>
		<path d="M285.143,309.546c-6.014-6.66-15.166-10.555-27.203-11.575c-7.464-0.633-12.673-3.01-15.482-7.065
			c-2.906-4.197-3.112-9.838-2.774-13.832c0.411-4.853,2.415-9.056,5.644-11.838c3.747-3.229,9.228-4.639,15.857-4.077
			c4.359,0.369,7.947,2.708,10.968,7.149c2.63,3.867,3.692,7.791,3.693,7.792c1.025,4.029,5.123,6.463,9.15,5.437
			c4.028-1.025,6.463-5.121,5.438-9.15c-0.249-0.978-6.255-23.598-26.902-26.101v-12.763c0-4.156-3.37-7.526-7.526-7.526
			c-4.156,0-7.526,3.37-7.526,7.526v13.661c-5.855,1.5-10.1,4.169-12.977,6.648c-6.229,5.368-10.069,13.169-10.815,21.968
			c-0.785,9.256,1.082,17.442,5.397,23.673c5.487,7.924,14.432,12.464,26.585,13.494c7.995,0.677,13.978,2.982,17.302,6.664
			c2.671,2.958,3.812,6.966,3.393,11.913c-0.788,9.282-6.951,19.669-21.712,18.425c-14.434-1.224-21.666-15.701-21.82-16.015
			c-1.776-3.74-6.246-5.341-9.997-3.58c-3.762,1.767-5.38,6.25-3.612,10.012c0.394,0.84,9.103,18.91,28.255,23.61v13.59
			c0,4.156,3.37,7.526,7.526,7.526c4.156,0,7.526-3.37,7.526-7.526v-12.856c17.403-2.528,27.562-16.924,28.832-31.913
			C293.136,323.683,290.64,315.635,285.143,309.546z"/>
	</g>
</g>
<g>
</g>
<g>
</g>
<g>
</g>
<g>
</g>
<g>
</g>
<g>
</g>
<g>
</g>
<g>
</g>
<g>
</g>
<g>
</g>
<g>
</g>
<g>
</g>
<g>
</g>
<g>
</g>
<g>
</g>
</svg>
