<svg width="45" height="46" viewBox="0 0 45 46" fill="none" xmlns="http://www.w3.org/2000/svg">
<path d="M7.5 40.918V5.66797C7.5 5.04665 8.00368 4.54297 8.625 4.54297H30.4716C30.7699 4.54297 31.056 4.66149 31.2669 4.87248L37.1706 10.776C37.3815 10.987 37.5 11.2731 37.5 11.5715V40.918C37.5 41.5393 36.9964 42.043 36.375 42.043H8.625C8.00368 42.043 7.5 41.5393 7.5 40.918Z" stroke="black" stroke-width="1.5" stroke-linecap="round" stroke-linejoin="round"/>
<path d="M30 10.918V5.20587C30 4.83976 30.2968 4.54297 30.663 4.54297C30.8387 4.54297 31.0072 4.61281 31.1317 4.73712L37.3058 10.9113C37.4303 11.0356 37.5 11.2042 37.5 11.3801C37.5 11.7462 37.2032 12.043 36.837 12.043H31.125C30.5036 12.043 30 11.5393 30 10.918Z" fill="black" stroke="black" stroke-width="1.5" stroke-linecap="round" stroke-linejoin="round"/>
<path d="M15 19.543H30" stroke="black" stroke-width="1.5" stroke-linecap="round" stroke-linejoin="round"/>
<path d="M15 34.543H30" stroke="black" stroke-width="1.5" stroke-linecap="round" stroke-linejoin="round"/>
<path d="M15 27.043H22.5" stroke="black" stroke-width="1.5" stroke-linecap="round" stroke-linejoin="round"/>
</svg>
