<svg width="46" height="45" viewBox="0 0 46 45" fill="none" xmlns="http://www.w3.org/2000/svg">
<path d="M38.1821 13.125H8.18213C6.11106 13.125 4.43213 14.8039 4.43213 16.875V35.625C4.43213 37.6961 6.11106 39.375 8.18213 39.375H38.1821C40.2532 39.375 41.9321 37.6961 41.9321 35.625V16.875C41.9321 14.8039 40.2532 13.125 38.1821 13.125Z" stroke="white" stroke-linecap="round" stroke-linejoin="round"/>
<path d="M30.6821 39.375V9.375C30.6821 8.38044 30.287 7.42661 29.5838 6.72335C28.8805 6.02009 27.9267 5.625 26.9321 5.625H19.4321C18.4376 5.625 17.4837 6.02009 16.7805 6.72335C16.0772 7.42661 15.6821 8.38044 15.6821 9.375V39.375" stroke="white" stroke-linecap="round" stroke-linejoin="round"/>
</svg>
