<svg width="34" height="34" viewBox="0 0 34 34" fill="none" xmlns="http://www.w3.org/2000/svg">
<path d="M17.1246 33.7461C26.2395 33.7461 33.6246 26.361 33.6246 17.2461C33.6246 8.13122 26.2395 0.746094 17.1246 0.746094C8.00976 0.746094 0.624634 8.13122 0.624634 17.2461C0.624634 26.361 8.00976 33.7461 17.1246 33.7461ZM8.17476 16.8886L24.0835 10.7547C24.8219 10.488 25.4668 10.9348 25.2275 12.0513L25.2289 12.05L22.5201 24.8113C22.3194 25.7161 21.7818 25.9361 21.0296 25.5098L16.9046 22.4697L14.915 24.3865C14.695 24.6065 14.5094 24.7921 14.0831 24.7921L14.376 20.5942L22.021 13.6876C22.3538 13.3947 21.9468 13.2297 21.5081 13.5212L12.0605 19.4695L7.98776 18.199C7.10363 17.9185 7.08438 17.3148 8.17476 16.8886Z" fill="white"/>
</svg>
