<svg width="161" height="139" viewBox="0 0 161 139" fill="none" xmlns="http://www.w3.org/2000/svg">
<path d="M42.9995 3C39.1377 10.2427 35.7155 26.963 52.9212 35.902C74.4284 47.0758 79.0161 56.5122 75.329 71.3149C71.6419 86.1175 83.5418 99.1877 95.8346 101.581C108.127 103.975 124.491 112.297 119.616 135.165" stroke="#2FE2ED" stroke-width="8"/>
</svg>
