<svg width="34" height="34" viewBox="0 0 34 34" fill="none" xmlns="http://www.w3.org/2000/svg">
<path d="M16.8795 0.746094H16.8712C7.77355 0.746094 0.375366 8.14634 0.375366 17.2461C0.375366 20.8555 1.53862 24.2008 3.51655 26.9172L1.46024 33.0469L7.80243 31.0195C10.4115 32.7478 13.5238 33.7461 16.8795 33.7461C25.9772 33.7461 33.3754 26.3438 33.3754 17.2461C33.3754 8.14841 25.9772 0.746094 16.8795 0.746094ZM26.4804 24.0462C26.0824 25.1702 24.5025 26.1025 23.2423 26.3747C22.3802 26.5583 21.2541 26.7047 17.4632 25.1331C12.6142 23.1242 9.49162 18.1969 9.24824 17.8772C9.01518 17.5575 7.28887 15.2682 7.28887 12.9004C7.28887 10.5327 8.4913 9.37972 8.97599 8.88472C9.37405 8.47841 10.032 8.29278 10.6631 8.29278C10.8673 8.29278 11.0509 8.30309 11.2159 8.31134C11.7006 8.33197 11.9439 8.36084 12.2636 9.12603C12.6617 10.0851 13.6311 12.4528 13.7466 12.6962C13.8641 12.9396 13.9817 13.2696 13.8167 13.5893C13.662 13.9193 13.5259 14.0657 13.2825 14.3462C13.0391 14.6267 12.8081 14.8412 12.5647 15.1423C12.342 15.4043 12.0904 15.6848 12.3709 16.1695C12.6514 16.6438 13.6207 18.2258 15.048 19.4963C16.8898 21.136 18.3831 21.6598 18.9172 21.8826C19.3153 22.0476 19.7897 22.0084 20.0805 21.699C20.4497 21.301 20.9055 20.641 21.3696 19.9913C21.6996 19.5252 22.1162 19.4674 22.5534 19.6324C22.9989 19.7871 25.3564 20.9524 25.8411 21.1937C26.3257 21.4371 26.6454 21.5526 26.763 21.7568C26.8785 21.961 26.8785 22.92 26.4804 24.0462Z" fill="white"/>
</svg>
