<?xml version="1.0" encoding="utf-8"?>
<!-- Generator: Adobe Illustrator 25.2.3, SVG Export Plug-In . SVG Version: 6.00 Build 0)  -->
<svg version="1.1" id="Слой_1" xmlns="http://www.w3.org/2000/svg" xmlns:xlink="http://www.w3.org/1999/xlink" x="0px" y="0px"
	 viewBox="0 0 46 29" style="enable-background:new 0 0 46 29;" xml:space="preserve">
<g>
	<path style="fill:#131313;" d="M9.3,23.7c-0.1-0.7-0.4-1.4-0.8-2c0.1-0.2,0.1-0.5-0.1-0.7c-0.1-0.1-0.3-0.2-0.4-0.2l0,0
		c-0.1,0-0.2,0-0.3,0.1c-0.6-0.5-1.3-0.8-2-0.9c-0.1-0.2-0.3-0.4-0.6-0.4c-0.3,0-0.5,0.2-0.6,0.4c-0.8,0-1.5,0.3-2.1,0.8
		c-0.1,0-0.1,0-0.2,0l0,0c-0.2,0-0.3,0.1-0.4,0.2c-0.2,0.2-0.2,0.4-0.1,0.6c-0.5,0.6-0.8,1.4-0.9,2.1c-0.2,0.1-0.3,0.3-0.3,0.6
		c0,0.2,0.1,0.5,0.4,0.6C1,25.7,1.3,26.4,1.8,27c-0.1,0.2,0,0.5,0.1,0.7c0.1,0.1,0.3,0.2,0.4,0.2l0,0c0.1,0,0.2,0,0.2,0
		c0.6,0.5,1.3,0.7,2.1,0.8c0,0.1,0.2,0.3,0.5,0.3c0.3,0,0.5-0.2,0.6-0.4c0.7-0.1,1.4-0.4,2-0.8c0.1,0.1,0.2,0.1,0.3,0.1l0,0
		c0.2,0,0.3-0.1,0.4-0.2c0.2-0.2,0.2-0.5,0.1-0.7c0.4-0.6,0.7-1.3,0.8-2c0.3-0.1,0.5-0.3,0.5-0.6C9.8,24,9.6,23.8,9.3,23.7z
		 M8.6,24.5c-0.1,0.8-0.4,1.5-0.9,2.1c-0.1,0.1-0.1,0.2-0.1,0.2c-0.1,0-0.2,0-0.2,0.1c-0.6,0.5-1.3,0.8-2.1,0.9
		c-0.1,0-0.2,0-0.2,0.1C5,27.8,5,27.8,4.9,27.8c-0.8,0-1.6-0.3-2.2-0.9c-0.1-0.1-0.2-0.1-0.2-0.1l0,0c0-0.1,0-0.2-0.1-0.2
		c-0.5-0.6-0.9-1.4-0.9-2.2c0-0.1,0-0.2-0.1-0.2c0.1-0.1,0.1-0.1,0.1-0.2c0-0.8,0.4-1.6,0.9-2.2c0.1-0.1,0.1-0.2,0.1-0.2
		c0.1,0,0.2,0,0.2-0.1C3.3,21,4,20.7,4.8,20.6c0.1,0,0.2,0,0.2-0.1c0.1,0.1,0.1,0.1,0.2,0.1C6,20.7,6.7,21,7.3,21.5
		c0.1,0.1,0.1,0.1,0.2,0.1c0,0.1,0,0.2,0.1,0.2c0.5,0.6,0.8,1.3,0.9,2.1c0,0.1,0,0.2,0.1,0.2C8.7,24.3,8.6,24.4,8.6,24.5z"/>
	<path style="fill:#131313;" d="M5.1,21.9c-1.3,0-2.4,1.1-2.4,2.4s1.1,2.4,2.4,2.4s2.4-1.1,2.4-2.4C7.5,22.9,6.4,21.9,5.1,21.9z
		 M5.1,26c-0.9,0-1.7-0.8-1.7-1.7c0-0.9,0.8-1.7,1.7-1.7s1.7,0.8,1.7,1.7S6,26,5.1,26z"/>
	<path style="fill:#131313;" d="M5.1,23.7c-0.3,0-0.6,0.3-0.6,0.6c0,0.3,0.3,0.6,0.6,0.6c0.3,0,0.6-0.3,0.6-0.6
		C5.7,23.9,5.4,23.7,5.1,23.7z"/>
	<path style="fill:#131313;" d="M12,13.5c-1.2,0.1-2.3,0.3-3.4,0.7c-0.1,0-0.1,0.1-0.2,0.1c-0.3,0.4-0.4,0.6-0.6,1.4
		c-0.2,0.6-0.2,1.1-0.2,1.7c0,0.2,0.2,0.3,0.3,0.4c1.5,0,2.9,0.1,4.2,0.1s2.7,0.1,4.3,0.1l0,0c0.1,0,0.2,0,0.3-0.1
		c0.1-0.1,0.1-0.2,0.1-0.3c-0.1-0.6-0.2-1.4-0.7-2.3c-0.4-0.7-0.8-1-1.1-1.2c-0.1-0.1-0.2-0.1-0.3-0.2c0,0-0.1-0.1-0.2-0.1
		c-0.1,0-0.2-0.1-0.3-0.1C13.6,13.6,13.1,13.4,12,13.5z M14.3,14.5c0.1,0.1,0.2,0.1,0.3,0.2c0.3,0.2,0.6,0.4,0.9,0.9
		c0.3,0.6,0.5,1.2,0.6,1.7c-1.4,0-2.6-0.1-3.8-0.1s-2.4-0.1-3.8-0.1c0-0.4,0.1-0.8,0.2-1.1c0.2-0.6,0.3-0.8,0.5-1.1
		c1-0.4,2-0.6,3.1-0.6c0.9,0,1.4,0.1,1.9,0.2C14.1,14.4,14.2,14.4,14.3,14.5z"/>
	<path style="fill:#131313;" d="M35.1,3.8c0-0.2-0.7-3.7-3.3-3.8l0,0c-0.4,0-2.3,0.1-3.5,1.6l-0.2,0.3c-0.5,0.6-0.7,0.8-1.2,1.2
		c-0.6,0.4-1,0.3-1.2,0.2C24.9,3,24.8,2.9,24,2.7c-0.6-0.2-1.2-0.2-1.8,0h-0.1c-1.1,0.7-2.3,1.4-3.4,2s-2.2,1.2-3,1.8h-0.4
		c-0.1,0-0.1,0-0.2,0.1L0.3,16.3c-0.1,0-0.1,0.1-0.1,0.2C0,17.1-0.2,18.4,1,19.2c-0.3,0.6-0.5,1.2-0.6,1.5c0,0.2,0,0.3,0.2,0.4
		c0.1,0.1,0.3,0,0.4-0.1c1.3-1.6,3.7-2.4,5.5-1.9c2.3,0.6,4.1,3.1,3.9,5.5c0,0.1,0,0.2,0.1,0.3c0.1,0.1,0.2,0.1,0.3,0.1h8.6
		c0.2,0,0.4-0.2,0.4-0.3c0-0.8,0.2-2.2,1.3-3.5c1.8-2.1,5.2-2.2,5.2-2.2l0,0c0.2,0,0.4-0.2,0.4-0.4c0-0.2-0.2-0.4-0.4-0.4l0,0
		c-1.8,0-6.8-0.5-7.9-0.7c-0.2-1.2-0.6-2.3-1.3-3.2c-0.4-0.6-0.9-1.1-1.4-1.5l-0.1-0.1c-0.8-0.3-1.7-0.4-2.6-0.5l4.6-3.1
		c0.1-0.1,0.2-0.2,0.2-0.3l-0.1-0.5c0.8-0.5,1.6-1,2.4-1.5c0.9-0.5,1.8-1.1,2.7-1.7c0.2,0.1,0.4,0.3,0.6,0.4
		c0.5,0.2,1.6,0.6,2.8,0.4c0.5-0.1,0.8-0.3,1.1-0.4c0.2-0.1,0.4-0.2,0.4-0.1c0,0,0,0.1,0.1,0.2c0,0.1,0.1,0.3,0.2,0.6
		c0.3,0.5,0.7,0.8,1.2,1.1c0,0,0.1,0,0.2,0l0,0c3,0,4.9,0,5,0s0.3-0.1,0.3-0.2s0-0.3-0.1-0.4c-0.2-0.2-1.9-1.3-4.3-1.1
		c-0.8-0.9-1.1-1.3-0.7-2.1c0.5-1.1,1.5-1.2,2-1.2c0,0,0,0,0.1,0c0.9,0,2.1,1.4,2.5,1.9c0.1,0.1,0.3,0.2,0.4,0.1
		C35,4.1,35.1,3.9,35.1,3.8z M11.2,24.2c0-0.6-0.1-1.3-0.3-1.9c1.4,0.1,2.8,0.2,4.1,0.3c1.4,0.1,2.9,0.2,4.3,0.4
		c-0.1,0.4-0.2,0.9-0.2,1.2H11.2z M16.6,14.7c0.6,0.9,1,2,1.2,3.1c0,0.1,0.1,0.2,0.2,0.3c0.4,0.2,3.1,0.5,5.5,0.7
		c-1,0.4-2.1,0.9-2.9,1.9c-0.5,0.6-0.8,1.2-1,1.7c-1.5-0.1-3-0.3-4.5-0.4s-3-0.3-4.5-0.4c-0.8-1.6-2.2-2.8-3.8-3.2
		c-1.7-0.4-3.6,0-5.1,1.1c0.4-0.7,0.9-1.4,1.8-1.8c1.2-0.6,2.5-0.2,2.9-0.1h0.1c0.1,0,0.2,0,0.3-0.1c0.1-0.1,0.1-0.2,0.1-0.3
		c0-0.6,0.1-1.1,0.3-1.6c0.2-0.7,0.6-1.4,1.1-2c1.1-0.4,2.2-0.7,3.4-0.8c1.3-0.1,2.6,0.1,3.8,0.5C15.9,13.7,16.3,14.2,16.6,14.7z
		 M31.9,1.4c-0.5,0-1.9,0.1-2.7,1.6c-0.6,1.3,0,2.2,0.9,3.1c0.1,0.1,0.2,0.1,0.3,0.1c1-0.1,1.9,0.1,2.6,0.3c-0.8,0-2,0-3.3,0
		C29.3,6.2,29,6,28.8,5.7c-0.1-0.2-0.1-0.3-0.2-0.4c-0.1-0.2-0.1-0.4-0.4-0.6c-0.4-0.3-0.8-0.1-1.1,0.1c-0.3,0.1-0.6,0.2-1,0.3
		c-1.1,0.2-2-0.2-2.4-0.3c-0.2-0.1-0.5-0.3-0.7-0.4c-0.1-0.1-0.3-0.1-0.4,0c-1,0.6-2,1.2-2.9,1.8c-0.9,0.5-1.7,1.1-2.6,1.6
		c0,0-0.1,0.2-0.1,0.3l0.1,0.5l-5.2,3.5c-0.1,0-0.2,0-0.3,0C10.3,12.2,9,12.5,7.9,13c-0.1,0-0.1,0.1-0.1,0.1c-0.6,0.7-1,1.5-1.3,2.3
		c-0.1,0.5-0.2,0.9-0.3,1.4c-0.7-0.2-1.9-0.3-3.1,0.2c-0.8,0.4-1.3,0.9-1.8,1.5c-0.8-0.5-0.6-1.4-0.5-1.7l14.6-9.6h0.4
		c0.1,0,0.1,0,0.2-0.1c0.8-0.5,1.9-1.2,3.1-1.8c1.1-0.6,2.3-1.3,3.4-2c0.5-0.1,0.9-0.1,1.4,0c0.7,0.2,0.8,0.2,1.6,0.6
		c0.6,0.2,1.2,0.1,1.9-0.3c0.6-0.4,0.9-0.7,1.4-1.3L28.9,2c1-1.2,2.6-1.3,2.9-1.3l0,0c1,0,1.6,0.8,2,1.6C33.3,1.8,32.6,1.4,31.9,1.4
		z"/>
	<path style="fill:#131313;" d="M29.7,23.7c-0.1-0.7-0.4-1.4-0.8-2c0.1-0.2,0.1-0.5-0.1-0.7s-0.5-0.2-0.7-0.1
		c-0.6-0.5-1.3-0.8-2-0.9c-0.1-0.2-0.3-0.4-0.6-0.4c-0.3,0-0.5,0.2-0.6,0.4c-0.8,0.1-1.5,0.4-2.1,0.9c-0.2-0.1-0.5,0-0.6,0.1
		c-0.2,0.2-0.2,0.4-0.1,0.6c-0.5,0.6-0.8,1.4-0.9,2.1c-0.2,0.1-0.3,0.3-0.3,0.6c0,0.2,0.1,0.5,0.4,0.6c0.1,0.8,0.4,1.5,0.9,2.1
		c-0.1,0.2,0,0.5,0.1,0.7c0.2,0.2,0.5,0.2,0.7,0.1c0.6,0.5,1.3,0.7,2.1,0.8c0.1,0.2,0.3,0.4,0.6,0.4c0.3,0,0.5-0.2,0.6-0.4
		c0.7-0.1,1.4-0.4,2-0.8c0.2,0.1,0.5,0.1,0.7-0.1s0.2-0.5,0.1-0.7c0.4-0.6,0.7-1.3,0.8-2c0.3-0.1,0.5-0.3,0.5-0.6
		C30.2,24,30,23.8,29.7,23.7z M29,24.5c-0.1,0.8-0.4,1.5-0.9,2.1C28,26.7,28,26.8,28,26.8c-0.1,0-0.2,0-0.2,0.1
		c-0.6,0.5-1.3,0.8-2.1,0.9c-0.1,0-0.2,0-0.2,0.1c-0.1-0.1-0.1-0.1-0.2-0.1c-0.8,0-1.6-0.3-2.2-0.9c-0.1-0.1-0.2-0.1-0.2-0.1l0,0
		c0-0.1,0-0.2-0.1-0.2c-0.5-0.6-0.9-1.4-0.9-2.2c0-0.1,0-0.2-0.1-0.2c0.1-0.1,0.1-0.1,0.1-0.2c0-0.8,0.4-1.6,0.9-2.2
		c0.1-0.1,0.1-0.2,0.1-0.2c0.1,0,0.2,0,0.2-0.1c0.6-0.5,1.4-0.8,2.2-0.9c0.1,0,0.2,0,0.2-0.1c0.1,0.1,0.1,0.1,0.2,0.1
		c0.8,0.1,1.5,0.4,2.1,0.9c0.1,0.1,0.2,0.1,0.2,0.1c0,0.1,0,0.2,0.1,0.2c0.5,0.6,0.8,1.3,0.9,2.1c0,0.1,0,0.2,0.1,0.2
		C29.1,24.3,29,24.4,29,24.5z"/>
	<path style="fill:#131313;" d="M25.5,21.9c-1.3,0-2.4,1.1-2.4,2.4s1.1,2.4,2.4,2.4s2.4-1.1,2.4-2.4C27.9,22.9,26.8,21.9,25.5,21.9z
		 M25.5,26c-0.9,0-1.7-0.8-1.7-1.7c0-0.9,0.8-1.7,1.7-1.7c0.9,0,1.7,0.8,1.7,1.7S26.4,26,25.5,26z"/>
	<path style="fill:#131313;" d="M25.5,23.7c-0.3,0-0.6,0.3-0.6,0.6c0,0.3,0.3,0.6,0.6,0.6c0.3,0,0.6-0.3,0.6-0.6
		S25.8,23.7,25.5,23.7z"/>
</g>
</svg>
