<svg width="294" height="138" viewBox="0 0 294 138" fill="none" xmlns="http://www.w3.org/2000/svg">
<path d="M3.72863 67.0923L18 67.0923L18 70.3951L6.37903 70.3951L6.37903 73.2494L3.72863 73.2494L3.72863 67.0923ZM6.82756 54.3948C6.82756 53.2123 7.07221 52.1589 7.56151 51.2347C8.03723 50.2968 8.71002 49.5629 9.57989 49.0328C10.4498 48.5027 11.4284 48.2377 12.5157 48.2377C13.6031 48.2377 14.5817 48.5027 15.4515 49.0328C16.3214 49.5629 17.001 50.2968 17.4903 51.2347C17.966 52.1589 18.2039 53.2123 18.2039 54.3948C18.2039 55.4413 18.034 56.3928 17.6942 57.249C17.3408 58.0917 16.8379 58.7917 16.1855 59.349L14.4729 57.5345C15.3292 56.7054 15.7574 55.6996 15.7574 54.5171C15.7574 53.7288 15.5603 53.0492 15.1661 52.4783C14.772 51.9075 14.2351 51.5201 13.5555 51.3162L13.5555 55.9238L11.374 55.9238L11.374 51.357C10.7216 51.5745 10.2051 51.9618 9.82455 52.5191C9.44398 53.0764 9.25369 53.7424 9.25369 54.5171C9.25369 55.686 9.68863 56.6918 10.5585 57.5345L8.86633 59.349C8.20033 58.7917 7.69743 58.0917 7.35764 57.249C7.00425 56.3928 6.82756 55.4413 6.82756 54.3948ZM9.64106 37.2628L9.64106 40.9733L18 40.9733L18 44.1334L9.64106 44.1334L9.64106 47.844L7.03143 47.844L7.03143 37.2628L9.64106 37.2628ZM6.86833 31.3064C6.86833 29.6074 7.27609 28.3026 8.09159 27.3919C8.89351 26.4813 10.11 26.026 11.741 26.026L18 26.026L18 29.0026L16.634 29.0026C17.6534 29.6006 18.1631 30.7151 18.1631 32.3461C18.1631 33.1888 18.0204 33.9228 17.735 34.548C17.4495 35.1596 17.0554 35.6286 16.5525 35.9548C16.0496 36.281 15.4787 36.4441 14.8399 36.4441C13.8205 36.4441 13.0186 36.0635 12.4342 35.3024C11.8497 34.5276 11.5575 33.3383 11.5575 31.7345L11.5575 29.2064C10.8643 29.2064 10.3342 29.4171 9.96726 29.8385C9.58669 30.2598 9.3964 30.8918 9.3964 31.7345C9.3964 32.319 9.49155 32.8966 9.68183 33.4675C9.85852 34.0247 10.1032 34.5004 10.4158 34.8946L8.19353 36.0363C7.77219 35.4383 7.44598 34.7247 7.21492 33.8956C6.98386 33.0529 6.86833 32.1898 6.86833 31.3064ZM16.0224 31.551C16.0224 31.0074 15.9001 30.5248 15.6554 30.1035C15.3972 29.6822 15.0234 29.3831 14.5341 29.2064L13.4128 29.2064L13.4128 31.3879C13.4128 32.6927 13.8409 33.3451 14.6972 33.3451C15.1049 33.3451 15.4312 33.1888 15.6758 32.8762C15.9069 32.55 16.0224 32.1083 16.0224 31.551ZM7.03143 12.3557L18 12.3557L18 15.5362L9.64105 15.5362L9.64105 20.103L18 20.103L18 23.2631L7.03143 23.2631L7.03143 12.3557Z" fill="#283896"/>
<path d="M137.15 52.1V62H97.475V54.125L117.725 35C119.875 32.95 121.325 31.2 122.075 29.75C122.825 28.25 123.2 26.775 123.2 25.325C123.2 23.225 122.475 21.625 121.025 20.525C119.625 19.375 117.55 18.8 114.8 18.8C112.5 18.8 110.425 19.25 108.575 20.15C106.725 21 105.175 22.3 103.925 24.05L95.075 18.35C97.125 15.3 99.95 12.925 103.55 11.225C107.15 9.475 111.275 8.6 115.925 8.6C119.825 8.6 123.225 9.25 126.125 10.55C129.075 11.8 131.35 13.6 132.95 15.95C134.6 18.25 135.425 20.975 135.425 24.125C135.425 26.975 134.825 29.65 133.625 32.15C132.425 34.65 130.1 37.5 126.65 40.7L114.575 52.1H137.15ZM164.517 62.9C160.167 62.9 156.292 61.825 152.892 59.675C149.492 57.525 146.817 54.425 144.867 50.375C142.967 46.275 142.017 41.4 142.017 35.75C142.017 30.1 142.967 25.25 144.867 21.2C146.817 17.1 149.492 13.975 152.892 11.825C156.292 9.675 160.167 8.6 164.517 8.6C168.867 8.6 172.742 9.675 176.142 11.825C179.542 13.975 182.192 17.1 184.092 21.2C186.042 25.25 187.017 30.1 187.017 35.75C187.017 41.4 186.042 46.275 184.092 50.375C182.192 54.425 179.542 57.525 176.142 59.675C172.742 61.825 168.867 62.9 164.517 62.9ZM164.517 52.625C167.717 52.625 170.217 51.25 172.017 48.5C173.867 45.75 174.792 41.5 174.792 35.75C174.792 30 173.867 25.75 172.017 23C170.217 20.25 167.717 18.875 164.517 18.875C161.367 18.875 158.867 20.25 157.017 23C155.217 25.75 154.317 30 154.317 35.75C154.317 41.5 155.217 45.75 157.017 48.5C158.867 51.25 161.367 52.625 164.517 52.625ZM231.706 52.1V62H192.031V54.125L212.281 35C214.431 32.95 215.881 31.2 216.631 29.75C217.381 28.25 217.756 26.775 217.756 25.325C217.756 23.225 217.031 21.625 215.581 20.525C214.181 19.375 212.106 18.8 209.356 18.8C207.056 18.8 204.981 19.25 203.131 20.15C201.281 21 199.731 22.3 198.481 24.05L189.631 18.35C191.681 15.3 194.506 12.925 198.106 11.225C201.706 9.475 205.831 8.6 210.481 8.6C214.381 8.6 217.781 9.25 220.681 10.55C223.631 11.8 225.906 13.6 227.506 15.95C229.156 18.25 229.981 20.975 229.981 24.125C229.981 26.975 229.381 29.65 228.181 32.15C226.981 34.65 224.656 37.5 221.206 40.7L209.131 52.1H231.706ZM259.072 62.9C254.722 62.9 250.847 61.825 247.447 59.675C244.047 57.525 241.372 54.425 239.422 50.375C237.522 46.275 236.572 41.4 236.572 35.75C236.572 30.1 237.522 25.25 239.422 21.2C241.372 17.1 244.047 13.975 247.447 11.825C250.847 9.675 254.722 8.6 259.072 8.6C263.422 8.6 267.297 9.675 270.697 11.825C274.097 13.975 276.747 17.1 278.647 21.2C280.597 25.25 281.572 30.1 281.572 35.75C281.572 41.4 280.597 46.275 278.647 50.375C276.747 54.425 274.097 57.525 270.697 59.675C267.297 61.825 263.422 62.9 259.072 62.9ZM259.072 52.625C262.272 52.625 264.772 51.25 266.572 48.5C268.422 45.75 269.347 41.5 269.347 35.75C269.347 30 268.422 25.75 266.572 23C264.772 20.25 262.272 18.875 259.072 18.875C255.922 18.875 253.422 20.25 251.572 23C249.772 25.75 248.872 30 248.872 35.75C248.872 41.5 249.772 45.75 251.572 48.5C253.422 51.25 255.922 52.625 259.072 52.625Z" fill="#C2EDDB"/>
<path d="M137.15 119.1V129H97.475V121.125L117.725 102C119.875 99.95 121.325 98.2 122.075 96.75C122.825 95.25 123.2 93.775 123.2 92.325C123.2 90.225 122.475 88.625 121.025 87.525C119.625 86.375 117.55 85.8 114.8 85.8C112.5 85.8 110.425 86.25 108.575 87.15C106.725 88 105.175 89.3 103.925 91.05L95.075 85.35C97.125 82.3 99.95 79.925 103.55 78.225C107.15 76.475 111.275 75.6 115.925 75.6C119.825 75.6 123.225 76.25 126.125 77.55C129.075 78.8 131.35 80.6 132.95 82.95C134.6 85.25 135.425 87.975 135.425 91.125C135.425 93.975 134.825 96.65 133.625 99.15C132.425 101.65 130.1 104.5 126.65 107.7L114.575 119.1H137.15ZM164.517 129.9C160.167 129.9 156.292 128.825 152.892 126.675C149.492 124.525 146.817 121.425 144.867 117.375C142.967 113.275 142.017 108.4 142.017 102.75C142.017 97.1 142.967 92.25 144.867 88.2C146.817 84.1 149.492 80.975 152.892 78.825C156.292 76.675 160.167 75.6 164.517 75.6C168.867 75.6 172.742 76.675 176.142 78.825C179.542 80.975 182.192 84.1 184.092 88.2C186.042 92.25 187.017 97.1 187.017 102.75C187.017 108.4 186.042 113.275 184.092 117.375C182.192 121.425 179.542 124.525 176.142 126.675C172.742 128.825 168.867 129.9 164.517 129.9ZM164.517 119.625C167.717 119.625 170.217 118.25 172.017 115.5C173.867 112.75 174.792 108.5 174.792 102.75C174.792 97 173.867 92.75 172.017 90C170.217 87.25 167.717 85.875 164.517 85.875C161.367 85.875 158.867 87.25 157.017 90C155.217 92.75 154.317 97 154.317 102.75C154.317 108.5 155.217 112.75 157.017 115.5C158.867 118.25 161.367 119.625 164.517 119.625ZM231.706 119.1V129H192.031V121.125L212.281 102C214.431 99.95 215.881 98.2 216.631 96.75C217.381 95.25 217.756 93.775 217.756 92.325C217.756 90.225 217.031 88.625 215.581 87.525C214.181 86.375 212.106 85.8 209.356 85.8C207.056 85.8 204.981 86.25 203.131 87.15C201.281 88 199.731 89.3 198.481 91.05L189.631 85.35C191.681 82.3 194.506 79.925 198.106 78.225C201.706 76.475 205.831 75.6 210.481 75.6C214.381 75.6 217.781 76.25 220.681 77.55C223.631 78.8 225.906 80.6 227.506 82.95C229.156 85.25 229.981 87.975 229.981 91.125C229.981 93.975 229.381 96.65 228.181 99.15C226.981 101.65 224.656 104.5 221.206 107.7L209.131 119.1H231.706ZM284.062 117.975H275.512V129H263.662V117.975H235.387V109.8L260.137 76.5H272.887L249.937 108.075H264.037V98.25H275.512V108.075H284.062V117.975Z" fill="#FEC32A"/>
<line x1="47.4493" y1="10" x2="47.4493" y2="137" stroke="url(#paint0_linear)" stroke-width="14.8987"/>
<defs>
<linearGradient id="paint0_linear" x1="40" y1="113.704" x2="40" y2="-1.2722" gradientUnits="userSpaceOnUse">
<stop stop-color="#FEC83D"/>
<stop offset="0.248792" stop-color="#E7D679"/>
<stop offset="0.649844" stop-color="#C3EDDA"/>
<stop offset="0.9999" stop-color="#C2EDDB"/>
<stop offset="1" stop-color="#FEC32A" stop-opacity="0"/>
<stop offset="1" stop-color="#C2EDDB"/>
</linearGradient>
</defs>
</svg>
