<svg width="60" height="60" viewBox="0 0 60 60" fill="none" xmlns="http://www.w3.org/2000/svg">
<circle cx="30" cy="30" r="30" fill="#283896"/>
<path d="M35.0907 40.4824C33.3606 40.4824 32.458 41.0841 31.7057 41.6107C31.4801 41.7611 31.3296 41.8363 31.1792 41.9868V29.8009L40.5819 31.6062L36.9712 40.7832C36.4447 40.6328 35.8429 40.4824 35.0907 40.4824ZM24.5597 40.4824C23.657 40.4824 22.98 40.6328 22.3783 40.8585L18.8428 31.6062L28.4712 29.7257V41.9116C28.3208 41.8363 28.0951 41.6859 27.8694 41.5354C27.1924 41.1593 26.2898 40.4824 24.5597 40.4824ZM21.7765 25.2876L29.75 25.5132L37.6482 25.2876L38.6261 28.6726L29.6747 26.9425L20.7234 28.6726L21.7765 25.2876ZM25.5376 20.9247H33.8872L34.2633 22.7301H25.1615L25.5376 20.9247ZM28.8473 15.8849H29.6747H30.427V18.3672H29.6747H28.8473V15.8849ZM45.6217 40.5576C43.8916 40.5576 42.989 41.1593 42.2368 41.6859C41.635 42.062 41.2589 42.3629 40.3562 42.3629C39.9049 42.3629 39.604 42.2877 39.3031 42.2124L44.1925 29.8009L41.635 29.2743L39.7544 22.6548L37.0465 22.7301L36.0686 18.4424H33.2102V13.4026H30.6526H29.75H28.9225H26.2898V18.4424H23.5066L22.5287 22.7301L19.8207 22.6548L17.9402 29.2743L15.3826 29.8009L20.1216 42.2124C19.8959 42.2877 19.6703 42.2877 19.3694 42.2877C18.4667 42.2877 18.0906 41.9868 17.4889 41.6107C16.7366 41.0841 15.834 40.4824 14.1039 40.4824V43.0399C15.0065 43.0399 15.3826 43.3408 15.9844 43.7169C16.7366 44.2434 17.6393 44.8452 19.3694 44.8452C21.0995 44.8452 22.0022 44.2434 22.7544 43.7169C23.3561 43.3408 23.7323 43.0399 24.6349 43.0399C25.5376 43.0399 25.9137 43.3408 26.5155 43.7169C27.2677 44.2434 28.1703 44.8452 29.9004 44.8452C31.6305 44.8452 32.5332 44.2434 33.2854 43.7169C33.8872 43.3408 34.2633 43.0399 35.1659 43.0399C36.0686 43.0399 36.4447 43.3408 37.0465 43.7169C37.7987 44.2434 38.7013 44.8452 40.4314 44.8452C42.1615 44.8452 43.0642 44.2434 43.8164 43.7169C44.4182 43.3408 44.7943 43.0399 45.697 43.0399L45.6217 40.5576Z" fill="white"/>
</svg>
