<svg width="69" height="25" viewBox="0 0 69 25" fill="none" xmlns="http://www.w3.org/2000/svg">
<path d="M7.77143 0V2.18975H5.14025V9.2517H2.65339V2.18975H0V0H7.77143Z" fill="#283896"/>
<path d="M12.9545 0C13.531 0 14.0742 0.0546818 14.562 0.153104C15.0609 0.251527 15.4821 0.426492 15.848 0.678016C16.2138 0.929539 16.5021 1.24668 16.7127 1.65131C16.9234 2.05593 17.0231 2.55898 17.0231 3.17139C17.0231 3.77286 16.9234 4.28684 16.7127 4.69147C16.5021 5.0961 16.2138 5.42416 15.848 5.66475C15.4821 5.90533 15.0498 6.08031 14.562 6.18967C14.0631 6.29903 13.531 6.34278 12.9545 6.34278H11.7239V9.2517H9.2517V0.0109332H12.9545V0ZM14.4955 3.17139C14.4955 2.96361 14.4622 2.78863 14.3846 2.64646C14.307 2.51523 14.2072 2.40588 14.0742 2.31839C13.9412 2.24184 13.786 2.18716 13.6197 2.15435C13.4534 2.12154 13.276 2.11061 13.0875 2.11061H11.735V4.22122H13.0875C13.276 4.22122 13.4534 4.21029 13.6197 4.17748C13.786 4.14467 13.9412 4.08999 14.0742 4.01344C14.2072 3.93689 14.307 3.82753 14.3846 3.68537C14.4622 3.55414 14.4955 3.37917 14.4955 3.17139Z" fill="#283896"/>
<path d="M24.6261 9.2517V5.47884C24.6261 5.22732 24.6261 4.96485 24.6368 4.69146C24.6475 4.41806 24.6582 4.17748 24.6796 3.95876L21.1445 9.2517H18.8735V0.0109332H21.2623V3.78379C21.2623 4.03532 21.2623 4.29777 21.2516 4.57117C21.2409 4.84456 21.2302 5.09609 21.2088 5.30387L24.7546 0H27.015V9.24077H24.6261V9.2517Z" fill="#283896"/>
<path d="M4.1703 14.6891C5.17731 14.6891 5.97634 14.8752 6.54552 15.2584C7.11469 15.6307 7.39928 16.2219 7.39928 17.0321C7.39928 17.5467 7.27888 17.9628 7.04902 18.3022C6.81916 18.6416 6.4689 18.8825 6.02012 19.0467C6.26093 19.1124 6.49079 19.2219 6.7097 19.3423C6.91767 19.4737 7.10374 19.627 7.26793 19.8131C7.43212 19.9992 7.55252 20.2182 7.64009 20.47C7.72765 20.7219 7.77143 21.0065 7.77143 21.3241C7.77143 21.8496 7.66197 22.2875 7.43212 22.616C7.20226 22.9554 6.90672 23.2182 6.54552 23.4153C6.18431 23.6123 5.77932 23.7437 5.34149 23.8204C4.89272 23.897 4.45489 23.9299 4.01706 23.9299H0V14.6782H4.1703V14.6891ZM5.3196 21.0613C5.3196 20.689 5.21014 20.4372 4.98028 20.2949C4.76137 20.1635 4.45489 20.0978 4.09368 20.0978H2.42994V22.0248H4.09368C4.46584 22.0248 4.76137 21.9591 4.98028 21.8167C5.21014 21.6854 5.3196 21.4335 5.3196 21.0613ZM4.96934 17.4701C4.96934 17.2073 4.88177 16.9993 4.70664 16.846C4.53151 16.6927 4.27976 16.6161 3.95139 16.6161H2.44089V18.3241L3.95139 18.335C4.27976 18.335 4.53151 18.2584 4.70664 18.1051C4.87083 17.9409 4.96934 17.7329 4.96934 17.4701Z" fill="#283896"/>
<path d="M13.7045 23.0833C13.471 23.3846 13.2263 23.6302 12.9595 23.8088C12.6926 23.9874 12.4146 24.1102 12.1366 24.1883C11.8475 24.2664 11.5472 24.2999 11.2248 24.2999C10.9801 24.2999 10.7355 24.2776 10.4797 24.2218C10.2351 24.1772 9.97934 24.1102 9.71247 24.0432V21.9894C9.87926 22.0563 10.0461 22.101 10.2462 22.1345C10.4353 22.168 10.6243 22.1791 10.8022 22.1791C11.1024 22.1791 11.3471 22.1345 11.5584 22.034C11.7585 21.9447 11.9253 21.7661 12.0254 21.5317L12.1699 21.208L8.51152 14.6782H11.2581L13.3264 18.9756L15.0166 14.6782H17.7632L14.3717 21.9447C14.1604 22.4024 13.938 22.7819 13.7045 23.0833Z" fill="#283896"/>
<path d="M26.2748 14.6782V24.1763H23.8595V16.9262H21.8882C21.8232 17.9042 21.7257 18.8371 21.6174 19.7138C21.5091 20.6018 21.325 21.3887 21.0867 22.0631C20.8484 22.7488 20.5234 23.2883 20.1119 23.6929C19.7003 24.0976 19.1695 24.2999 18.5197 24.2999C18.3464 24.2999 18.1622 24.2887 17.9781 24.255C17.794 24.2325 17.599 24.1763 17.3932 24.1089V21.9282C17.5882 21.9957 17.794 22.0069 18.0214 21.9844C18.2597 21.9619 18.4763 21.8271 18.6388 21.5798C18.8121 21.3437 18.9421 21.029 19.0612 20.6468C19.1695 20.2646 19.2562 19.8375 19.3212 19.3429C19.3862 18.8596 19.4403 18.3425 19.4836 17.8142C19.527 17.2747 19.5595 16.7464 19.592 16.2069C19.6244 15.6673 19.6461 15.1615 19.6894 14.6782H26.2748Z" fill="#283896"/>
<path d="M28.4952 23.9299V14.6782H30.9255V18.175H32.0917L34.1841 14.6782H36.876L33.9771 19.1834L37.0068 23.9299H34.3149L32.0699 20.3563H30.9255V23.9299H28.4952Z" fill="#283896"/>
<path d="M37.7469 23.9299L41.4124 14.6782H44.0732L47.7388 23.9299H45.2104L44.6805 22.4737H40.8162L40.2863 23.9299H37.7469ZM41.5449 20.492H43.9407L42.9802 17.8205C42.936 17.711 42.8919 17.5796 42.8588 17.4482C42.8256 17.3168 42.7815 17.1197 42.7373 16.8789C42.6931 17.1197 42.66 17.3168 42.6159 17.4482C42.5827 17.5796 42.5386 17.7 42.4944 17.8205L41.5449 20.492Z" fill="#283896"/>
<path d="M57.3606 14.6782V23.9299H54.9717V20.4044H51.6079V23.9299H49.2191V14.6782H51.6079V18.2256H54.9717V14.6782H57.3606Z" fill="#283896"/>
<path d="M58.8408 23.9299L62.5063 14.6782H65.1671L68.8326 23.9299H66.3043L65.7744 22.4737H61.9101L61.3802 23.9299H58.8408ZM62.6278 20.492H65.0236L64.063 17.8205C64.0189 17.711 63.9747 17.5796 63.9416 17.4482C63.9085 17.3168 63.8643 17.1197 63.8202 16.8789C63.776 17.1197 63.7429 17.3168 63.6987 17.4482C63.6656 17.5796 63.6214 17.7 63.5773 17.8205L62.6278 20.492Z" fill="#283896"/>
</svg>
