<svg width="115" height="115" viewBox="0 0 115 115" fill="none" xmlns="http://www.w3.org/2000/svg">
<path d="M65.2095 51.5705C62.3652 53.1799 59.3999 54.5837 56.3256 55.7575C45.9288 78.5074 26.4182 92.2784 17.5464 96.8647C20.0155 99.6358 21.9521 102.104 24.1307 104.319C30.8238 109.099 38.6547 112.523 47.2844 114.072C51.3875 114.811 55.4663 115.089 59.4725 114.956C62.4741 110.684 69.4699 99.5632 74.8317 81.9683C69.0826 69.2259 66.6377 57.4395 65.2095 51.5705Z" fill="#A7B739"/>
<path d="M2.82867 75.3007C4.18425 79.4513 5.99976 83.4205 8.23888 87.1355C9.83652 89.7856 11.652 92.3026 13.6612 94.6744C21.8552 90.2696 28.3668 85.7923 33.668 80.9034C34.4306 72.8684 36.3913 65.2084 38.0253 59.6419C35.7377 59.5451 33.4381 59.3273 31.1263 58.9885C22.9566 67.9795 10.9137 72.8563 2.82867 75.3007Z" fill="#30A4A2"/>
<path d="M2.82867 75.3007C4.13584 79.3182 5.89083 83.1663 8.02102 86.7724C19.616 81.1576 32.5424 70.3392 38.0011 59.6419C35.7135 59.5451 33.4139 59.3273 31.1021 58.9885C22.9566 67.9795 10.9137 72.8563 2.82867 75.3007Z" fill="#68C9D0"/>
<path d="M86.8381 51.2317C96.775 38.7313 95.4799 20.4345 83.5218 9.5073C73.6212 0.455719 58.2016 1.13338 49.1482 11.032C45.6867 14.8197 43.8954 19.7327 44.1253 24.8635C44.3553 29.9944 46.5581 34.7259 50.3586 38.1868C56.5192 43.8259 66.1293 43.4023 71.7694 37.2308C76.1993 32.3904 75.8604 24.8514 71.019 20.4345C69.1914 18.7646 66.807 17.8933 64.338 18.0143C61.8568 18.1232 59.5692 19.2002 57.899 21.0275L56.2045 19.4786C58.2863 17.1915 61.1427 15.8724 64.229 15.7272C67.3154 15.582 70.2807 16.659 72.5562 18.7525C78.3295 24.0285 78.7289 33.0196 73.4518 38.7797C73.1734 39.0944 72.8829 39.3848 72.5804 39.6752C82.0331 40.7401 85.6036 47.6014 86.8381 51.2317Z" fill="#D2DAE8"/>
<path d="M14.3148 42.6883C11.9909 42.7609 10.1512 44.7213 10.236 47.0568L7.94842 47.1294C7.82738 43.5354 10.6475 40.5222 14.2422 40.4012C16.1424 40.3286 18.2484 40.8489 19.6403 41.9259C17.5464 39.6267 16.0214 36.9282 15.1741 33.9998C8.73514 34.3991 3.19179 40.0382 3.40965 46.5243C3.5791 51.6794 7.93631 55.709 13.0681 55.5517C17.0623 55.4186 20.2091 52.0545 20.076 48.0612C19.9671 45.0117 17.3527 42.5794 14.3148 42.6883Z" fill="#D2DAE8"/>
<path d="M41.8863 25.4202C41.8742 25.4081 41.8742 25.396 41.862 25.396C38.5094 22.0319 33.0387 22.0319 29.674 25.396C27.0717 27.9977 27.0717 32.2209 29.674 34.8227L28.0521 36.4442C24.5663 32.947 24.5663 27.2716 28.0521 23.7865C31.8163 20.0352 37.6501 19.6117 41.8863 22.4917C42.1888 18.1837 43.7623 14.1178 46.4613 10.7174C38.2795 7.41381 28.5362 9.08375 21.9157 15.703C18.5268 19.0913 16.6628 23.5808 16.6628 28.3728C16.6628 33.1648 18.5268 37.6543 21.9036 41.0426C24.5663 43.7048 28.1126 45.1812 31.8768 45.1812C35.6409 45.1812 39.1872 43.7169 41.8499 41.0547C43.4839 39.4211 44.5127 37.3639 44.9 35.1373C43.1571 32.2088 42.1162 28.9053 41.8863 25.4202Z" fill="#D2DAE8"/>
<path d="M56.3256 55.7575C51.3511 66.6363 43.5565 75.4095 35.8104 82.1014C30.376 87.2202 23.6586 91.8912 15.2225 96.4533C20.0881 101.741 25.9703 106.146 32.6272 109.341C50.516 94.5534 63.7933 67.4471 65.2094 51.5705C62.3651 53.1799 59.3998 54.5837 56.3256 55.7575Z" fill="#D5E05B"/>
<path d="M114.918 54.5836C100.37 45.9314 90.8807 36.4321 87.9517 33.0317C86.3177 36.0448 84.4296 38.8886 82.3599 41.5629C84.7322 77.019 70.1839 104.742 63.7207 114.532C64.459 114.484 65.1489 114.435 65.8267 114.387C89.5977 110.914 109.58 92.6777 114.095 67.7254C114.531 65.3052 114.809 62.897 114.942 60.5131C115.027 58.5165 115.015 56.544 114.918 54.5836Z" fill="#283896"/>
<path d="M62.4136 114.786C74.2386 113.782 85.2768 109.123 94.1607 101.778C98.4937 82.5008 96.1335 50.4935 87.9517 33.0438C86.3177 36.057 84.4296 38.9007 82.3599 41.5751C83.5945 59.9928 79.6609 76.6802 74.6864 89.8461C70.2444 102.129 66.6982 108.7 62.4136 114.786Z" fill="#4B5EAA"/>
</svg>
