<svg width="26" height="26" viewBox="0 0 26 26" fill="none" xmlns="http://www.w3.org/2000/svg">
<path d="M6.27734 11.7087H13.9506L21.8636 12.4339V19.686L18.9862 22.3451H7.95587L5.31818 19.686V13.4009L6.27734 11.7087Z" fill="white"/>
<path d="M20.5556 18.9742C20.5556 19.1643 20.508 19.3545 20.3654 19.4971L18.8443 21.2559C18.7017 21.446 18.464 21.5411 18.2739 21.5411H8.00612C7.76844 21.5411 7.57829 21.446 7.43568 21.2559L5.91454 19.4971C5.81947 19.3545 5.7244 19.1643 5.7244 18.9742V13.5075C5.7244 13.0797 6.05714 12.747 6.48496 12.747H19.7475C20.1753 12.747 20.508 13.0797 20.508 13.5075L20.5556 18.9742ZM19.795 10.9881H14.471V6.47224H12.3319V4.71341H14.2809V2.95459H10.6206V8.18353H12.7597V10.9881H6.58004C5.2015 10.9881 4.06065 12.129 4.06065 13.5075V18.9742C4.06065 19.5446 4.25078 20.1626 4.63107 20.5904L6.15222 22.3492C6.62758 22.9196 7.34062 23.2524 8.05365 23.2524H18.3214C19.0344 23.2524 19.7475 22.9196 20.2228 22.3492L21.744 20.5904C22.1243 20.115 22.3144 19.5446 22.3144 18.9742V13.5075C22.3144 12.129 21.1735 10.9881 19.795 10.9881Z" fill="#283896"/>
<path d="M17.8932 18.2612H8.33854V19.9725H17.8932V18.2612Z" fill="#283896"/>
<path d="M21.6823 3.19012L15.6332 4.66846L16.0395 6.3308L22.0886 4.85247L21.6823 3.19012Z" fill="#283896"/>
<path d="M8.57867 6.404L3.54546 7.63354L3.95155 9.29589L8.98476 8.06634L8.57867 6.404Z" fill="#283896"/>
<path d="M8.86126 16.93C9.64886 16.93 10.2873 16.2916 10.2873 15.504C10.2873 14.7164 9.64886 14.0779 8.86126 14.0779C8.07366 14.0779 7.43518 14.7164 7.43518 15.504C7.43518 16.2916 8.07366 16.93 8.86126 16.93Z" fill="#283896"/>
<path d="M13.3296 16.93C14.1172 16.93 14.7557 16.2916 14.7557 15.504C14.7557 14.7164 14.1172 14.0779 13.3296 14.0779C12.542 14.0779 11.9036 14.7164 11.9036 15.504C11.9036 16.2916 12.542 16.93 13.3296 16.93Z" fill="#283896"/>
<path d="M17.798 16.93C18.5856 16.93 19.2241 16.2916 19.2241 15.504C19.2241 14.7164 18.5856 14.0779 17.798 14.0779C17.0104 14.0779 16.372 14.7164 16.372 15.504C16.372 16.2916 17.0104 16.93 17.798 16.93Z" fill="#283896"/>
</svg>
