<svg width="44" height="44" viewBox="0 0 44 44" fill="none" xmlns="http://www.w3.org/2000/svg">
<path d="M36.4455 23.6788V17.3975C36.4455 16.7363 36.3654 16.1577 36.1248 15.5792L33.4793 8.71924C32.5975 6.48769 30.5933 5.08265 28.2685 5H17.2856C14.9608 5 12.8764 6.40504 11.9946 8.63658L9.26891 15.4965C9.0284 16.0751 8.94824 16.7363 8.94824 17.3975V24.6706C8.94824 24.7533 8.94824 24.7533 8.94824 24.8359V27.8113C8.94824 29.299 10.0706 30.4561 11.5136 30.4561H11.9144C13.3574 30.4561 14.4798 29.299 14.4798 27.8113V26.1583H30.9942V27.8113C30.9942 29.299 32.1165 30.4561 33.5595 30.4561H33.9604C35.4034 30.4561 36.5257 29.299 36.5257 27.8113L36.4455 23.6788ZM11.9144 16.571L14.6401 9.71104C15.0409 8.6366 16.0831 7.89274 17.2054 7.89274H28.1883C29.3107 7.89274 30.3528 8.6366 30.7537 9.71104L33.3992 16.571C33.3992 16.6536 33.3992 16.7363 33.4793 16.7363H11.8343C11.8343 16.7363 11.8343 16.6536 11.9144 16.571ZM15.0409 22.8523C14.1591 23.7615 12.7161 23.7615 11.7541 22.8523C10.7921 21.9432 10.8723 20.4555 11.7541 19.4637C12.6359 18.4719 14.0789 18.5546 15.0409 19.4637C16.0029 20.3728 15.9228 21.9432 15.0409 22.8523ZM33.5595 22.8523C32.6777 23.7615 31.2347 23.7615 30.2727 22.8523C29.3107 21.9432 29.3908 20.4555 30.2727 19.4637C31.1545 18.4719 32.5975 18.5546 33.5595 19.4637C34.5215 20.3728 34.4414 21.9432 33.5595 22.8523Z" fill="#283896"/>
<path d="M37.8372 38.5758L35.5685 33.1982H32.2075L34.5602 38.5758H37.8372Z" fill="#283896"/>
<path d="M23.9731 33.1982H20.9482V38.5758H23.9731V33.1982Z" fill="#283896"/>
<path d="M10.277 38.5758L12.6297 33.1982H9.35269L7 38.5758H10.277Z" fill="#283896"/>
</svg>
