<svg width="26" height="26" viewBox="0 0 26 26" fill="none" xmlns="http://www.w3.org/2000/svg">
<path d="M13.2706 21.6976C9.84799 21.6976 7.09091 19.0356 7.09091 15.7556C7.09091 12.7609 12.0346 6.29598 12.5575 5.58294L13.223 4.72729L13.8885 5.58294C14.459 6.29598 19.3552 12.7609 19.3552 15.7556C19.4027 19.0356 16.6456 21.6976 13.2706 21.6976ZM13.2706 7.53191C11.3216 10.1939 8.80222 14.1394 8.80222 15.7556C8.80222 18.0849 10.7987 19.9863 13.2706 19.9863C15.7424 19.9863 17.739 18.0849 17.739 15.7556C17.6914 14.0919 15.2195 10.1464 13.2706 7.53191Z" fill="#283896"/>
<path d="M13.2709 18.7028C11.5121 18.7028 10.086 17.3718 10.086 15.708H11.7973C11.7973 16.421 12.4628 16.9915 13.2709 16.9915C13.6988 16.9915 14.079 16.8489 14.3643 16.6112L15.5051 17.8947C14.8872 18.4176 14.0791 18.7028 13.2709 18.7028Z" fill="#283896"/>
</svg>
