<svg width="48" height="48" viewBox="0 0 48 48" fill="none" xmlns="http://www.w3.org/2000/svg">
<path d="M16.5 36H31.5V39H16.5V36Z" fill="white"/>
<path d="M19.5 42H28.5V45H19.5V42Z" fill="white"/>
<path d="M24.0002 3C20.0219 3 16.2066 4.58035 13.3935 7.3934C10.5805 10.2064 9.00015 14.0218 9.00015 18C8.89871 20.18 9.31631 22.3529 10.2186 24.34C11.1209 26.3272 12.4821 28.0716 14.1902 29.43C15.6902 30.825 16.5002 31.62 16.5002 33H19.5002C19.5002 30.24 17.8352 28.695 16.2152 27.21C14.8132 26.1364 13.6959 24.7354 12.961 23.1298C12.2262 21.5241 11.8963 19.7628 12.0001 18C12.0001 14.8174 13.2644 11.7652 15.5149 9.51472C17.7653 7.26428 20.8176 6 24.0002 6C27.1827 6 30.235 7.26428 32.4854 9.51472C34.7359 11.7652 36.0002 14.8174 36.0002 18C36.1023 19.7641 35.7701 21.5262 35.0326 23.132C34.2951 24.7377 33.1749 26.138 31.7702 27.21C30.1652 28.71 28.5002 30.21 28.5002 33H31.5002C31.5002 31.62 32.2952 30.825 33.8102 29.415C35.5171 28.059 36.8776 26.3171 37.7799 24.3326C38.6822 22.3481 39.1004 20.1777 39.0002 18C39.0002 16.0302 38.6122 14.0796 37.8583 12.2597C37.1045 10.4399 35.9996 8.78628 34.6068 7.3934C33.2139 6.00052 31.5603 4.89563 29.7404 4.14181C27.9205 3.38799 25.97 3 24.0002 3Z" fill="white"/>
</svg>
