<svg width="20" height="20" viewBox="0 0 20 20" fill="none" xmlns="http://www.w3.org/2000/svg">
<path d="M16.6001 10.0667L10.0001 16.6667L3.40008 10.0667L4.58341 8.89175L9.16675 13.4751V1.66675H10.8334V13.4751L15.4167 8.88341L16.6001 10.0667ZM10.0001 16.6667H1.66675V18.3334H18.3334V16.6667H10.0001Z" fill="#A7B739"/>
</svg>
