<svg width="26" height="26" viewBox="0 0 26 26" fill="none" xmlns="http://www.w3.org/2000/svg">
<path d="M22.1656 9.99051C20.9772 9.1824 19.0283 7.994 18.2201 7.56618C17.7923 7.3285 17.1743 7.09082 16.4138 7.09082C15.0352 7.09082 13.7993 7.85139 13.1338 8.99225C12.4683 7.85139 11.2799 7.09082 9.85382 7.09082C9.09325 7.09082 8.42775 7.3285 8.04747 7.56618C7.28689 7.994 5.29039 9.1824 4.102 9.99051C2.67592 10.8462 1.77273 12.4148 1.77273 14.1737C1.77273 16.8832 3.95937 19.0699 6.66891 19.0699C8.52281 19.0699 10.139 18.0241 10.9947 16.5029C11.4701 17.1684 12.2782 17.5487 13.1338 17.5487C13.9895 17.5487 14.7976 17.1209 15.2729 16.5029C16.081 18.0241 17.6972 19.0699 19.5987 19.0699C22.3082 19.0699 24.4949 16.8832 24.4949 14.1737C24.5424 12.4148 23.5917 10.8462 22.1656 9.99051ZM6.71647 17.3586C4.95764 17.3586 3.53156 15.9325 3.53156 14.1737C3.53156 12.4148 4.95764 10.9888 6.71647 10.9888C8.47529 10.9888 9.90138 12.4148 9.90138 14.1737C9.90138 15.9325 8.47529 17.3586 6.71647 17.3586ZM13.1813 15.8374C12.6109 15.8374 12.1831 15.4096 12.1831 14.8392C12.1831 14.2687 12.6109 13.8409 13.1813 13.8409C13.7518 13.8409 14.1796 14.2687 14.1796 14.8392C14.1796 15.4096 13.7518 15.8374 13.1813 15.8374ZM19.6462 17.3586C17.8874 17.3586 16.4613 15.9325 16.4613 14.1737C16.4613 12.4148 17.8874 10.9888 19.6462 10.9888C21.4051 10.9888 22.8311 12.4148 22.8311 14.1737C22.8311 15.9325 21.4051 17.3586 19.6462 17.3586Z" fill="#283896"/>
</svg>
