<svg width="50" height="50" viewBox="0 0 50 50" fill="none" xmlns="http://www.w3.org/2000/svg">
<circle cx="25" cy="25" r="25" fill="#283896"/>
<path d="M15.7492 21.5679C16.9263 21.5679 17.8805 20.6136 17.8805 19.4366C17.8805 18.2595 16.9263 17.3053 15.7492 17.3053C14.5721 17.3053 13.6179 18.2595 13.6179 19.4366C13.6179 20.6136 14.5721 21.5679 15.7492 21.5679Z" fill="white"/>
<path d="M30.0413 18.1829L29.7906 18.4963C29.6652 18.4336 29.5398 18.3709 29.3518 18.3082C28.9757 18.1202 28.6622 17.9948 28.4115 17.8694C27.7847 17.6187 26.9698 17.4306 26.0922 17.368L27.722 14.9859L30.0413 18.1829ZM35.1188 20.3768C33.9277 20.1261 32.8621 19.8127 31.9219 19.4365L33.2382 17.6187L35.1188 20.3768ZM40.5723 21.5051L40.3843 20.3768C39.5694 20.5022 38.8172 20.5649 38.0649 20.5649L33.2382 13.6069L31.4204 16.1769L27.7847 10.9741L23.4594 17.1799C21.955 17.1799 20.6386 17.3053 20.3252 17.3053L20.5132 19.5619C22.5192 19.3739 26.2176 19.3112 27.5339 19.8753C27.7847 20.0007 28.0981 20.1261 28.4115 20.2514C30.4174 21.1917 33.7397 22.7588 37.9396 22.7588C38.8798 22.7588 39.8201 22.6962 40.7604 22.5081L40.5723 21.5051Z" fill="white"/>
<path d="M23.9614 33.5406L21.2659 31.1586C21.2033 31.0959 21.2033 31.0332 21.2033 31.0332C21.2033 30.9705 21.2033 30.9078 21.2659 30.9078L23.5226 29.3407C23.9614 29.0273 24.2121 28.7139 24.2748 28.1497C24.2748 28.0243 24.2748 27.7109 24.2748 27.5855H32.2358V25.3289H23.0211L20.451 22.2573C19.7615 21.4424 18.6332 21.3171 17.8183 21.8812C17.1914 22.32 16.878 23.0095 16.9407 23.7618L17.0661 24.8274C17.0661 25.0155 17.0034 25.1408 16.9407 25.2035C16.878 25.2662 16.7527 25.3916 16.5646 25.3916H13.1169V27.6482H16.5646C17.3795 27.6482 18.1317 27.3348 18.6332 26.7079C19.1347 26.0811 19.3854 25.3289 19.3227 24.514V24.4513L21.5794 27.1467C21.8301 27.3975 21.7674 27.8363 21.454 28.0243L20.0123 29.0273C19.3854 29.4661 19.0093 30.1556 18.9466 30.9078C18.8839 31.66 19.1973 32.4122 19.7615 32.9137L21.7047 34.6062L17.4422 36.4867C16.3765 36.9255 15.1228 36.9255 13.9945 36.4867L13.1169 38.5553C13.9318 38.9314 14.8094 39.0568 15.687 39.0568C16.5646 39.0568 17.4422 38.8688 18.3198 38.5553L33.4268 31.9734L32.4238 29.8422L23.9614 33.5406Z" fill="white"/>
</svg>
