<svg width="53" height="53" viewBox="0 0 53 53" fill="none" xmlns="http://www.w3.org/2000/svg">
<circle cx="26.5" cy="26.5" r="26" stroke="white"/>
<path d="M22.1439 25.7252L30.9501 16.919C31.2545 16.6146 31.2545 16.1209 30.9501 15.8164C30.6455 15.512 30.1519 15.512 29.8475 15.8164L20.49 25.1739C20.1856 25.4784 20.1856 25.972 20.49 26.2765L29.8475 35.6339C30.1572 35.9331 30.6509 35.9245 30.9501 35.6147C31.2419 35.3125 31.2419 34.8335 30.9501 34.5313L22.1439 25.7252Z" fill="white"/>
</svg>
