<svg width="26" height="25" viewBox="0 0 26 25" fill="none" xmlns="http://www.w3.org/2000/svg">
<path d="M24.6929 22.4547C24.2045 22.5595 23.7241 22.2484 23.6195 21.7603L22.9626 18.6946C20.871 22.2628 17.0318 24.502 12.8241 24.502C6.34411 24.502 1.07227 19.2302 1.07227 12.7501C1.07227 12.2509 1.47696 11.8461 1.97625 11.8461C2.47547 11.8461 2.88024 12.2509 2.88024 12.7501C2.88024 18.2332 7.34102 22.694 12.8241 22.694C16.3988 22.694 19.6593 20.7845 21.4247 17.7442L18.4108 18.3901C17.9225 18.4948 17.442 18.1837 17.3375 17.6956C17.233 17.2074 17.5439 16.7268 18.0321 16.6222L23.2055 15.5136C23.2934 15.4947 23.3826 15.4893 23.4706 15.4966C23.6172 15.509 23.7601 15.5571 23.886 15.6385C24.0873 15.7688 24.2286 15.9737 24.2789 16.208L25.3876 21.3815C25.492 21.8695 25.181 22.35 24.6929 22.4547Z" fill="#FFD028"/>
<path d="M23.7829 13.935C23.284 13.9185 22.8927 13.5006 22.9092 13.0017C22.9969 10.347 22.0456 7.81721 20.2304 5.87798C18.4152 3.93896 15.9536 2.82264 13.299 2.73499C13.1884 2.73138 13.0783 2.72957 12.9681 2.72957C9.50431 2.72971 6.31345 4.52865 4.5114 7.44332L7.65345 6.60081C8.13567 6.47157 8.63142 6.75759 8.76072 7.23989C8.89003 7.72211 8.60394 8.21779 8.12171 8.34724L3.01136 9.7174C2.7798 9.77937 2.53297 9.74697 2.32541 9.62721C2.11771 9.50745 1.96621 9.30995 1.90408 9.07838L0.534 3.96789C0.404694 3.48566 0.690788 2.98999 1.17301 2.86061C1.25148 2.83956 1.33016 2.82944 1.40769 2.82944C1.80674 2.82944 2.17203 3.09587 2.28029 3.49962L3.05041 6.37192C5.19279 2.99845 8.92192 0.921448 12.9677 0.921593C13.0976 0.921593 13.2283 0.923689 13.3588 0.928028C16.496 1.03173 19.4052 2.35083 21.5504 4.64248C23.6956 6.93412 24.8199 9.92401 24.7163 13.0614C24.6998 13.5602 24.2818 13.9527 23.7829 13.935Z" fill="#FFD028"/>
</svg>
