<svg width="30" height="23" viewBox="0 0 30 23" fill="none" xmlns="http://www.w3.org/2000/svg">
<path d="M26.5754 0.164062H2.81406C1.41868 0.164062 0.280273 1.30123 0.280273 2.69785V19.5898C0.280273 20.9817 1.41361 22.1236 2.81406 22.1236H26.5754C27.9673 22.1236 29.1091 20.9902 29.1091 19.5898V2.69785C29.1091 1.30596 27.9758 0.164062 26.5754 0.164062ZM26.2255 1.85325L14.7484 13.3304L3.17211 1.85325H26.2255ZM1.96947 19.24V3.03957L10.1046 11.1049L1.96947 19.24ZM3.16389 20.4344L11.3041 12.2941L14.1564 15.122C14.4866 15.4493 15.0194 15.4483 15.3483 15.1194L18.1294 12.3382L26.2255 20.4344H3.16389ZM27.42 19.2399L19.3238 11.1438L27.42 3.04763V19.2399Z" fill="#FFD335"/>
</svg>
