<svg width="10" height="18" viewBox="0 0 10 18" fill="none" xmlns="http://www.w3.org/2000/svg">
<path d="M1.59907 8.60692L9.07598 1.13001C9.33447 0.871486 9.33447 0.452357 9.07598 0.193834C8.81742 -0.0646113 8.39833 -0.0646113 8.13981 0.193834L0.19481 8.13883C-0.0636347 8.39735 -0.0636347 8.81648 0.19481 9.07501L8.13981 17.02C8.40283 17.274 8.82196 17.2667 9.07598 17.0037C9.32376 16.7471 9.32376 16.3404 9.07598 16.0838L1.59907 8.60692Z" fill="white"/>
</svg>
