<svg width="71" height="71" viewBox="0 0 71 71" fill="none" xmlns="http://www.w3.org/2000/svg">
<circle cx="35.6348" cy="35.2979" r="35" fill="#FFD028"/>
<path d="M49.818 35.4309C50.294 34.8996 50.584 34.1983 50.584 33.4309C50.584 31.7769 49.238 30.4309 47.584 30.4309H41.7613C42.338 28.6809 42.584 26.3589 42.584 25.3636V24.3643C42.584 22.1589 40.7893 20.3643 38.584 20.3643H37.584C37.1253 20.3643 36.7253 20.6763 36.614 21.1216L36.0693 23.3009C35.306 26.3529 32.8827 29.7203 30.3747 30.3323C29.9353 29.2203 28.8507 28.4309 27.584 28.4309H21.584C21.032 28.4309 20.584 28.8789 20.584 29.4309V47.4309C20.584 47.9829 21.032 48.4309 21.584 48.4309H27.584C28.7767 48.4309 29.8087 47.7316 30.292 46.7209L33.728 47.8663C34.8513 48.2409 36.022 48.4309 37.2067 48.4309H45.584C47.238 48.4309 48.584 47.0849 48.584 45.4309C48.584 45.0409 48.5093 44.6676 48.3733 44.3256C49.6453 43.9783 50.584 42.8123 50.584 41.4309C50.584 40.6636 50.294 39.9623 49.818 39.4309C50.294 38.8996 50.584 38.1983 50.584 37.4309C50.584 36.6636 50.294 35.9623 49.818 35.4309ZM28.584 45.4309C28.584 45.9823 28.1353 46.4309 27.584 46.4309H22.584V30.4309H27.584C28.1353 30.4309 28.584 30.8796 28.584 31.4309V45.4309ZM45.584 36.4309H47.584C48.1353 36.4309 48.584 36.8796 48.584 37.4309C48.584 37.9823 48.1353 38.4309 47.584 38.4309H45.584C45.032 38.4309 44.584 38.8789 44.584 39.4309C44.584 39.9829 45.032 40.4309 45.584 40.4309H47.584C48.1353 40.4309 48.584 40.8796 48.584 41.4309C48.584 41.9823 48.1353 42.4309 47.584 42.4309H45.584C45.032 42.4309 44.584 42.8789 44.584 43.4309C44.584 43.9829 45.032 44.4309 45.584 44.4309C46.1353 44.4309 46.584 44.8796 46.584 45.4309C46.584 45.9823 46.1353 46.4309 45.584 46.4309H37.2067C36.2373 46.4309 35.2793 46.2756 34.36 45.9689L30.584 44.7103V32.3363C32.1527 32.0383 33.688 31.0449 35.074 29.4189C36.4273 27.8309 37.5247 25.7256 38.0093 23.7863L38.3647 22.3643H38.584C39.6867 22.3643 40.584 23.2616 40.584 24.3643V25.3636C40.584 26.7063 40.164 29.2816 39.6267 30.4309H37.584C37.032 30.4309 36.584 30.8789 36.584 31.4309C36.584 31.9829 37.032 32.4309 37.584 32.4309H47.584C48.1353 32.4309 48.584 32.8796 48.584 33.4309C48.584 33.9823 48.1353 34.4309 47.584 34.4309H45.584C45.032 34.4309 44.584 34.8789 44.584 35.4309C44.584 35.9829 45.032 36.4309 45.584 36.4309Z" fill="black"/>
<path d="M25.584 44.4316C26.1363 44.4316 26.584 43.9839 26.584 43.4316C26.584 42.8794 26.1363 42.4316 25.584 42.4316C25.0317 42.4316 24.584 42.8794 24.584 43.4316C24.584 43.9839 25.0317 44.4316 25.584 44.4316Z" fill="black"/>
<path d="M39.584 14.2979C39.0317 14.2979 38.584 14.7456 38.584 15.2979V17.3645C38.584 17.9168 39.0317 18.3645 39.584 18.3645C40.1363 18.3645 40.584 17.9168 40.584 17.3645V15.2979C40.584 14.7456 40.1363 14.2979 39.584 14.2979Z" fill="black"/>
<path d="M35.341 18.7081L33.9268 17.2939C33.5364 16.9033 32.9032 16.9033 32.5126 17.2939C32.1221 17.6844 32.1221 18.3175 32.5126 18.7081L33.9268 20.1223C34.3173 20.5127 34.9506 20.5128 35.341 20.1223C35.7316 19.7317 35.7316 19.0986 35.341 18.7081Z" fill="black"/>
<path d="M46.6545 17.2939C46.264 16.9033 45.6308 16.9033 45.2403 17.2939L43.8261 18.708C43.4356 19.0985 43.4356 19.7317 43.8261 20.1222C44.2166 20.5127 44.8498 20.5128 45.2403 20.1223L46.6545 18.7081C47.045 18.3175 47.045 17.6844 46.6545 17.2939Z" fill="black"/>
</svg>
