<svg width="6" height="9" viewBox="0 0 6 9" fill="none" xmlns="http://www.w3.org/2000/svg">
<path d="M0.785156 4.34375C0.626953 4.50195 0.626953 4.76562 0.785156 4.92383L4.19531 8.35156C4.37109 8.50977 4.63477 8.50977 4.79297 8.35156L5.19727 7.94727C5.35547 7.78906 5.35547 7.52539 5.19727 7.34961L2.49023 4.625L5.19727 1.91797C5.35547 1.74219 5.35547 1.47852 5.19727 1.32031L4.79297 0.916016C4.63477 0.757812 4.37109 0.757812 4.19531 0.916016L0.785156 4.34375Z" fill="#040D5F"/>
</svg>
