<svg width="80" height="80" viewBox="0 0 80 80" fill="none" xmlns="http://www.w3.org/2000/svg">
<path d="M67.5801 48.1331L57.3798 45.8494L56.296 36.2943C56.2018 35.4534 55.542 34.79 54.7011 34.6994L45.3019 33.6373L44.1818 23.611C44.1238 23.1144 43.8664 22.6613 43.4641 22.3641C43.0653 22.0632 42.5615 21.9364 42.0649 22.0306L31.8138 23.843C31.1577 23.959 30.6213 24.4194 30.4074 25.0501L20.2905 55.3285L15.4658 60.1532L14.1826 61.4364C12.131 63.4879 11 66.221 11 69.1245C11 72.028 12.131 74.7612 14.1862 76.8128C16.2379 78.8681 18.971 79.9991 21.8745 79.9991C24.778 79.9991 27.5111 78.8681 29.5628 76.8128L30.846 75.5296L35.6707 70.705L65.949 60.588C66.5616 60.3814 67.0219 59.8631 67.1524 59.2287L68.9648 50.2609C69.1569 49.2968 68.5443 48.3506 67.5801 48.1331ZM44.508 37.1898L52.856 38.1359L53.8057 46.4875L31.0345 62.908L28.0875 59.961L44.508 37.1898ZM33.503 27.2215L40.7926 25.9347L41.7785 34.7793L25.4921 57.3655L23.9479 55.8214L33.503 27.2215ZM16.749 74.25C15.3788 72.8799 14.6248 71.0603 14.6248 69.1245C14.6248 67.1887 15.3788 65.3692 16.749 63.999L27 74.25C24.2597 76.9904 19.4894 76.9904 16.749 74.25ZM29.5628 71.6873L19.3118 61.4362L21.8745 58.8699L32.1292 69.1245L29.5628 71.6873ZM63.8031 57.4852L35.1777 67.0511L33.6335 65.5069L56.1256 49.2858L65.0572 51.2831L63.8031 57.4852Z" fill="url(#paint0_linear)"/>
<defs>
<linearGradient id="paint0_linear" x1="-1.01429" y1="51.7068" x2="68.4248" y2="51.7747" gradientUnits="userSpaceOnUse">
<stop stop-color="#EC0A15"/>
<stop offset="1" stop-color="#233BDB"/>
</linearGradient>
</defs>
</svg>
