<svg width="80" height="80" viewBox="0 0 80 80" fill="none" xmlns="http://www.w3.org/2000/svg">
<g clip-path="url(#clip0)">
<path d="M78.437 60.3441C77.3863 60.3441 76.8892 59.9923 76.1367 59.4595C75.2184 58.8093 74.0756 58.0004 72.0308 58.0004C69.986 58.0004 68.8431 58.8095 67.9249 59.4595C67.1725 59.9921 66.6753 60.3441 65.6246 60.3441C64.5738 60.3441 64.0767 59.9923 63.3242 59.4595C62.406 58.8093 61.2632 58.0004 59.2183 58.0004C57.1735 58.0004 56.0307 58.8095 55.1124 59.4595C54.36 59.9921 53.8629 60.3441 52.8121 60.3441C51.7613 60.3441 51.2643 59.9923 50.5118 59.4595C49.5935 58.8093 48.4507 58.0004 46.4058 58.0004C46.254 58.0004 46.1085 58.0062 45.9663 58.0148C45.9382 55.8232 46.0248 53.2959 46.4098 51.0948L56.0094 51.9309C58.5841 52.1534 60.8597 50.2389 61.0818 47.6642C61.1893 46.417 60.8049 45.2025 59.9989 44.2443C59.1932 43.2862 58.0622 42.6993 56.8164 42.5918L45.3063 41.5893C46.6683 40.1825 47.5091 38.2681 47.5091 36.1598C47.5091 31.852 44.0044 28.3473 39.6966 28.3473C35.3888 28.3473 31.8842 31.852 31.8842 36.1598C31.8842 37.7808 32.3807 39.2878 33.2292 40.5375L29.0562 40.174L30.6609 30.7756C30.8713 29.5425 30.589 28.3014 29.8659 27.2806C29.1428 26.26 28.0654 25.5819 26.8323 25.3716C24.2867 24.9366 21.8625 26.6547 21.4282 29.2L18.9673 43.6142C18.7482 44.8982 19.0806 46.2282 19.8793 47.2632C20.6782 48.2985 21.881 48.9576 23.1796 49.0714L30.4112 49.7012C30.179 52.5059 30.2734 55.7996 30.674 58.7006C30.221 58.941 29.8378 59.2117 29.4878 59.4596C28.7353 59.9923 28.2381 60.3443 27.1874 60.3443C26.1367 60.3443 25.6396 59.9924 24.8871 59.4596C23.9689 58.8095 22.826 58.0006 20.7812 58.0006C18.7364 58.0006 17.5936 58.8096 16.6753 59.4596C15.9228 59.9923 15.4256 60.3443 14.375 60.3443C13.3243 60.3443 12.8272 59.9924 12.0747 59.4596C11.1564 58.8095 10.0136 58.0006 7.96873 58.0006C5.92389 58.0006 4.78108 58.8096 3.8628 59.4596C3.11031 59.9923 2.61312 60.3443 1.5625 60.3443C0.69953 60.3443 0 61.0438 0 61.9068V78.3124C0 79.1754 0.69953 79.8749 1.5625 79.8749H78.4375C79.3003 79.8749 80 79.1754 80 78.3124V61.9066C79.9995 61.0437 79.2998 60.3441 78.437 60.3441ZM39.6965 31.4725C42.2812 31.4725 44.384 33.5753 44.384 36.16C44.384 38.7447 42.2812 40.8475 39.6965 40.8475C37.1118 40.8475 35.009 38.7447 35.009 36.16C35.009 33.5753 37.1118 31.4725 39.6965 31.4725ZM23.451 45.9582C23.014 45.92 22.624 45.7054 22.3529 45.3542C22.0821 45.0032 21.9737 44.5721 22.0473 44.1401L24.5082 29.7259C24.5782 29.3158 24.8039 28.9572 25.1434 28.7167C25.4831 28.4759 25.8962 28.3819 26.3062 28.4522C27.1531 28.5967 27.7246 29.4033 27.5801 30.25L25.6899 41.3206C25.6165 41.7511 25.7265 42.1928 25.9932 42.5384C26.2601 42.884 26.6595 43.1023 27.0945 43.1403L56.5463 45.7053C56.9619 45.7411 57.3386 45.9367 57.6072 46.2559C57.8758 46.5751 58.0039 46.9798 57.9682 47.3956C57.8939 48.2535 57.1354 48.891 56.2789 48.8175L45.3027 47.8615C44.5399 47.7954 43.8391 48.2929 43.6519 49.037C42.8723 52.1368 42.7779 56.0528 42.8629 59.0717C42.6637 59.2023 42.4774 59.3338 42.2998 59.4595C41.5474 59.9921 41.0502 60.3441 39.9995 60.3441C38.9487 60.3441 38.4516 59.9923 37.6991 59.4595C36.8024 58.8246 35.6891 58.0404 33.7332 58.0038C33.329 54.8737 33.3023 51.2067 33.6862 48.5031C33.7465 48.0782 33.6295 47.6473 33.3626 47.3114C33.0957 46.9754 32.7023 46.764 32.2748 46.7268L23.451 45.9582ZM3.12453 76.7499V72.6996C4.32905 72.4377 5.13358 71.8671 5.81374 71.3837C6.56171 70.8521 7.05577 70.5008 8.09858 70.5008C9.14139 70.5008 9.63545 70.8521 10.3834 71.3837C11.299 72.0346 12.4384 72.8446 14.4787 72.8446C16.519 72.8446 17.6586 72.0346 18.574 71.3837C19.322 70.8521 19.8162 70.5008 20.8589 70.5008C21.9015 70.5008 22.3957 70.8521 23.1437 71.3837C24.0593 72.0346 25.1989 72.8446 27.239 72.8446C29.2792 72.8446 30.4188 72.0346 31.3343 71.384C31.9595 70.9396 32.4112 70.6187 33.1568 70.5277C34.0134 70.4233 34.6231 69.6441 34.5185 68.7876C34.414 67.931 33.6357 67.3208 32.7784 67.4258C31.2467 67.6127 30.2915 68.2915 29.524 68.8369C28.7759 69.3687 28.2818 69.7197 27.2389 69.7197C26.196 69.7197 25.702 69.3685 24.9539 68.8368C24.0382 68.186 22.8989 67.376 20.8586 67.376C18.8182 67.376 17.6789 68.186 16.7632 68.8368C16.0153 69.3685 15.5211 69.7197 14.4783 69.7197C13.4356 69.7197 12.9415 69.3685 12.1934 68.8369C11.2778 68.186 10.1383 67.376 8.09811 67.376C6.05796 67.376 4.91827 68.186 4.0028 68.8369C3.68468 69.0632 3.41218 69.2562 3.12406 69.404V63.2904C4.24796 63.0154 5.01452 62.4727 5.66749 62.0104C6.41999 61.4777 6.91717 61.1257 7.9678 61.1257C9.01858 61.1257 9.51561 61.4776 10.2681 62.0104C11.1864 62.6605 12.329 63.4695 14.374 63.4695C16.419 63.4695 17.5617 62.6604 18.48 62.0104C19.2325 61.4777 19.7296 61.1257 20.7803 61.1257C21.8309 61.1257 22.3281 61.4776 23.0806 62.0104C23.9989 62.6605 25.1417 63.4695 27.1865 63.4695C29.2313 63.4695 30.3742 62.6604 31.2924 62.0104C32.0449 61.4777 32.5421 61.1257 33.5927 61.1257C34.6434 61.1257 35.1406 61.4776 35.8931 62.0104C36.8113 62.6605 37.9541 63.4695 39.999 63.4695C42.0438 63.4695 43.1868 62.6604 44.1051 62.0104C44.8574 61.4777 45.3546 61.1257 46.4054 61.1257C47.4562 61.1257 47.9532 61.4776 48.7057 62.0104C49.624 62.6605 50.7668 63.4695 52.8116 63.4695C54.8565 63.4695 55.9993 62.6604 56.9175 62.0104C57.6699 61.4777 58.1671 61.1257 59.2178 61.1257C60.2686 61.1257 60.7657 61.4776 61.5182 62.0104C62.4364 62.6605 63.5792 63.4695 65.6241 63.4695C67.6689 63.4695 68.8117 62.6604 69.73 62.0104C70.4824 61.4777 70.9795 61.1257 72.0303 61.1257C73.0811 61.1257 73.5781 61.4776 74.3306 62.0104C74.9838 62.4727 75.7503 63.0154 76.8741 63.2904V69.4038C76.5859 69.2562 76.3136 69.063 75.9955 68.8369C75.0798 68.186 73.9403 67.376 71.9 67.376C69.8597 67.376 68.7202 68.186 67.8046 68.8369C67.0566 69.3687 66.5625 69.7197 65.5199 69.7197C64.4771 69.7197 63.983 69.3685 63.235 68.8369C62.3194 68.186 61.1799 67.376 59.1396 67.376C57.0993 67.376 55.9599 68.186 55.0443 68.8368C54.2963 69.3685 53.8022 69.7197 52.7594 69.7197C51.7166 69.7197 51.2224 69.3685 50.4743 68.8369C49.7066 68.2913 48.7513 67.6123 47.2187 67.4257C46.3605 67.3218 45.583 67.9313 45.4787 68.7879C45.3744 69.6444 45.9841 70.4235 46.8408 70.5277C47.5868 70.6185 48.0387 70.9396 48.664 71.384C49.5796 72.0347 50.7191 72.8447 52.7594 72.8447C54.7997 72.8447 55.9393 72.0347 56.8549 71.3838C57.6027 70.8521 58.0969 70.501 59.1396 70.501C60.1824 70.501 60.6764 70.8522 61.4244 71.3838C62.34 72.0347 63.4796 72.8447 65.5199 72.8447C67.56 72.8447 68.6995 72.0347 69.6152 71.384C70.3631 70.8522 70.8572 70.501 71.9 70.501C72.9428 70.501 73.4369 70.8522 74.1849 71.384C74.865 71.8674 75.6695 72.438 76.8741 72.6999V76.7499H3.12453Z" fill="url(#paint0_linear)"/>
<path d="M39.9995 69.7195H39.9984C39.1354 69.7195 38.4365 70.4191 38.4365 71.282C38.4365 72.145 39.1365 72.8445 39.9995 72.8445C40.8625 72.8445 41.562 72.145 41.562 71.282C41.562 70.4191 40.8625 69.7195 39.9995 69.7195Z" fill="url(#paint1_linear)"/>
<path d="M57.5068 23.625C61.8147 23.625 65.3193 20.1203 65.3193 15.8125C65.3193 11.5047 61.8147 8 57.5068 8C53.199 8 49.6943 11.5047 49.6943 15.8125C49.6943 20.1203 53.199 23.625 57.5068 23.625ZM57.5068 11.125C60.0915 11.125 62.1943 13.2278 62.1943 15.8125C62.1943 18.3972 60.0915 20.5 57.5068 20.5C54.9222 20.5 52.8193 18.3972 52.8193 15.8125C52.8193 13.2278 54.9222 11.125 57.5068 11.125Z" fill="url(#paint2_linear)"/>
</g>
<defs>
<linearGradient id="paint0_linear" x1="-16.5714" y1="53.255" x2="79.2065" y2="53.3924" gradientUnits="userSpaceOnUse">
<stop stop-color="#EC0A15"/>
<stop offset="1" stop-color="#233BDB"/>
</linearGradient>
<linearGradient id="paint1_linear" x1="37.7891" y1="71.3201" x2="41.531" y2="71.3238" gradientUnits="userSpaceOnUse">
<stop stop-color="#EC0A15"/>
<stop offset="1" stop-color="#233BDB"/>
</linearGradient>
<linearGradient id="paint2_linear" x1="46.4577" y1="16.003" x2="65.1644" y2="16.0213" gradientUnits="userSpaceOnUse">
<stop stop-color="#EC0A15"/>
<stop offset="1" stop-color="#233BDB"/>
</linearGradient>
<clipPath id="clip0">
<rect width="80" height="80" fill="white"/>
</clipPath>
</defs>
</svg>
