<svg width="12" height="20" viewBox="0 0 12 20" fill="none" xmlns="http://www.w3.org/2000/svg">
<path d="M10.4258 19.1172L11.2852 18.3008C11.457 18.0859 11.457 17.7422 11.2852 17.5703L3.50781 9.75L11.2852 1.97266C11.457 1.80078 11.457 1.45703 11.2852 1.24219L10.4258 0.425781C10.2109 0.210938 9.91016 0.210938 9.69531 0.425781L0.671875 9.40625C0.5 9.62109 0.5 9.92188 0.671875 10.1367L9.69531 19.1172C9.91016 19.332 10.2109 19.332 10.4258 19.1172Z" fill="white"/>
</svg>
