<svg width="80" height="80" viewBox="0 0 80 80" fill="none" xmlns="http://www.w3.org/2000/svg">
<g clip-path="url(#clip0)">
<path d="M78.4377 60.4675C77.387 60.4675 76.8898 60.1156 76.1373 59.5828C75.6014 59.2034 74.9874 58.771 74.1638 58.4756L74.153 58.4419C74.8603 57.0291 75.4419 55.4911 75.8842 53.8403C76.01 53.3711 75.9103 52.8702 75.6145 52.4847C75.3188 52.0994 74.8606 51.8735 74.3748 51.8735H72.062L70.5503 47.1244C71.0967 46.7107 71.5486 46.1772 71.8736 45.5508C72.4484 44.4424 72.5574 43.1768 72.1803 41.9865C71.8031 40.7963 70.9852 39.8241 69.8767 39.2491C69.2469 38.9224 68.566 38.7466 67.8766 38.7249L65.3131 30.6716C67.3425 29.1335 67.772 26.2368 66.2613 24.1757C65.3789 22.9721 64.0255 22.3148 62.6383 22.2682L60.9225 16.8784L63.0732 15.1531C64.4778 14.0262 64.878 12.427 64.1435 10.8751L59.8785 1.86466C59.1878 0.404974 57.6421 -0.321587 56.2033 0.136068L52.1176 1.43653C50.6788 1.89466 49.8379 3.38122 50.1179 4.97121L51.8463 14.7896C52.1441 16.4803 53.3951 17.5538 55.1927 17.6615L57.945 17.8262L59.6594 23.2121L54.7121 26.8454C53.7896 26.4613 52.7788 26.2482 51.7188 26.2482C47.411 26.2482 43.9063 29.7529 43.9063 34.0607C43.9063 35.1449 44.1287 36.178 44.5296 37.1174C42.3157 40.7433 40.4338 46.7236 40.5341 51.8733H38.6248L37.1131 47.1244C37.6595 46.7107 38.1113 46.1771 38.4363 45.5508C39.0113 44.4424 39.1202 43.1768 38.743 41.9865C38.3659 40.7963 37.5479 39.8241 36.4395 39.2491C35.8095 38.9224 35.1287 38.7466 34.4392 38.7249L31.8757 30.6718C33.9051 29.1337 34.3346 26.237 32.8238 24.1759C32.0848 23.1676 30.9973 22.5074 29.7617 22.3171C29.5742 22.2882 29.3867 22.272 29.1999 22.2656L27.4851 16.8785L29.6357 15.1532C31.0404 14.0264 31.4406 12.4271 30.7062 10.8753L26.4412 1.86481C25.7506 0.40513 24.205 -0.321431 22.766 0.136224L18.6803 1.43685C17.2415 1.89497 16.4006 3.38137 16.6806 4.97137L18.409 14.7896C18.7067 16.4804 19.9576 17.554 21.7553 17.6617L24.5076 17.8263L26.222 23.2123L21.2746 26.8454C20.3521 26.4613 19.3414 26.2482 18.2814 26.2482C13.9736 26.2482 10.4689 29.7529 10.4689 34.0607C10.4689 35.1449 10.6912 36.178 11.0922 37.1174C8.87826 40.7435 6.99639 46.7236 7.09655 51.8733H5.62514C5.13936 51.8733 4.68124 52.0992 4.38546 52.4846C4.08968 52.87 3.99015 53.371 4.11577 53.8402C4.56015 55.4986 5.14858 57.0444 5.86718 58.4647C5.02811 58.7602 4.4053 59.1986 3.8628 59.5827C3.11031 60.1155 2.61312 60.4674 1.5625 60.4674C0.69953 60.4674 0 61.167 0 62.0299V78.4354C0 79.2983 0.69953 79.9979 1.5625 79.9979H78.4375C79.3005 79.9979 80 79.2983 80 78.4354V62.03C80.0001 61.1672 79.3006 60.4675 78.4377 60.4675ZM55.211 48.7221L56.091 49.4375C56.1074 49.4508 56.124 49.4638 56.1408 49.4764C57.6257 50.5872 59.5352 50.926 61.2536 50.3816L67.6549 48.3294L68.783 51.8735H55.2111V48.7221H55.211ZM69.2016 42.9305C69.3266 43.3249 69.2905 43.7446 69.0999 44.1119C68.9094 44.4793 68.5872 44.7504 68.1877 44.8769L60.3044 47.4043C59.623 47.6203 58.9489 47.4825 58.4346 47.23L61.1711 43.8644L67.2567 41.9218C67.6514 41.7966 68.0708 41.8327 68.4381 42.0233C68.8055 42.2138 69.0766 42.536 69.2016 42.9305ZM59.478 34.9596L62.6558 32.6258L64.8185 39.4197L60.7105 40.7311L58.3263 38.2218C58.9368 37.2558 59.3413 36.1482 59.478 34.9596ZM63.7411 26.0235C64.2482 26.7152 64.0978 27.6905 63.4052 28.1984L59.0605 31.389C58.6968 30.3927 58.1347 29.4918 57.424 28.7315L61.5672 25.6887C62.2591 25.1815 63.2342 25.3318 63.7411 26.0235ZM55.3794 14.5423C54.9718 14.5179 54.9597 14.4498 54.9241 14.2481L53.1957 4.42965C53.1921 4.4095 53.1904 4.39122 53.1897 4.37512L57.0272 3.15356C57.0361 3.16716 57.0452 3.18294 57.0539 3.20169L61.3189 12.2123C61.4068 12.3978 61.4361 12.4601 61.1177 12.7157L59.9068 13.6873L59.5764 12.6498C59.3147 11.8275 58.4363 11.3735 57.6136 11.6348C56.7913 11.8967 56.3369 12.7754 56.5986 13.5978L56.929 14.6353L55.3794 14.5423ZM51.7188 29.3734C54.3035 29.3734 56.4063 31.4762 56.4063 34.0608C56.4063 36.6457 54.3035 38.7485 51.7188 38.7485C49.1341 38.7485 47.0313 36.6457 47.0313 34.0608C47.0313 31.4762 49.1341 29.3734 51.7188 29.3734ZM46.5496 39.9116C47.9282 41.1311 49.738 41.8735 51.719 41.8735C53.369 41.8735 54.9 41.3579 56.1627 40.4815L58.1736 42.5979L55.9683 45.31L54.6344 44.2254C54.1666 43.8449 53.5218 43.7677 52.9774 44.0268C52.433 44.2857 52.0861 44.8349 52.0861 45.4377V51.8735H43.6623C43.5798 47.9471 44.8974 43.1622 46.5496 39.9116ZM69.7775 54.9985L70.7727 58.1247C70.7475 58.1675 70.7224 58.2103 70.6969 58.2528C69.4477 58.5067 68.6216 59.0902 67.9255 59.5828C67.173 60.1155 66.6758 60.4675 65.6252 60.4675C64.5744 60.4675 64.0774 60.1155 63.3249 59.5828C62.4067 58.9328 61.2639 58.1236 59.2189 58.1236C57.174 58.1236 56.0313 58.9328 55.113 59.5828C54.3605 60.1155 53.8633 60.4675 52.8127 60.4675C51.7621 60.4675 51.2649 60.1156 50.5124 59.5828C49.5943 58.9328 48.4515 58.1236 46.4065 58.1236C44.3616 58.1236 43.2188 58.9328 42.3005 59.5828C41.931 59.8444 41.6227 60.0622 41.2805 60.2163L39.6196 54.9985H69.7775ZM9.31998 58.2558C8.71483 57.2602 8.19186 56.1717 7.75811 54.9985H36.3401L37.8282 59.6734C37.7862 59.6438 37.7435 59.6136 37.6998 59.5827C36.7816 58.9327 35.6388 58.1235 33.5938 58.1235C31.5488 58.1235 30.4062 58.9327 29.4879 59.5827C28.7354 60.1153 28.2382 60.4674 27.1876 60.4674C26.137 60.4674 25.6398 60.1155 24.8873 59.5827C23.9692 58.9327 22.8264 58.1235 20.7814 58.1235C18.7365 58.1235 17.5937 58.9327 16.6754 59.5827C15.9229 60.1153 15.4258 60.4674 14.3751 60.4674C13.3245 60.4674 12.8273 60.1155 12.0748 59.5827C11.3819 59.0922 10.5603 58.5114 9.31998 58.2558ZM21.7736 51.8735V48.7221L22.6534 49.4375C22.6698 49.4508 22.6864 49.4638 22.7032 49.4764C24.1881 50.5871 26.0973 50.9258 27.8159 50.3816L34.2171 48.3294L35.3452 51.8735H21.7736ZM35.7641 42.9305C35.8891 43.3249 35.8531 43.7446 35.6624 44.1119C35.4718 44.4793 35.1498 44.7504 34.7502 44.8769L26.867 47.4043C26.1856 47.6202 25.5115 47.4827 24.997 47.23L27.7335 43.8644L33.8192 41.9218C34.2137 41.7966 34.6332 41.833 35.0006 42.0233C35.3681 42.2138 35.6391 42.536 35.7641 42.9305ZM26.0406 34.9596L29.2185 32.6258L31.3812 39.4197L27.2732 40.7311L24.8889 38.2218C25.4993 37.2558 25.9037 36.1482 26.0406 34.9596ZM30.3037 26.0235C30.8107 26.7152 30.6604 27.6905 29.9678 28.1984L25.6231 31.389C25.2593 30.3927 24.6973 29.4918 23.9865 28.7315L28.1299 25.6887C28.4651 25.4429 28.8757 25.3424 29.2862 25.4057C29.6967 25.4691 30.0581 25.6884 30.3037 26.0235ZM21.9418 14.5423C21.5342 14.5179 21.5221 14.4499 21.4867 14.2481L19.7582 4.42965C19.7546 4.4095 19.7529 4.39122 19.7523 4.37512L23.5898 3.15356C23.5987 3.16716 23.6078 3.18294 23.6165 3.20169L27.8815 12.2123C27.9693 12.3976 27.9989 12.4601 27.6803 12.7157L26.4693 13.6873L26.139 12.6496C25.8774 11.8273 24.9987 11.3734 24.1762 11.6346C23.3539 11.8965 22.8995 12.7753 23.1612 13.5976L23.4915 14.6351L21.9418 14.5423ZM18.2814 29.3734C20.8661 29.3734 22.9689 31.4762 22.9689 34.0608C22.9689 36.6457 20.8661 38.7485 18.2814 38.7485C15.6967 38.7485 13.5939 36.6457 13.5939 34.0608C13.5939 31.4762 15.6967 29.3734 18.2814 29.3734ZM13.112 39.9116C14.4906 41.1311 16.3004 41.8735 18.2814 41.8735C19.9314 41.8735 21.4625 41.3579 22.7251 40.4815L24.736 42.5979L22.5307 45.31L21.1968 44.2254C20.7289 43.8449 20.0842 43.7677 19.5398 44.0268C18.9954 44.2858 18.6486 44.8349 18.6486 45.4377V51.8735H10.2247C10.1423 47.9471 11.46 43.1622 13.112 39.9116ZM3.12515 76.8731V72.8228C4.32968 72.5609 5.13421 71.9903 5.81436 71.5069C6.56233 70.9753 7.05639 70.6241 8.0992 70.6241C9.14201 70.6241 9.63607 70.9753 10.384 71.5069C11.2997 72.1578 12.439 72.9678 14.4793 72.9678C16.5197 72.9678 17.6592 72.1576 18.5746 71.5069C19.3226 70.9753 19.8168 70.6241 20.8595 70.6241C21.9021 70.6241 22.3964 70.9753 23.1443 71.5069C24.06 72.1578 25.1995 72.9678 27.2396 72.9678C29.2798 72.9678 30.4195 72.1578 31.3351 71.507C31.9603 71.0626 32.412 70.7417 33.1576 70.6508C34.0141 70.5462 34.6238 69.767 34.5193 68.9105C34.4148 68.0539 33.6348 67.4426 32.7792 67.5487C31.2474 67.7355 30.2923 68.4144 29.5248 68.9598C28.7767 69.4914 28.2824 69.8426 27.2396 69.8426C26.197 69.8426 25.7028 69.4914 24.9548 68.9598C24.0392 68.3089 22.8996 67.4989 20.8595 67.4989C18.8193 67.4989 17.6798 68.3089 16.7642 68.9598C16.0162 69.4914 15.522 69.8426 14.4792 69.8426C13.4365 69.8426 12.9425 69.4914 12.1944 68.9598C11.2787 68.3091 10.1392 67.4989 8.09905 67.4989C6.05889 67.4989 4.91921 68.3091 4.00374 68.9598C3.68562 69.1859 3.41312 69.3791 3.12499 69.5267V63.4133C4.2489 63.1383 5.01546 62.5956 5.66843 62.1333C6.42092 61.6005 6.91811 61.2486 7.96873 61.2486C9.01936 61.2486 9.51654 61.6005 10.269 62.1333C11.1872 62.7833 12.33 63.5925 14.375 63.5925C16.42 63.5925 17.5628 62.7833 18.4809 62.1333C19.2334 61.6005 19.7306 61.2486 20.7812 61.2486C21.832 61.2486 22.329 61.6005 23.0815 62.1333C23.9996 62.7833 25.1425 63.5925 27.1874 63.5925C29.2324 63.5925 30.3751 62.7833 31.2934 62.1333C32.0459 61.6005 32.5431 61.2486 33.5937 61.2486C34.6443 61.2486 35.1415 61.6005 35.894 62.1333C36.8121 62.7833 37.9549 63.5925 39.9999 63.5925C42.0448 63.5925 43.1876 62.7833 44.1059 62.1333C44.8583 61.6005 45.3555 61.2486 46.4062 61.2486C47.4569 61.2486 47.954 61.6005 48.7065 62.1333C49.6246 62.7833 50.7674 63.5925 52.8124 63.5925C54.8574 63.5925 56 62.7833 56.9183 62.1333C57.6708 61.6005 58.168 61.2486 59.2186 61.2486C60.2693 61.2486 60.7664 61.6005 61.5189 62.1333C62.4371 62.7833 63.5799 63.5925 65.6249 63.5925C67.6697 63.5925 68.8125 62.7833 69.7308 62.1333C70.4833 61.6005 70.9805 61.2486 72.0311 61.2486C73.0819 61.2486 73.5789 61.6005 74.3314 62.1333C74.9844 62.5956 75.7509 63.1384 76.8748 63.4133V69.5267C76.5867 69.3791 76.3144 69.1859 75.9961 68.9598C75.0805 68.3089 73.9411 67.4989 71.9008 67.4989C69.8605 67.4989 68.721 68.3089 67.8055 68.9598C67.0575 69.4914 66.5633 69.8426 65.5207 69.8426C64.478 69.8426 63.9838 69.4914 63.2358 68.9598C62.3202 68.3091 61.1808 67.4989 59.1405 67.4989C57.1002 67.4989 55.9607 68.3091 55.0452 68.9598C54.2972 69.4914 53.8032 69.8426 52.7604 69.8426C51.7176 69.8426 51.2233 69.4914 50.4752 68.9598C49.7074 68.4142 48.7521 67.7351 47.2194 67.5486C46.3623 67.445 45.5838 68.0542 45.4796 68.9109C45.3754 69.7675 45.9852 70.5464 46.8418 70.6508C47.5877 70.7415 48.0396 71.0626 48.6647 71.507C49.5804 72.1578 50.7201 72.9678 52.7602 72.9678C54.8005 72.9678 55.94 72.1576 56.8555 71.5069C57.6035 70.9753 58.0975 70.6241 59.1404 70.6241C60.183 70.6241 60.6772 70.9753 61.4252 71.5069C62.3408 72.1576 63.4802 72.9678 65.5205 72.9678C67.5608 72.9678 68.7003 72.1578 69.6158 71.5069C70.3638 70.9753 70.858 70.6241 71.9006 70.6241C72.9433 70.6241 73.4375 70.9753 74.1855 71.5069C74.8656 71.9903 75.6702 72.5609 76.8747 72.8228V76.8731H3.12515Z" fill="url(#paint0_linear)"/>
<path d="M40.0005 69.8423H39.9994C39.1364 69.8423 38.4375 70.542 38.4375 71.4048C38.4375 72.2676 39.1375 72.9673 40.0005 72.9673C40.8634 72.9673 41.563 72.2676 41.563 71.4048C41.563 70.542 40.8634 69.8423 40.0005 69.8423Z" fill="url(#paint1_linear)"/>
</g>
<defs>
<linearGradient id="paint0_linear" x1="-16.5714" y1="40.9745" x2="79.2066" y2="41.0682" gradientUnits="userSpaceOnUse">
<stop stop-color="#EC0A15"/>
<stop offset="1" stop-color="#233BDB"/>
</linearGradient>
<linearGradient id="paint1_linear" x1="37.7901" y1="71.4429" x2="41.532" y2="71.4466" gradientUnits="userSpaceOnUse">
<stop stop-color="#EC0A15"/>
<stop offset="1" stop-color="#233BDB"/>
</linearGradient>
<clipPath id="clip0">
<rect width="80" height="80" fill="white"/>
</clipPath>
</defs>
</svg>
