<svg width="16" height="11" viewBox="0 0 16 11" fill="none" xmlns="http://www.w3.org/2000/svg">
<path d="M15.6406 5.36719C14.1641 2.46875 11.2109 0.5 7.875 0.5C4.51172 0.5 1.55859 2.46875 0.0820312 5.36719C0.0273438 5.47656 0 5.61328 0 5.75C0 5.91406 0.0273438 6.05078 0.0820312 6.16016C1.55859 9.05859 4.51172 11 7.875 11C11.2109 11 14.1641 9.05859 15.6406 6.16016C15.6953 6.05078 15.7227 5.91406 15.7227 5.77734C15.7227 5.61328 15.6953 5.47656 15.6406 5.36719ZM7.875 9.6875C5.6875 9.6875 3.9375 7.9375 3.9375 5.75C3.9375 3.58984 5.6875 1.8125 7.875 1.8125C10.0352 1.8125 11.8125 3.58984 11.8125 5.75V5.77734C11.8125 7.9375 10.0352 9.71484 7.875 9.71484V9.6875ZM7.875 3.125C7.62891 3.15234 7.38281 3.17969 7.16406 3.23438C7.32812 3.45312 7.41016 3.72656 7.41016 4.02734C7.41016 4.73828 6.83594 5.3125 6.125 5.3125C5.82422 5.3125 5.55078 5.23047 5.33203 5.06641C5.27734 5.28516 5.25 5.53125 5.25 5.75C5.25 7.19922 6.42578 8.375 7.875 8.375C9.32422 8.375 10.5 7.19922 10.5 5.75C10.5 4.30078 9.32422 3.15234 7.875 3.15234V3.125Z" fill="url(#paint0_linear)"/>
<defs>
<linearGradient id="paint0_linear" x1="-3.31429" y1="6.17072" x2="15.8413" y2="6.19214" gradientUnits="userSpaceOnUse">
<stop stop-color="#EC0A15"/>
<stop offset="1" stop-color="#233BDB"/>
</linearGradient>
</defs>
</svg>
