<svg width="14" height="15" viewBox="0 0 14 15" fill="none" xmlns="http://www.w3.org/2000/svg">
<path d="M0.21875 7.25C0.21875 10.9961 3.25391 14.0312 7 14.0312C10.7461 14.0312 13.7812 10.9961 13.7812 7.25C13.7812 3.50391 10.7461 0.46875 7 0.46875C3.25391 0.46875 0.21875 3.50391 0.21875 7.25ZM12.4688 7.25C12.4688 10.2852 10.0078 12.7188 7 12.7188C3.96484 12.7188 1.53125 10.2852 1.53125 7.25C1.53125 4.24219 3.96484 1.78125 7 1.78125C10.0078 1.78125 12.4688 4.24219 12.4688 7.25ZM9.51562 7.49609C9.65234 7.35938 9.65234 7.16797 9.51562 7.03125L6.15234 3.66797C6.04297 3.53125 5.82422 3.53125 5.6875 3.66797L5.08594 4.29688C4.94922 4.40625 4.94922 4.625 5.08594 4.76172L7.57422 7.25L5.08594 9.76562C4.94922 9.90234 4.94922 10.0938 5.08594 10.2305L5.6875 10.8594C5.82422 10.9688 6.04297 10.9688 6.15234 10.8594L9.51562 7.49609Z" fill="white"/>
</svg>
