<svg width="32" height="32" viewBox="0 0 32 32" fill="none" xmlns="http://www.w3.org/2000/svg">
<circle cx="16" cy="16" r="16" fill="#00A2ED"/>
<path d="M23.1367 12.5938C23.8398 12.0664 24.4727 11.4336 24.9648 10.6953C24.332 10.9766 23.5938 11.1875 22.8555 11.2578C23.6289 10.8008 24.1914 10.0977 24.4727 9.21875C23.7695 9.64062 22.9609 9.95703 22.1523 10.1328C21.4492 9.39453 20.5 8.97266 19.4453 8.97266C17.4062 8.97266 15.7539 10.625 15.7539 12.6641C15.7539 12.9453 15.7891 13.2266 15.8594 13.5078C12.8008 13.332 10.0586 11.8555 8.23047 9.64062C7.91406 10.168 7.73828 10.8008 7.73828 11.5039C7.73828 12.7695 8.37109 13.8945 9.39062 14.5625C8.79297 14.5273 8.19531 14.3867 7.70312 14.1055V14.1406C7.70312 15.9336 8.96875 17.4102 10.6562 17.7617C10.375 17.832 10.0234 17.9023 9.70703 17.9023C9.46094 17.9023 9.25 17.8672 9.00391 17.832C9.46094 19.3086 10.832 20.3633 12.4492 20.3984C11.1836 21.3828 9.60156 21.9805 7.87891 21.9805C7.5625 21.9805 7.28125 21.9453 7 21.9102C8.61719 22.9648 10.5508 23.5625 12.6602 23.5625C19.4453 23.5625 23.1367 17.9727 23.1367 13.0859C23.1367 12.9102 23.1367 12.7695 23.1367 12.5938Z" fill="white"/>
</svg>
