[
    {
        "repository": "https://gitlab.com/alex-tu-cc/plainbox-provider-checkbox.git",
        "branch": "dev"
    },
    {
        "repository": "https://gitlab.com/canonical-mainstream/plainbox-provider-pc-sanity.git",
        "branch": "master"
    }
]
