package io.axcelinno.policyquotecalc.quote;

rule "StartRuleflow"
salience 100

when
then
    System.out.println("StartRuleflow - ON");
    kcontext.getKnowledgeRuntime().startProcess("policyquotecalculationprocess");
end

